{"text_format":"1","workbook":"xlsx","n_sheets":6,"sheets":["Provincial uniformisé","Provincial non uniformisé","Charte des codes de poste","Pilotage charte de postes","PilotageDonnees","ParametresConnexion"],"not_rendered":{"charts":0,"images":1,"macros":1,"external_links":0,"defined_names":2,"comments":0,"pivot_tables":0},"unopened":[],"bounds":{"document_bytes":16777216,"sheet_cells":100000,"rows_first":2000,"rows_last":500,"rows_between":2000,"halvings":0,"cell_chars":16384,"cell_head_chars":4096},"cells_cut":0,"cells_raw":0,"read":"whole","date_system":"1900"}

{"sheet":"Provincial uniformisé","index":0,"n_rows":55,"n_cols":11,"rows_kept":55,"cut":false,"hidden":false,"merged":[[1,0,2,10],[4,0,5,2],[4,3,4,6],[4,7,4,10]]}
[]
["DONNÉES DE L'ÉVALUATION FONCIÈRE"]
[]
[]
["CATÉGORIE (Utilisation)",null,null,"VALEURS IMPOSABLES",null,null,null,"VALEURS NON IMPOSABLES"]
[null,null,null,"NOMBRE","TERRAINS","BÂTIMENTS","IMMEUBLES","NOMBRE","TERRAINS","BÂTIMENTS","IMMEUBLES"]
["1-- TOTALE DE LA CATÉGORIE RÉSIDENTIELLE",null,null,{"$f":"IFERROR(VLOOKUP('Pilotage charte de postes'!D6*10+1,Tableau_Lancer_la_requête_à_partir_de_apps_U_B11_1[],2,FALSE),\"\")","v":2808549},{"$f":"IFERROR(VLOOKUP('Pilotage charte de postes'!E6*10+1,Tableau_Lancer_la_requête_à_partir_de_apps_U_B11_1[],2,FALSE),\"\")","v":329109301432},{"$f":"IFERROR(VLOOKUP('Pilotage charte de postes'!F6*10+1,Tableau_Lancer_la_requête_à_partir_de_apps_U_B11_1[],2,FALSE),\"\")","v":690740840557},{"$f":"IFERROR(VLOOKUP('Pilotage charte de postes'!H6*10+1,Tableau_Lancer_la_requête_à_partir_de_apps_U_B11_1[],2,FALSE),\"\")","v":1019850141989},{"$f":"IFERROR(VLOOKUP('Pilotage charte de postes'!I6*10+1,Tableau_Lancer_la_requête_à_partir_de_apps_U_B11_1[],2,FALSE),\"\")","v":4917},{"$f":"IFERROR(VLOOKUP('Pilotage charte de postes'!J6*10+1,Tableau_Lancer_la_requête_à_partir_de_apps_U_B11_1[],2,FALSE),\"\")","v":2399813449},{"$f":"IFERROR(VLOOKUP('Pilotage charte de postes'!K6*10+1,Tableau_Lancer_la_requête_à_partir_de_apps_U_B11_1[],2,FALSE),\"\")","v":4626487222},{"$f":"IFERROR(VLOOKUP('Pilotage charte de postes'!L6*10+1,Tableau_Lancer_la_requête_à_partir_de_apps_U_B11_1[],2,FALSE),\"\")","v":7026300672}]
["   10 -- Totale Logements",null,null,{"$f":"IFERROR(VLOOKUP('Pilotage charte de postes'!D7*10+1,Tableau_Lancer_la_requête_à_partir_de_apps_U_B11_1[],2,FALSE),\"\")","v":2548288},{"$f":"IFERROR(VLOOKUP('Pilotage charte de postes'!E7*10+1,Tableau_Lancer_la_requête_à_partir_de_apps_U_B11_1[],2,FALSE),\"\")","v":312589828499},{"$f":"IFERROR(VLOOKUP('Pilotage charte de postes'!F7*10+1,Tableau_Lancer_la_requête_à_partir_de_apps_U_B11_1[],2,FALSE),\"\")","v":655982778223},{"$f":"IFERROR(VLOOKUP('Pilotage charte de postes'!H7*10+1,Tableau_Lancer_la_requête_à_partir_de_apps_U_B11_1[],2,FALSE),\"\")","v":968572606721},{"$f":"IFERROR(VLOOKUP('Pilotage charte de postes'!I7*10+1,Tableau_Lancer_la_requête_à_partir_de_apps_U_B11_1[],2,FALSE),\"\")","v":1706},{"$f":"IFERROR(VLOOKUP('Pilotage charte de postes'!J7*10+1,Tableau_Lancer_la_requête_à_partir_de_apps_U_B11_1[],2,FALSE),\"\")","v":334399409},{"$f":"IFERROR(VLOOKUP('Pilotage charte de postes'!K7*10+1,Tableau_Lancer_la_requête_à_partir_de_apps_U_B11_1[],2,FALSE),\"\")","v":782383337},{"$f":"IFERROR(VLOOKUP('Pilotage charte de postes'!L7*10+1,Tableau_Lancer_la_requête_à_partir_de_apps_U_B11_1[],2,FALSE),\"\")","v":1116782747}]
[null,"1 logement « condominium »",null,{"$f":"IFERROR(VLOOKUP('Pilotage charte de postes'!D8*10+1,Tableau_Lancer_la_requête_à_partir_de_apps_U_B11_1[],2,FALSE),\"\")","v":366527},{"$f":"IFERROR(VLOOKUP('Pilotage charte de postes'!E8*10+1,Tableau_Lancer_la_requête_à_partir_de_apps_U_B11_1[],2,FALSE),\"\")","v":23000151149},{"$f":"IFERROR(VLOOKUP('Pilotage charte de postes'!F8*10+1,Tableau_Lancer_la_requête_à_partir_de_apps_U_B11_1[],2,FALSE),\"\")","v":99136414100},{"$f":"IFERROR(VLOOKUP('Pilotage charte de postes'!H8*10+1,Tableau_Lancer_la_requête_à_partir_de_apps_U_B11_1[],2,FALSE),\"\")","v":122136565249},{"$f":"IFERROR(VLOOKUP('Pilotage charte de postes'!I8*10+1,Tableau_Lancer_la_requête_à_partir_de_apps_U_B11_1[],2,FALSE),\"\")","v":6},{"$f":"IFERROR(VLOOKUP('Pilotage charte de postes'!J8*10+1,Tableau_Lancer_la_requête_à_partir_de_apps_U_B11_1[],2,FALSE),\"\")","v":516470},{"$f":"IFERROR(VLOOKUP('Pilotage charte de postes'!K8*10+1,Tableau_Lancer_la_requête_à_partir_de_apps_U_B11_1[],2,FALSE),\"\")","v":1528085},{"$f":"IFERROR(VLOOKUP('Pilotage charte de postes'!L8*10+1,Tableau_Lancer_la_requête_à_partir_de_apps_U_B11_1[],2,FALSE),\"\")","v":2044555}]
[null,"1 logement « sauf condominium »",null,{"$f":"IFERROR(VLOOKUP('Pilotage charte de postes'!D9*10+1,Tableau_Lancer_la_requête_à_partir_de_apps_U_B11_1[],2,FALSE),\"\")","v":1799690},{"$f":"IFERROR(VLOOKUP('Pilotage charte de postes'!E9*10+1,Tableau_Lancer_la_requête_à_partir_de_apps_U_B11_1[],2,FALSE),\"\")","v":213301050708},{"$f":"IFERROR(VLOOKUP('Pilotage charte de postes'!F9*10+1,Tableau_Lancer_la_requête_à_partir_de_apps_U_B11_1[],2,FALSE),\"\")","v":375768417277},{"$f":"IFERROR(VLOOKUP('Pilotage charte de postes'!H9*10+1,Tableau_Lancer_la_requête_à_partir_de_apps_U_B11_1[],2,FALSE),\"\")","v":589069467985},{"$f":"IFERROR(VLOOKUP('Pilotage charte de postes'!I9*10+1,Tableau_Lancer_la_requête_à_partir_de_apps_U_B11_1[],2,FALSE),\"\")","v":1337},{"$f":"IFERROR(VLOOKUP('Pilotage charte de postes'!J9*10+1,Tableau_Lancer_la_requête_à_partir_de_apps_U_B11_1[],2,FALSE),\"\")","v":133998147},{"$f":"IFERROR(VLOOKUP('Pilotage charte de postes'!K9*10+1,Tableau_Lancer_la_requête_à_partir_de_apps_U_B11_1[],2,FALSE),\"\")","v":231612422},{"$f":"IFERROR(VLOOKUP('Pilotage charte de postes'!L9*10+1,Tableau_Lancer_la_requête_à_partir_de_apps_U_B11_1[],2,FALSE),\"\")","v":365610569}]
{"$rows_left_out":46}
{"sheet":"Provincial non uniformisé","index":1,"n_rows":54,"n_cols":11,"rows_kept":54,"cut":false,"hidden":false,"merged":[[0,0,1,10],[3,0,4,2],[3,3,3,6],[3,7,3,10]]}
["DONNÉES DE L'ÉVALUATION FONCIÈRE"]
[]
[]
["CATÉGORIE (Utilisation)",null,null,"VALEURS IMPOSABLES",null,null,null,"VALEURS NON IMPOSABLES"]
[null,null,null,"NOMBRE","TERRAINS","BÂTIMENTS","IMMEUBLES","NOMBRE","TERRAINS","BÂTIMENTS","IMMEUBLES"]
["1-- TOTALE DE LA CATÉGORIE RÉSIDENTIELLE",null,null,{"$f":"IFERROR(VLOOKUP('Pilotage charte de postes'!D6*10,Tableau_Lancer_la_requête_à_partir_de_apps_U_B11_1[],2,FALSE),\"\")","v":2808549},{"$f":"IFERROR(VLOOKUP('Pilotage charte de postes'!E6*10,Tableau_Lancer_la_requête_à_partir_de_apps_U_B11_1[],2,FALSE),\"\")","v":305575602674},{"$f":"IFERROR(VLOOKUP('Pilotage charte de postes'!F6*10,Tableau_Lancer_la_requête_à_partir_de_apps_U_B11_1[],2,FALSE),\"\")","v":641272674481},{"$f":"IFERROR(VLOOKUP('Pilotage charte de postes'!H6*10,Tableau_Lancer_la_requête_à_partir_de_apps_U_B11_1[],2,FALSE),\"\")","v":946848277155},{"$f":"IFERROR(VLOOKUP('Pilotage charte de postes'!I6*10,Tableau_Lancer_la_requête_à_partir_de_apps_U_B11_1[],2,FALSE),\"\")","v":4917},{"$f":"IFERROR(VLOOKUP('Pilotage charte de postes'!J6*10,Tableau_Lancer_la_requête_à_partir_de_apps_U_B11_1[],2,FALSE),\"\")","v":2174345876},{"$f":"IFERROR(VLOOKUP('Pilotage charte de postes'!K6*10,Tableau_Lancer_la_requête_à_partir_de_apps_U_B11_1[],2,FALSE),\"\")","v":4274915803},{"$f":"IFERROR(VLOOKUP('Pilotage charte de postes'!L6*10,Tableau_Lancer_la_requête_à_partir_de_apps_U_B11_1[],2,FALSE),\"\")","v":6449261679}]
["   10 -- Totale Logements",null,null,{"$f":"IFERROR(VLOOKUP('Pilotage charte de postes'!D7*10,Tableau_Lancer_la_requête_à_partir_de_apps_U_B11_1[],2,FALSE),\"\")","v":2548288},{"$f":"IFERROR(VLOOKUP('Pilotage charte de postes'!E7*10,Tableau_Lancer_la_requête_à_partir_de_apps_U_B11_1[],2,FALSE),\"\")","v":289963053060},{"$f":"IFERROR(VLOOKUP('Pilotage charte de postes'!F7*10,Tableau_Lancer_la_requête_à_partir_de_apps_U_B11_1[],2,FALSE),\"\")","v":608420562426},{"$f":"IFERROR(VLOOKUP('Pilotage charte de postes'!H7*10,Tableau_Lancer_la_requête_à_partir_de_apps_U_B11_1[],2,FALSE),\"\")","v":898383615486},{"$f":"IFERROR(VLOOKUP('Pilotage charte de postes'!I7*10,Tableau_Lancer_la_requête_à_partir_de_apps_U_B11_1[],2,FALSE),\"\")","v":1706},{"$f":"IFERROR(VLOOKUP('Pilotage charte de postes'!J7*10,Tableau_Lancer_la_requête_à_partir_de_apps_U_B11_1[],2,FALSE),\"\")","v":303712363},{"$f":"IFERROR(VLOOKUP('Pilotage charte de postes'!K7*10,Tableau_Lancer_la_requête_à_partir_de_apps_U_B11_1[],2,FALSE),\"\")","v":712375770},{"$f":"IFERROR(VLOOKUP('Pilotage charte de postes'!L7*10,Tableau_Lancer_la_requête_à_partir_de_apps_U_B11_1[],2,FALSE),\"\")","v":1016088133}]
[null,"1 logement « condominium »",null,{"$f":"IFERROR(VLOOKUP('Pilotage charte de postes'!D8*10,Tableau_Lancer_la_requête_à_partir_de_apps_U_B11_1[],2,FALSE),\"\")","v":366527},{"$f":"IFERROR(VLOOKUP('Pilotage charte de postes'!E8*10,Tableau_Lancer_la_requête_à_partir_de_apps_U_B11_1[],2,FALSE),\"\")","v":20778586207},{"$f":"IFERROR(VLOOKUP('Pilotage charte de postes'!F8*10,Tableau_Lancer_la_requête_à_partir_de_apps_U_B11_1[],2,FALSE),\"\")","v":89343496100},{"$f":"IFERROR(VLOOKUP('Pilotage charte de postes'!H8*10,Tableau_Lancer_la_requête_à_partir_de_apps_U_B11_1[],2,FALSE),\"\")","v":110122082307},{"$f":"IFERROR(VLOOKUP('Pilotage charte de postes'!I8*10,Tableau_Lancer_la_requête_à_partir_de_apps_U_B11_1[],2,FALSE),\"\")","v":6},{"$f":"IFERROR(VLOOKUP('Pilotage charte de postes'!J8*10,Tableau_Lancer_la_requête_à_partir_de_apps_U_B11_1[],2,FALSE),\"\")","v":472600},{"$f":"IFERROR(VLOOKUP('Pilotage charte de postes'!K8*10,Tableau_Lancer_la_requête_à_partir_de_apps_U_B11_1[],2,FALSE),\"\")","v":1418700},{"$f":"IFERROR(VLOOKUP('Pilotage charte de postes'!L8*10,Tableau_Lancer_la_requête_à_partir_de_apps_U_B11_1[],2,FALSE),\"\")","v":1891300}]
[null,"1 logement « sauf condominium »",null,{"$f":"IFERROR(VLOOKUP('Pilotage charte de postes'!D9*10,Tableau_Lancer_la_requête_à_partir_de_apps_U_B11_1[],2,FALSE),\"\")","v":1799690},{"$f":"IFERROR(VLOOKUP('Pilotage charte de postes'!E9*10,Tableau_Lancer_la_requête_à_partir_de_apps_U_B11_1[],2,FALSE),\"\")","v":200577050316},{"$f":"IFERROR(VLOOKUP('Pilotage charte de postes'!F9*10,Tableau_Lancer_la_requête_à_partir_de_apps_U_B11_1[],2,FALSE),\"\")","v":355220069643},{"$f":"IFERROR(VLOOKUP('Pilotage charte de postes'!H9*10,Tableau_Lancer_la_requête_à_partir_de_apps_U_B11_1[],2,FALSE),\"\")","v":555797119959},{"$f":"IFERROR(VLOOKUP('Pilotage charte de postes'!I9*10,Tableau_Lancer_la_requête_à_partir_de_apps_U_B11_1[],2,FALSE),\"\")","v":1337},{"$f":"IFERROR(VLOOKUP('Pilotage charte de postes'!J9*10,Tableau_Lancer_la_requête_à_partir_de_apps_U_B11_1[],2,FALSE),\"\")","v":123480000},{"$f":"IFERROR(VLOOKUP('Pilotage charte de postes'!K9*10,Tableau_Lancer_la_requête_à_partir_de_apps_U_B11_1[],2,FALSE),\"\")","v":215025650},{"$f":"IFERROR(VLOOKUP('Pilotage charte de postes'!L9*10,Tableau_Lancer_la_requête_à_partir_de_apps_U_B11_1[],2,FALSE),\"\")","v":338505650}]
[null,"2 logements",null,{"$f":"IFERROR(VLOOKUP('Pilotage charte de postes'!D10*10,Tableau_Lancer_la_requête_à_partir_de_apps_U_B11_1[],2,FALSE),\"\")","v":190439},{"$f":"IFERROR(VLOOKUP('Pilotage charte de postes'!E10*10,Tableau_Lancer_la_requête_à_partir_de_apps_U_B11_1[],2,FALSE),\"\")","v":24334846600},{"$f":"IFERROR(VLOOKUP('Pilotage charte de postes'!F10*10,Tableau_Lancer_la_requête_à_partir_de_apps_U_B11_1[],2,FALSE),\"\")","v":45786671002},{"$f":"IFERROR(VLOOKUP('Pilotage charte de postes'!H10*10,Tableau_Lancer_la_requête_à_partir_de_apps_U_B11_1[],2,FALSE),\"\")","v":70121517602},{"$f":"IFERROR(VLOOKUP('Pilotage charte de postes'!I10*10,Tableau_Lancer_la_requête_à_partir_de_apps_U_B11_1[],2,FALSE),\"\")","v":188},{"$f":"IFERROR(VLOOKUP('Pilotage charte de postes'!J10*10,Tableau_Lancer_la_requête_à_partir_de_apps_U_B11_1[],2,FALSE),\"\")","v":34437600},{"$f":"IFERROR(VLOOKUP('Pilotage charte de postes'!K10*10,Tableau_Lancer_la_requête_à_partir_de_apps_U_B11_1[],2,FALSE),\"\")","v":55059400},{"$f":"IFERROR(VLOOKUP('Pilotage charte de postes'!L10*10,Tableau_Lancer_la_requête_à_partir_de_apps_U_B11_1[],2,FALSE),\"\")","v":89497000}]
{"$rows_left_out":45}
{"sheet":"Charte des codes de poste","index":2,"n_rows":54,"n_cols":11,"rows_kept":54,"cut":false,"hidden":false,"merged":[[0,0,1,10],[3,0,4,2],[3,3,3,6],[3,7,3,10]]}
["CHARTE DES DONNÉES DE L'ÉVALUATION FONCIÈRE"]
[]
[]
["CATÉGORIE (Utilisation)",null,null,"VALEURS IMPOSABLES",null,null,null,"VALEURS NON IMPOSABLES"]
[null,null,null,"NOMBRE","TERRAINS","BÂTIMENTS","IMMEUBLES","NOMBRE","TERRAINS","BÂTIMENTS","IMMEUBLES"]
["1-- TOTALE DE LA CATÉGORIE RÉSIDENTIELLE",null,null,300001,300002,300003,300004,300005,300006,300007,300008]
["   10 -- Totale Logements",null,null,300010,300011,300012,300013,300014,300015,300016,300017]
[null,"1 logement « condominium »",null,300019,300020,300021,300022,300023,300024,300025,300026]
[null,"1 logement « sauf condominium »",null,300028,300029,300030,300031,300032,300033,300034,300035]
[null,"2 logements",null,300037,300038,300039,300040,300041,300042,300043,300044]
{"$rows_left_out":45}
{"sheet":"Pilotage charte de postes","index":3,"n_rows":54,"n_cols":12,"rows_kept":54,"cut":false,"hidden":true,"merged":[[53,5,53,6],[42,5,42,6],[43,5,43,6],[44,5,44,6],[45,5,45,6],[46,5,46,6],[47,5,47,6],[48,5,48,6],[49,5,49,6],[50,5,50,6],[51,5,51,6],[52,5,52,6],[41,5,41,6],[30,5,30,6],[31,5,31,6],[32,5,32,6],[33,5,33,6],[34,5,34,6],[35,5,35,6],[36,5,36,6],[37,5,37,6],[38,5,38,6],[39,5,39,6],[40,5,40,6],[29,5,29,6],[18,5,18,6],[19,5,19,6],[20,5,20,6],[21,5,21,6],[22,5,22,6],[23,5,23,6],[24,5,24,6],[25,5,25,6],[26,5,26,6],[27,5,27,6],[28,5,28,6],[17,5,17,6],[6,5,6,6],[7,5,7,6],[8,5,8,6],[9,5,9,6],[10,5,10,6],[11,5,11,6],[12,5,12,6],[13,5,13,6],[14,5,14,6],[15,5,15,6],[16,5,16,6],[5,5,5,6],[0,0,1,11],[3,0,4,2],[3,3,3,7],[3,8,3,11],[4,5,4,6]]}
["CHARTE DES DONNÉES DE L'ÉVALUATION FONCIÈRE"]
[]
[]
["CATÉGORIE (Utilisation)",null,null,"VALEURS IMPOSABLES",null,null,null,null,"VALEURS NON IMPOSABLES"]
[null,null,null,"NOMBRE","TERRAINS","BÂTIMENTS",null,"IMMEUBLES","NOMBRE","TERRAINS","BÂTIMENTS","IMMEUBLES"]
["1-- TOTALE DE LA CATÉGORIE RÉSIDENTIELLE",null,null,300001,300002,300003,null,300004,300005,300006,300007,300008]
["   10 -- Totale Logements",null,null,300010,300011,300012,null,300013,300014,300015,300016,300017]
[null,"1 logement « condominium »",null,300019,300020,300021,null,300022,300023,300024,300025,300026]
[null,"1 logement « sauf condominium »",null,300028,300029,300030,null,300031,300032,300033,300034,300035]
[null,"2 logements",null,300037,300038,300039,null,300040,300041,300042,300043,300044]
{"$rows_left_out":45}
{"sheet":"PilotageDonnees","index":4,"n_rows":875,"n_cols":2,"rows_kept":875,"cut":false,"hidden":true,"merged":[]}
["code","valeur"]
[3000010,2808549]
[3000011,2808549]
[3000020,305575602674]
[3000021,329109301432]
[3000030,641272674481]
[3000031,690740840557]
[3000040,946848277155]
[3000041,1019850141989]
[3000050,4917]
{"$rows_left_out":866}
{"sheet":"ParametresConnexion","index":5,"n_rows":7,"n_cols":11,"rows_kept":7,"cut":false,"hidden":true,"merged":[]}
["Pallier","Serveur","Port","NomBD","NomDSN","URLDeBase","Colonne1","Colonne2","Colonne3","Colonne4","Colonne5"]
["inactif","inactif","inactif","inactif","inactif","inactif","inactif","inactif","inactif","inactif","inactif"]
[]
[]
[]
["anneeEnCours"]
["2022"]