{"text_format":"1","workbook":"xlsx","n_sheets":9,"sheets":["Instructions","Sommaire du rôle","Détermination assiette","Scénario-taux variés","Balises-Taux","Taux_max_balises","Comparaison des scénarios","Résultats du scénario","Balises taux_max_balises"],"not_rendered":{"charts":10,"images":1,"macros":1,"external_links":4,"defined_names":33,"comments":7,"pivot_tables":0},"unopened":[],"bounds":{"document_bytes":16777216,"sheet_cells":100000,"rows_first":2000,"rows_last":500,"rows_between":2000,"halvings":0,"cell_chars":16384,"cell_head_chars":4096},"cells_cut":0,"cells_raw":0,"read":"whole","date_system":"1900"}

{"sheet":"Instructions","index":0,"n_rows":33,"n_cols":4,"rows_kept":33,"cut":false,"hidden":false,"merged":[[32,0,32,1],[16,3,16,4],[0,0,0,3],[30,0,30,3],[31,0,31,3],[1,0,1,3]]}
["CALCUL DES TAUX VARIÉS (TAXE FONCIÈRE GÉNÉRALE) — ÉTAPES À SUIVRE"]
["VERSION DU 2024-05-08"]
["Étape","Onglet","Instructions /Description"]
[1,"Sommaire du rôle","•","Cliquer sur le bouton « Réinitialisation » (s'il y a lieu);"]
[null,null,"•","Inscrire les assiettes dans les cases appropriées."]
[]
[2,"Scénario  — Taux variés","•","Cliquer sur le bouton « Réinitialisation » (s'il y a lieu);"]
[null,null,"•","Inscrire le nom de la municipalité, l'année, la population et le montant total de la taxe foncière générale prévu dans le budget de la municipalité."]
[null,null,"•","Inscrire les multiples du taux de base retenus afin de calculer les taux variés;"]
[null,null,"•","Il est à noter : le bouton « Scénario taux unique »  calcule par défaut un taux unique pour l'ensemble des assiettes, alors que le bouton « Scénario avec le maximum des balises » calcule des taux variés selon le maximum des balises prévues dans la Loi sur la fiscalité municipale."]
[null,null,"•","L'utilisateur doit s'assurer que les multiples du taux de base qu'il a retenus respectent les balises prévues dans la Loi. Dans l'éventualité où l'un des multiples retenus ne respecte pas ces balises, les recettes de taxes ne seront pas calculées. Pour plus de précisions sur les balises, référez-vous à l'onglet :"]
[null,null,null,"Balises-Taux"]
[]
[]
[3,"Comparaison des scénarios","•","Pour comparer un « scénario avec taux variés » avec un « scénario avec taux unique » et un « scénario avec les taux variés établis selon le maximum des balises autorisé par la Loi », référez-vous à cet onglet."]
[]
[4,"Résultats du scénario","•","Une fois le scénario choisi, les taux variés de la taxe foncière générale calculés pour chacune des assiettes foncières d'imposition à l'aide du simulateur apparaissent dans cet onglet."]
[]
["AUTRES ONGLETS"]
["Le simulateur contient des onglets intermédiaires qui sont masqués et qui servent à calculer certains résultats. Ils peuvent être affichés au besoin."]
[]
[null,"Onglet",null,"Description"]
[null,"Détermination de l'assiette","•","Cet onglet calcule automatiquement la partie imposable des assiettes assujetties à la taxe foncière en fonction de la mixité non résidentielle."]
[]
[null,"Taux_max_balises","•","Cet onglet calcule automatiquement un scénario utilisant des taux variés selon le maximum des balises pour les assiettes non résidentielles, industrielles, des six logements ou plus et des terrains vagues desservis, ainsi que pour l'assiette agricole sans le plafond d'imposition des terres agricoles. "]
[null,null,"•","Il permet de comparer le  scénario «Taux_max_balises »  avec le scénario de l'onglet « Scénario_taux »."]
[]
[null,"Balises-Taux_max_balises","•","Cet onglet calcule les balises provenant du fichier « Taux_max_balises »."]
[]
["NOTES"]
["Les calculs des montants et des taux provenant du simulateur ne sont pas arrondis. Des montants arrondis et des taux arrondis pourraient demander un rajustement."]
["Les calculs effectués par le simulateur ne constituent pas un avis juridique ni un avis officiel du MAMH et ils ne remplacent pas la lecture de la Loi."]
["Il est possible de modifier les graphiques. "]

{"sheet":"Sommaire du rôle","index":1,"n_rows":84,"n_cols":27,"rows_kept":84,"cut":false,"hidden":false,"merged":[[80,15,81,15],[80,10,81,10],[80,11,81,11],[80,12,81,12],[80,13,81,13],[80,14,81,14],[80,5,81,5],[80,6,81,6],[80,7,81,7],[80,8,81,8],[80,9,81,9],[74,10,75,10],[74,11,75,11],[74,12,75,12],[74,13,75,13],[74,14,75,14],[74,5,75,5],[74,6,75,6],[74,7,75,7],[74,8,75,8],[74,9,75,9],[74,15,75,15],[71,14,71,15],[26,7,26,8],[26,9,26,10],[26,11,26,12],[26,13,26,14],[26,15,26,16],[65,23,65,24],[65,25,65,26],[68,14,68,15],[69,14,69,15],[70,14,70,15],[65,13,65,14],[65,15,65,16],[65,17,65,18],[65,19,65,20],[65,21,65,22],[27,7,27,8],[27,9,27,10],[27,11,27,12],[27,13,27,14],[27,17,27,18],[27,19,27,20],[27,21,27,22],[48,23,48,24],[48,25,48,26],[50,1,50,4],[50,5,50,6],[50,7,50,8],[50,9,50,10],[50,11,50,12],[50,13,50,14],[50,15,50,16],[50,17,50,18],[50,19,50,20],[50,21,50,22],[50,23,50,24],[50,25,50,26],[48,7,48,8],[48,9,48,10],[48,11,48,12],[48,13,48,14],[48,15,48,16],[49,23,49,24],[49,25,49,26],[25,15,25,16],[25,17,25,18],[25,19,25,20],[25,21,25,22],[51,1,51,4],[65,5,65,6],[65,7,65,8],[65,9,65,10],[65,11,65,12],[49,7,49,8],[49,9,49,10],[49,11,49,12],[49,13,49,14],[49,15,49,16],[49,17,49,18],[49,19,49,20],[49,21,49,22],[16,14,16,16],[21,11,21,12],[5,11,5,12],[25,23,25,24],[27,23,27,24],[25,25,25,26],[27,25,27,26],[5,13,5,14],[45,5,45,6],[45,7,45,8],[45,9,45,10],[45,11,45,12],[45,13,45,14],[45,15,45,16],[45,17,45,18],[45,19,45,20],[45,21,45,22],[45,23,45,24],[45,25,45,26],[26,17,26,18],[25,7,25,8],[25,9,25,10],[25,11,25,12],[25,13,25,14],[21,15,21,16],[26,19,26,20],[26,21,26,22],[19,11,19,12],[68,11,69,13],[70,11,70,13],[1,1,1,16],[3,7,3,8],[3,5,3,6],[3,9,3,10],[3,11,3,12],[3,13,3,14],[3,1,3,4],[2,15,2,16],[4,5,4,6],[4,7,4,8],[4,9,4,10],[2,5,2,6],[2,7,2,8],[2,9,2,10],[4,15,4,16],[3,15,3,16],[18,11,18,13],[16,11,17,13],[71,11,71,13],[6,11,15,11],[22,11,22,12],[25,1,26,4],[27,1,27,4],[28,1,28,4],[27,5,27,6],[24,1,24,26],[26,23,26,24],[26,25,26,26],[68,5,69,6],[68,7,69,10],[70,5,70,6],[71,5,71,6],[21,8,21,10],[70,7,70,10],[71,7,71,10],[22,15,22,16],[27,15,27,16],[47,1,47,26],[48,1,49,4],[48,17,48,18],[48,19,48,20],[48,21,48,22]]}
[]
[null,"  ASSIETTES D'APPLICATION DES TAUX DE LA TAXE FONCIÈRE GÉNÉRALE 9"]
[null,"TAUX APPLICABLES",null,null,null,"TAUX NON RÉSIDENTIEL",null,"TAUX INDUSTRIEL (CLASSE 2)",null,"TAUX IND. (SAUF CL.1 ET 2)",null,"TAUX AGRICOLE",null,"TAUX FORESTIER",null,"TAUX CATÉGORIE RÉSIDUELLE"]
[null,"NOMBRE DE SECTEURS",null,null,null,null,null,null,null,null,null,null,null,null,null,null,null,{"$f":"IF(OR(F4>1,H4>1,J4>1,L4>1,N4>1,P4>1),\"UTILISER LE SIMULATEUR POUR LA TAXATION DE SECTEUR\",\"-\")","v":"-"}]
[null,"CLASSE NON RÉSIDENTIELLE ET",null,null,null,"VAL. NR À 100 % ET IND. CL. 2 À 50 %",null,"VALEUR À 50 %",null,"VALEUR À 100 %",null,"VALEURS À 100 % IMPOSABLES",null,"VALEURS À 100 % IMPOSABLES",null,"VALEUR À 100 %"]
[null,"POURCENTAGE DE TAXATION",null,null,null,"  IMPOSABLES","COMPENSABLES","  IMPOSABLES","COMPENSABLES","  IMPOSABLES","COMPENSABLES",270604300,null,50000000,null,"  IMPOSABLES","COMPENSABLES"]
[null," 1A",":     0,1 %",null,901,76534150,0,null,null,null,null,null,null,null,"99,9 % ",76534150,0]
[null," 1B",":     0,5 %",null,902,34712370,0,null,null,null,null,null,null,null,"99,5 % ",34712370,0]
[null," 1C",":     1 %",null,903,4894450,0,null,null,null,null,null,null,null,"99 % ",4894450,0]
[null," 2",":     3 %",null,904,23616670,0,null,null,605900,null,null,null,null,"97 % ",23616670,0]
[null," 3",":     6 %",null,905,44153450,0,null,null,181400,null,null,null,null,"94 % ",44153450,0]
[null," 4",":     12 %",null,906,60256460,0,null,null,215700,null,null,null,null,"88 % ",60256460,0]
[null," 5",":     22 %",null,907,38643990,0,null,null,null,null,null,null,null,"78 % ",38643990,0]
[null," 6",":     40 %",null,908,38532890,0,290100,null,2421200,null,null,null,null,"60 % ",38532890,0]
[null," 7",":     60 %",null,909,39569365,72376370,350350,null,354000,null,null,null,null,"40 % ",39569365,72376370]
[null," 8",":     85 %",null,910,22323070,211592260,null,null,1875900,null,null,null,null,"15 % ",22323070,211592260]
[null," 9",":     100 %",null,911,3177900,0,null,null,null,null,"TAUX TERRAINS VAGUES \nDESSERVIS"]
[null," 10",":     100 %",null,912,1155755205,61905690,10515650,null,225704400,2325200,null,null,null,null,8068032861,2100780]
[null," 11",":  Cours de triage 100 %",null,913,null,null,null,null,null,null,"VALEURS À 100 %"]
[null," 12",":  CHSLD 20 %",null,914,13938200,null,null,null,null,null,"  IMPOSABLES",null,"COMPENSABLES","80 % ",{"$f":"F20","v":13938200}]
[null," 13",":  Cours de triage 40 %",null,915,null,"CFIL (chemin de fer d'intérêt local)",null,null,null,null,null,null,null,"60 % ",{"$f":"F21","v":0}]
[null," APPLICATION DU TNR QUAND TTVD",null,null,916,5228300,null,null,"(TTVD − TAUX DE BASE) x ",null,null,{"$f":"F22","v":5228300},null,{"$f":"G22","v":0}]
[null," ASSIETTES D'APPLICATION ",null,null,917,{"$f":"F71+F72","v":1529652563.0999999},null,null,{"$f":"H71+H72","v":241701840},null,"(TTVD) x ",76716400,null,58400,null,{"$f":"O71+O72","v":8447691867.8999996}]
[]
[null,"ASSIETTES D'APPLICATION DES TAUX RELATIFS AUX SOUS-CATÉGORIES DES IMMEUBLES NON RÉSIDENTIELS (si applicables)"]
[null,"DÉNOMINATION DE LA SOUS-CATÉGORIE",null,null,null,"TAUX SOUS-CATÉGORIE DE RÉFÉRENCE",null,"TAUX SOUS-CATÉGORIE 1",null,"TAUX SOUS-CATÉGORIE 2",null,"TAUX SOUS-CATÉGORIE 3",null,"TAUX SOUS-CATÉGORIE 4",null,"TAUX SOUS-CATÉGORIE 5",null,"TAUX SOUS-CATÉGORIE 6",null,"TAUX SOUS-CATÉGORIE 7",null,"TAUX SOUS-CATÉGORIE 8",null,"TAUX SOUS-CATÉGORIE 9",null,"TAUX SOUS-CATÉGORIE 10"]
[null,null,null,null,null,null,null,"snr1",null,"snr2",null,"snr3",null,"snr4",null,"snr5",null,"snr6",null,"snr7",null,"snr8",null,"snr9",null,"snr10"]
[null,"NOMBRE DE SECTEURS"]
[null,"POURCENTAGE DE TAXATION",null,null,null,"  IMPOSABLES","COMPENSABLES","  IMPOSABLES","COMPENSABLES","  IMPOSABLES","COMPENSABLES","  IMPOSABLES","COMPENSABLES","  IMPOSABLES","COMPENSABLES","  IMPOSABLES","COMPENSABLES","  IMPOSABLES","COMPENSABLES","  IMPOSABLES","COMPENSABLES","  IMPOSABLES","COMPENSABLES","  IMPOSABLES","COMPENSABLES","  IMPOSABLES","COMPENSABLES"]
[null," 1A","     0,1 %",null,{"$f":"E22+1","v":917},6957650,null,6957650,null,6957650,null,6957650,null,6957650,null,6957650,null,6957650,null,6957650,null,6957650,null,6957650,null,6957650]
[null," 1B","     0,5 %",null,{"$f":"E30+1","v":918},3155670,null,3155670,null,3155670,null,3155670,null,3155670,null,3155670,null,3155670,null,3155670,null,3155670,null,3155670,null,3155670]
[null," 1C","     1 %",null,919,444950,null,444950,null,444950,null,444950,null,444950,null,444950,null,444950,null,444950,null,444950,null,444950,null,444950]
[null," 2","     3 %",null,920,2146970,null,2146970,null,2146970,null,2146970,null,2146970,null,2146970,null,2146970,null,2146970,null,2146970,null,2146970,null,2146970]
[null," 3","     6 %",null,921,4013950,null,4013950,null,4013950,null,4013950,null,4013950,null,4013950,null,4013950,null,4013950,null,4013950,null,4013950,null,4013950]
[null," 4","     12 %",null,922,5477860,null,5477860,null,5477860,null,5477860,null,5477860,null,5477860,null,5477860,null,5477860,null,5477860,null,5477860,null,5477860]
[null," 5","     22 %",null,923,3513090,null,3513090,null,3513090,null,3513090,null,3513090,null,3513090,null,3513090,null,3513090,null,3513090,null,3513090,null,3513090]
[null," 6","     40 %",null,924,3502990,null,3502990,null,3502990,null,3502990,null,3502990,null,3502990,null,3502990,null,3502990,null,3502990,null,3502990,null,3502990]
[null," 7","     60 %",null,925,3597215,6579670,3597215,6579670,3597215,6579670,3597215,6579670,3597215,6579670,3597215,6579670,3597215,6579670,3597215,6579670,3597215,6579670,3597215,6579670,3597215,6579670]
[null," 8","     85 %",null,926,2029370,19235660,2029370,19235660,2029370,19235660,2029370,19235660,2029370,19235660,2029370,19235660,2029370,19235660,2029370,19235660,2029370,19235660,2029370,19235660,2029370,19235660]
[null," 9","     100 %",null,927,288900,null,288900,null,288900,null,288900,null,288900,null,288900,null,288900,null,288900,null,288900,null,288900,null,288900]
[null," 10","     100 %",null,928,105068655,5627790,105068655,5627790,105068655,5627790,105068655,5627790,105068655,5627790,105068655,5627790,105068655,5627790,105068655,5627790,105068655,5627790,105068655,5627790,105068655,5627790]
[null," 11","  Cours de triage 100 %",null,929]
[null," 12","  CHSLD 20 %",null,930,13938200]
[null," 13","  Cours de triage 40 %",null,931,null,"CFIL"]
[null," APPLICATION DU TNR QUAND TTVD",null,null,932,5228300]
[null," ASSIETTES D'APPLICATION ",null,null,933,{"$f":"F77+F78","v":146346542.09999999},null,{"$f":"G77+G78","v":138330602.09999999},null,{"$f":"H77+H78","v":138330602.09999999},null,{"$f":"I77+I78","v":138330602.09999999},null,{"$f":"J77+J78","v":138330602.09999999},null,{"$f":"K77+K78","v":138330602.09999999},null,{"$f":"L77+L78","v":138330602.09999999},null,{"$f":"M77+M78","v":138330602.09999999},null,{"$f":"N77+N78","v":138330602.09999999},null,{"$f":"O77+O78","v":138330602.09999999},null,{"$f":"P77+P78","v":138330602.09999999}]
[]
[null,"ASSIETTES D'APPLICATION DES TAUX RELATIFS AUX SOUS-CATÉGORIES DES IMMEUBLES  RÉSIDENTIELS (si applicables)"]
[null,"DÉNOMINATION DE LA SOUS-CATÉGORIE",null,null,null,"TAUX SOUS-CATÉGORIE RÉSIDUELLE",null,"TAUX SOUS-CATÉGORIE 1",null,"TAUX SOUS-CATÉGORIE 2",null,"TAUX SOUS-CATÉGORIE 3",null,"TAUX SOUS-CATÉGORIE 4",null,"TAUX SOUS-CATÉGORIE 5",null,"TAUX SOUS-CATÉGORIE 6",null,"TAUX SOUS-CATÉGORIE 7",null,"TAUX SOUS-CATÉGORIE 8",null,"TAUX SOUS-CATÉGORIE 9",null,"TAUX SOUS-CATÉGORIE 10"]
[null,null,null,null,null,null,null,"sr1",null,"sr2",null,"sr3",null,"sr4",null,"sr5",null,"sr6",null,"sr7",null,"sr8",null,"sr9",null,"sr10"]
[null,"NOMBRE DE SECTEURS"]
[null,"POURCENTAGE DE TAXATION",null,null,null,"  IMPOSABLES","COMPENSABLES","  IMPOSABLES","COMPENSABLES","  IMPOSABLES","COMPENSABLES","  IMPOSABLES","COMPENSABLES","  IMPOSABLES","COMPENSABLES","  IMPOSABLES","COMPENSABLES","  IMPOSABLES","COMPENSABLES","  IMPOSABLES","COMPENSABLES","  IMPOSABLES","COMPENSABLES","  IMPOSABLES","COMPENSABLES","  IMPOSABLES","COMPENSABLES"]
[null," 1A","99,9 % ",null,935,6957650,null,6957650,null,6957650,null,6957650,null,6957650,null,6957650,null,6957650,null,6957650,null,6957650,null,6957650,null,6957650]
[null," 1B","99,5 % ",null,{"$f":"E53+1","v":936},3155670,null,3155670,null,3155670,null,3155670,null,3155670,null,3155670,null,3155670,null,3155670,null,3155670,null,3155670,null,3155670]
[null," 1C","99 % ",null,937,444950,null,444950,null,444950,null,444950,null,444950,null,444950,null,444950,null,444950,null,444950,null,444950,null,444950]
[null," 2","97 % ",null,938,2146970,null,2146970,null,2146970,null,2146970,null,2146970,null,2146970,null,2146970,null,2146970,null,2146970,null,2146970,null,2146970]
[null," 3","94 % ",null,939,4013950,null,4013950,null,4013950,null,4013950,null,4013950,null,4013950,null,4013950,null,4013950,null,4013950,null,4013950,null,4013950]
[null," 4","88 % ",null,940,5477860,null,5477860,null,5477860,null,5477860,null,5477860,null,5477860,null,5477860,null,5477860,null,5477860,null,5477860,null,5477860]
[null," 5","78 % ",null,941,3513090,null,3513090,null,3513090,null,3513090,null,3513090,null,3513090,null,3513090,null,3513090,null,3513090,null,3513090,null,3513090]
[null," 6","60 % ",null,942,3502990,null,3502990,null,3502990,null,3502990,null,3502990,null,3502990,null,3502990,null,3502990,null,3502990,null,3502990,null,3502990]
[null," 7","40 % ",null,943,3597215,6579670,3597215,6579670,3597215,6579670,3597215,6579670,3597215,6579670,3597215,6579670,3597215,6579670,3597215,6579670,3597215,6579670,3597215,6579670,3597215,6579670]
[null," 8","15 % ",null,944,2029370,19235660,2029370,19235660,2029370,19235660,2029370,19235660,2029370,19235660,2029370,19235660,2029370,19235660,2029370,19235660,2029370,19235660,2029370,19235660,2029370,19235660]
[null," 9","100% immeubles sans partie non résidentielle",null,945,733457532.81818187,190980,733457532.81818187,190980,733457532.81818187,190980,733457532.81818187,190980,733457532.81818187,190980,733457532.81818187,190980,733457532.81818187,190980,733457532.81818187,190980,733457532.81818187,190980,733457532.81818187,190980,733457532.81818187,190980]
[null," 12","  CHSLD 80 %",null,946,13938200]
[null," 13","  Cours de triage 60 %",null,947]
[null," ASSIETTES D'APPLICATION ",null,null,948,{"$f":"F83+F84","v":778108860.71818185},null,{"$f":"G83+G84","v":766958300.71818185},null,{"$f":"H83+H84","v":766958300.71818185},null,{"$f":"I83+I84","v":766958300.71818185},null,{"$f":"J83+J84","v":766958300.71818185},null,{"$f":"K83+K84","v":766958300.71818185},null,{"$f":"L83+L84","v":766958300.71818185},null,{"$f":"M83+M84","v":766958300.71818185},null,{"$f":"N83+N84","v":766958300.71818185},null,{"$f":"O83+O84","v":766958300.71818185},null,{"$f":"P83+P84","v":766958300.71818185}]
[]
[]
[null,null,null,null,null,"TAUX NON RÉSIDENTIEL",null,"TAUX INDUSTRIEL ",null,null,null,"TAUX TERRAINS VAGUES \nDESSERVIS",null,null,"TAUX CATÉGORIE RÉSIDUELLE (TAUX DE BASE)"]
[]
[null,null,"Assiette imposable",null,null,{"$f":"'Détermination assiette'!G23","v":1244467630.0999999},null,{"$f":"'Détermination assiette'!G41+'Détermination assiette'!G59","v":239376640},null,null,null,{"$f":"L23","v":76716400},null,null,{"$f":"'Détermination assiette'!G78","v":8384901700.8999996}]
[null,null,"Assiette compensable",null,null,{"$f":"'Détermination assiette'!H23","v":285184933},null,{"$f":"'Détermination assiette'!H41+'Détermination assiette'!H59","v":2325200},null,null,null,{"$f":"N23","v":58400},null,null,{"$f":"'Détermination assiette'!H78","v":62790167}]
[]
[null,"Sous-catégorie des immeubles non résidentiels"]
[null,null,null,null,null,"TAUX SOUS-CATÉGORIE DE RÉFÉRENCE","Sous-catégorie 1","Sous-catégorie 2","Sous-catégorie 3","Sous-catégorie 4","Sous-catégorie 5","Sous-catégorie 6","Sous-catégorie 7","Sous-catégorie 8","Sous-catégorie 9","Sous-catégorie 10"]
[]
[null,null,"Assiette imposable",null,null,{"$f":"'Détermination assiette'!G100","v":120420639.09999999},{"$f":"'Détermination assiette'!G122","v":112404699.09999999},{"$f":"'Détermination assiette'!R122","v":112404699.09999999},{"$f":"'Détermination assiette'!AC122","v":112404699.09999999},{"$f":"'Détermination assiette'!AN122","v":112404699.09999999},{"$f":"'Détermination assiette'!AY122","v":112404699.09999999},{"$f":"'Détermination assiette'!BJ122","v":112404699.09999999},{"$f":"'Détermination assiette'!BU122","v":112404699.09999999},{"$f":"'Détermination assiette'!CF122","v":112404699.09999999},{"$f":"'Détermination assiette'!CQ122","v":112404699.09999999},{"$f":"'Détermination assiette'!DB122","v":112404699.09999999}]
[null,null,"Assiette compensable",null,null,{"$f":"'Détermination assiette'!H100","v":25925903},{"$f":"'Détermination assiette'!H122","v":25925903},{"$f":"'Détermination assiette'!S122","v":25925903},{"$f":"'Détermination assiette'!AD122","v":25925903},{"$f":"'Détermination assiette'!AO122","v":25925903},{"$f":"'Détermination assiette'!AZ122","v":25925903},{"$f":"'Détermination assiette'!BK122","v":25925903},{"$f":"'Détermination assiette'!BV122","v":25925903},{"$f":"'Détermination assiette'!CG122","v":25925903},{"$f":"'Détermination assiette'!CR122","v":25925903},{"$f":"'Détermination assiette'!DC122","v":25925903}]
[]
[null,"Sous-catégorie des immeubles résidentiels"]
[null,null,null,null,null,"TAUX SOUS-CATÉGORIE RÉSIDUELLE","Sous-catégorie 1","Sous-catégorie 2","Sous-catégorie 3","Sous-catégorie 4","Sous-catégorie 5","Sous-catégorie 6","Sous-catégorie 7","Sous-catégorie 8","Sous-catégorie 9","Sous-catégorie 10"]
[]
[null,null,"Assiette imposable",null,null,{"$f":"'Détermination assiette'!G141","v":772400663.71818185},{"$f":"'Détermination assiette'!G160","v":761250103.71818185},{"$f":"'Détermination assiette'!R160","v":761250103.71818185},{"$f":"'Détermination assiette'!AC160","v":761250103.71818185},{"$f":"'Détermination assiette'!AN160","v":761250103.71818185},{"$f":"'Détermination assiette'!AY160","v":761250103.71818185},{"$f":"'Détermination assiette'!BJ160","v":761250103.71818185},{"$f":"'Détermination assiette'!BU160","v":761250103.71818185},{"$f":"'Détermination assiette'!CF160","v":761250103.71818185},{"$f":"'Détermination assiette'!CQ160","v":761250103.71818185},{"$f":"'Détermination assiette'!DB160","v":761250103.71818185}]
[null,null,"Assiette compensable",null,null,{"$f":"'Détermination assiette'!H141","v":5708197},{"$f":"'Détermination assiette'!H160","v":5708197},{"$f":"'Détermination assiette'!S160","v":5708197},{"$f":"'Détermination assiette'!AD160","v":5708197},{"$f":"'Détermination assiette'!AO160","v":5708197},{"$f":"'Détermination assiette'!AZ160","v":5708197},{"$f":"'Détermination assiette'!BK160","v":5708197},{"$f":"'Détermination assiette'!BV160","v":5708197},{"$f":"'Détermination assiette'!CG160","v":5708197},{"$f":"'Détermination assiette'!CR160","v":5708197},{"$f":"'Détermination assiette'!DC160","v":5708197}]

{"sheet":"Détermination assiette","index":2,"n_rows":160,"n_cols":109,"rows_kept":160,"cut":false,"hidden":true,"merged":[[143,89,144,89],[143,91,143,92],[143,99,144,99],[143,100,144,100],[143,102,143,103],[143,69,143,70],[143,77,144,77],[143,78,144,78],[143,80,143,81],[143,88,144,88],[143,55,144,55],[143,56,144,56],[143,58,143,59],[143,66,144,66],[143,67,144,67],[143,34,144,34],[143,36,143,37],[143,44,144,44],[143,45,144,45],[143,47,143,48],[143,14,143,15],[143,22,144,22],[143,23,144,23],[143,25,143,26],[143,33,144,33],[143,0,144,0],[143,1,144,1],[143,3,143,4],[143,11,144,11],[143,12,144,12],[102,100,103,100],[102,102,102,103],[124,0,125,0],[124,1,125,1],[124,3,124,4],[102,80,102,81],[102,88,103,88],[102,89,103,89],[102,91,102,92],[102,99,103,99],[102,66,103,66],[102,67,103,67],[102,69,102,70],[102,77,103,77],[102,78,103,78],[102,45,103,45],[102,47,102,48],[102,55,103,55],[102,56,103,56],[102,58,102,59],[102,25,102,26],[102,33,103,33],[102,34,103,34],[102,36,102,37],[102,44,103,44],[102,11,103,11],[102,12,103,12],[102,14,102,15],[102,22,103,22],[102,23,103,23],[80,0,81,0],[80,1,81,1],[80,3,80,4],[102,0,103,0],[102,1,103,1],[102,3,102,4],[61,0,62,0],[61,1,62,1],[61,3,61,4],[3,3,3,4],[3,0,4,0],[3,1,4,1],[25,0,26,0],[25,1,26,1],[25,3,25,4],[43,0,44,0],[43,1,44,1],[43,3,43,4]]}
["DÉTERMINATION DES ASSIETTES "]
[]
["ASSIETTE AU TAUX NON RÉSIDENTIEL"]
["Classe non résidentielle","Pourcentage de taxation",null,"VAL. NR À 100 % ET IND. CL. 2 À 50 %"]
[null,null,null,"  Imposables","Compensables",null,"Imposables pondérées","Compensables pondérées",null,"Total"]
[null,"(1)",null,"(2)","(3)",null,"(4) = (1) X (2)","(5) = (1 ) X  (3)",null,"(6) = (4) + (5)"]
[" 1A",1E-3,null,{"$f":"'Sommaire du rôle'!F7","v":76534150},{"$f":"'Sommaire du rôle'!G7","v":0},null,{"$f":"B7*D7","v":76534.150000000009},{"$f":"B7*E7","v":0},null,{"$f":"G7+H7","v":76534.150000000009}]
[" 1B",5.0000000000000001E-3,null,{"$f":"'Sommaire du rôle'!F8","v":34712370},{"$f":"'Sommaire du rôle'!G8","v":0},null,{"$f":"B8*D8","v":173561.85},{"$f":"B8*E8","v":0},null,{"$f":"G8+H8","v":173561.85}]
[" 1C",0.01,null,{"$f":"'Sommaire du rôle'!F9","v":4894450},{"$f":"'Sommaire du rôle'!G9","v":0},null,48944.5,0,null,48944.5]
[2,0.03,null,{"$f":"'Sommaire du rôle'!F10","v":23616670},{"$f":"'Sommaire du rôle'!G10","v":0},null,708500.1,0,null,708500.1]
[3,0.06,null,{"$f":"'Sommaire du rôle'!F11","v":44153450},{"$f":"'Sommaire du rôle'!G11","v":0},null,2649207,0,null,2649207]
[4,0.12,null,{"$f":"'Sommaire du rôle'!F12","v":60256460},{"$f":"'Sommaire du rôle'!G12","v":0},null,7230775.2000000002,0,null,7230775.2000000002]
[5,0.22,null,{"$f":"'Sommaire du rôle'!F13","v":38643990},{"$f":"'Sommaire du rôle'!G13","v":0},null,8501677.8000000007,0,null,8501677.8000000007]
[6,0.4,null,{"$f":"'Sommaire du rôle'!F14","v":38532890},{"$f":"'Sommaire du rôle'!G14","v":0},null,15413156,0,null,15413156]
[7,0.6,null,{"$f":"'Sommaire du rôle'!F15","v":39569365},{"$f":"'Sommaire du rôle'!G15","v":72376370},null,23741619,43425822,null,67167441]
[8,0.85,null,{"$f":"'Sommaire du rôle'!F16","v":22323070},{"$f":"'Sommaire du rôle'!G16","v":211592260},null,18974609.5,179853421,null,198828030.5]
[9,1,null,{"$f":"'Sommaire du rôle'!F17","v":3177900},{"$f":"'Sommaire du rôle'!G17","v":0},null,3177900,0,null,3177900]
[10,1,null,{"$f":"'Sommaire du rôle'!F18","v":1155755205},{"$f":"'Sommaire du rôle'!G18","v":61905690},null,1155755205,61905690,null,1217660895]
["11 Cours de triage","100%",null,{"$f":"'Sommaire du rôle'!F19","v":0},{"$f":"'Sommaire du rôle'!G19","v":0},null,0,0,null,0]
["12 CHSLD",0.2,null,{"$f":"'Sommaire du rôle'!F20","v":13938200},null,null,2787640,null,null,2787640]
["13 Cours de triage 40 %","40%",null,{"$f":"'Sommaire du rôle'!F21","v":0},null,null,0,null,null,0]
[" APPLICATION DU TNR QUAND TTVD",1,null,{"$f":"'Sommaire du rôle'!F22","v":5228300},{"$f":"'Sommaire du rôle'!G22","v":0},null,5228300,{"$f":"B22*E22","v":0},null,5228300]
["Total",null,null,null,null,null,{"$f":"SUM(G7:G22)","v":1244467630.0999999},{"$f":"SUM(H7:H22)","v":285184933},null,{"$f":"G23+H23","v":1529652563.0999999}]
[]
["ASSIETTE AU TAUX INDUSTRIEL (CLASSE 2)"]
["Classe non résidentielle","Pourcentage de taxation",null,"VALEUR À 50 %"]
[null,null,null,"  Imposables","Compensables",null,"Imposables pondérées","Compensables pondérées",null,"Total"]
[null,"(1)",null,"(2)","(3)",null,"(4) = (1) X (2)","(5) = (1) X (3)",null,"(6) = (4) + (5)"]
[" 1A",1E-3,null,{"$f":"'Sommaire du rôle'!H7","v":0},{"$f":"'Sommaire du rôle'!I7","v":0},null,{"$f":"B29*D29","v":0},{"$f":"B29*E29","v":0},null,{"$f":"G29+H29","v":0}]
[" 1B",5.0000000000000001E-3,null,{"$f":"'Sommaire du rôle'!H8","v":0},{"$f":"'Sommaire du rôle'!I8","v":0},null,{"$f":"B30*D30","v":0},{"$f":"B30*E30","v":0},null,{"$f":"G30+H30","v":0}]
[" 1C",0.01,null,{"$f":"'Sommaire du rôle'!H9","v":0},{"$f":"'Sommaire du rôle'!I9","v":0},null,0,0,null,0]
[2,0.03,null,{"$f":"'Sommaire du rôle'!H10","v":0},{"$f":"'Sommaire du rôle'!I10","v":0},null,0,0,null,0]
[3,0.06,null,{"$f":"'Sommaire du rôle'!H11","v":0},{"$f":"'Sommaire du rôle'!I11","v":0},null,0,0,null,0]
[4,0.12,null,{"$f":"'Sommaire du rôle'!H12","v":0},{"$f":"'Sommaire du rôle'!I12","v":0},null,0,0,null,0]
[5,0.22,null,{"$f":"'Sommaire du rôle'!H13","v":0},{"$f":"'Sommaire du rôle'!I13","v":0},null,0,0,null,0]
[6,0.4,null,{"$f":"'Sommaire du rôle'!H14","v":290100},{"$f":"'Sommaire du rôle'!I14","v":0},null,116040,0,null,116040]
[7,0.6,null,{"$f":"'Sommaire du rôle'!H15","v":350350},{"$f":"'Sommaire du rôle'!I15","v":0},null,210210,0,null,210210]
[8,0.85,null,{"$f":"'Sommaire du rôle'!H16","v":0},{"$f":"'Sommaire du rôle'!I16","v":0},null,0,0,null,0]
[9,1,null,{"$f":"'Sommaire du rôle'!H17","v":0},{"$f":"'Sommaire du rôle'!I17","v":0},null,0,0,null,0]
[10,1,null,{"$f":"'Sommaire du rôle'!H18","v":10515650},{"$f":"'Sommaire du rôle'!I18","v":0},null,10515650,0,null,10515650]
["Total",null,null,null,null,null,{"$f":"SUM(G29:G40)","v":10841900},{"$f":"SUM(H29:H40)","v":0},null,{"$f":"G41+H41","v":10841900}]
[]
["ASSIETTE AU TAUX IND. (SAUF CL.1 ET 2)"]
["Classe non résidentielle","Pourcentage de taxation",null,"VALEUR À 100 %"]
[null,null,null,"  Imposables","Compensables",null,"Imposables pondérées","Compensables pondérées",null,"Total"]
[null,"(1)",null,"(2)","(3)",null,"(4) = (1) X (2)","(5) = (1) X (3)",null,"(6) = (4) + (5)"]
[" 1A",1E-3,null,{"$f":"'Sommaire du rôle'!J7","v":0},{"$f":"'Sommaire du rôle'!K7","v":0},null,{"$f":"B47*D47","v":0},{"$f":"B47*E47","v":0},null,{"$f":"G47+H47","v":0}]
[" 1B",5.0000000000000001E-3,null,{"$f":"'Sommaire du rôle'!J8","v":0},{"$f":"'Sommaire du rôle'!K8","v":0},null,{"$f":"B48*D48","v":0},{"$f":"B48*E48","v":0},null,{"$f":"G48+H48","v":0}]
[" 1C",0.01,null,{"$f":"'Sommaire du rôle'!J9","v":0},{"$f":"'Sommaire du rôle'!K9","v":0},null,0,0,null,0]
[2,0.03,null,{"$f":"'Sommaire du rôle'!J10","v":605900},{"$f":"'Sommaire du rôle'!K10","v":0},null,18177,0,null,18177]
[3,0.06,null,{"$f":"'Sommaire du rôle'!J11","v":181400},{"$f":"'Sommaire du rôle'!K11","v":0},null,10884,0,null,10884]
[4,0.12,null,{"$f":"'Sommaire du rôle'!J12","v":215700},{"$f":"'Sommaire du rôle'!K12","v":0},null,25884,0,null,25884]
[5,0.22,null,{"$f":"'Sommaire du rôle'!J13","v":0},{"$f":"'Sommaire du rôle'!K13","v":0},null,0,0,null,0]
[6,0.4,null,{"$f":"'Sommaire du rôle'!J14","v":2421200},{"$f":"'Sommaire du rôle'!K14","v":0},null,968480,0,null,968480]
[7,0.6,null,{"$f":"'Sommaire du rôle'!J15","v":354000},{"$f":"'Sommaire du rôle'!K15","v":0},null,212400,0,null,212400]
[8,0.85,null,{"$f":"'Sommaire du rôle'!J16","v":1875900},{"$f":"'Sommaire du rôle'!K16","v":0},null,1594515,0,null,1594515]
[9,1,null,{"$f":"'Sommaire du rôle'!J17","v":0},{"$f":"'Sommaire du rôle'!K17","v":0},null,0,0,null,0]
[10,1,null,{"$f":"'Sommaire du rôle'!J18","v":225704400},{"$f":"'Sommaire du rôle'!K18","v":2325200},null,225704400,2325200,null,228029600]
["Total",null,null,null,null,null,{"$f":"SUM(G47:G58)","v":228534740},{"$f":"SUM(H47:H58)","v":2325200},null,{"$f":"G59+H59","v":230859940}]
[]
["ASSIETTE CATÉGORIE RÉSIDUELLE"]
["Classe non résidentielle","Pourcentage de taxation",null,"VALEUR À 100 %"]
[null,null,null,"  Imposables","Compensables",null,"Imposables pondérées","Compensables pondérées",null,"Total"]
[null,"(1)",null,"(2)","(3)",null,"(4) = (1) X (2)","(5) = (1) X (3)",null,"(6) = (4) + (5)"]
[" 1A",0.999,null,{"$f":"'Sommaire du rôle'!P7","v":76534150},{"$f":"'Sommaire du rôle'!Q7","v":0},null,{"$f":"D65*B65","v":76457615.849999994},{"$f":"B65*E65","v":0},null,{"$f":"G65+H65","v":76457615.849999994}]
[" 1B",0.995,null,{"$f":"'Sommaire du rôle'!P8","v":34712370},{"$f":"'Sommaire du rôle'!Q8","v":0},null,{"$f":"D66*B66","v":34538808.149999999},{"$f":"B66*E66","v":0},null,{"$f":"G66+H66","v":34538808.149999999}]
[" 1C",0.99,null,{"$f":"'Sommaire du rôle'!P9","v":4894450},{"$f":"'Sommaire du rôle'!Q9","v":0},null,4845505.5,0,null,4845505.5]
[2,0.97,null,{"$f":"'Sommaire du rôle'!P10","v":23616670},{"$f":"'Sommaire du rôle'!Q10","v":0},null,22908169.899999999,0,null,22908169.899999999]
[3,0.94,null,{"$f":"'Sommaire du rôle'!P11","v":44153450},{"$f":"'Sommaire du rôle'!Q11","v":0},null,41504243,0,null,41504243]
[4,0.88,null,{"$f":"'Sommaire du rôle'!P12","v":60256460},{"$f":"'Sommaire du rôle'!Q12","v":0},null,53025684.799999997,0,null,53025684.799999997]
[5,0.78,null,{"$f":"'Sommaire du rôle'!P13","v":38643990},{"$f":"'Sommaire du rôle'!Q13","v":0},null,30142312.199999999,0,null,30142312.199999999]
[6,0.6,null,{"$f":"'Sommaire du rôle'!P14","v":38532890},{"$f":"'Sommaire du rôle'!Q14","v":0},null,23119734,0,null,23119734]
[7,0.4,null,{"$f":"'Sommaire du rôle'!P15","v":39569365},{"$f":"'Sommaire du rôle'!Q15","v":72376370},null,15827746,28950548,null,44778294]
[8,0.15000000000000002,null,{"$f":"'Sommaire du rôle'!P16","v":22323070},{"$f":"'Sommaire du rôle'!Q16","v":211592260},null,3348460.5000000005,{"$f":"B74*E74","v":31738839.000000004},null,35087299.500000007]
["IMMEUBLES SANS PARTIE NON RÉSIDENTIELLE",1,null,{"$f":"'Sommaire du rôle'!P18","v":8068032861},{"$f":"'Sommaire du rôle'!Q18","v":2100780},null,8068032861,2100780,null,8070133641]
["12  CHSLD",0.8,null,{"$f":"'Sommaire du rôle'!P20","v":13938200},null,null,11150560]
["13 Cours de triage ",0.6,null,{"$f":"'Sommaire du rôle'!P21","v":0},null,null,0]
["Total",null,null,null,null,null,{"$f":"SUM(G65:G77)","v":8384901700.8999996},{"$f":"SUM(H65:H75)","v":62790167},{"$f":"SUM(I65:I75)","v":0},{"$f":"G78+H78","v":8447691867.8999996}]
[]
["ASSIETTE AU TAUX NON RÉSIDENTIEL RÉFÉRENCE"]
["Classe non résidentielle","Pourcentage de taxation",null,"VAL. NR À 100 % ET IND. CL. 2 À 50 %"]
[null,null,null,"  Imposables","Compensables",null,"Imposables pondérées","Compensables pondérées",null,"Total"]
[null,"(1)",null,"(2)","(3)",null,"(4) = (1) X (2)","(5) = (1 ) X  (3)",null,"(6) = (4) + (5)"]
[" 1A",1E-3,null,{"$f":"'Sommaire du rôle'!F30","v":6957650},{"$f":"'Sommaire du rôle'!G30","v":0},null,{"$f":"B84*D84","v":6957.6500000000005},{"$f":"B84*E84","v":0},null,{"$f":"G84+H84","v":6957.6500000000005}]
[" 1B",5.0000000000000001E-3,null,{"$f":"'Sommaire du rôle'!F31","v":3155670},{"$f":"'Sommaire du rôle'!G31","v":0},null,{"$f":"B85*D85","v":15778.35},{"$f":"B85*E85","v":0},null,{"$f":"G85+H85","v":15778.35}]
[" 1C",0.01,null,{"$f":"'Sommaire du rôle'!F32","v":444950},{"$f":"'Sommaire du rôle'!G32","v":0},null,4449.5,0,null,4449.5]
[2,0.03,null,{"$f":"'Sommaire du rôle'!F33","v":2146970},{"$f":"'Sommaire du rôle'!G33","v":0},null,64409.1,0,null,64409.1]
[3,0.06,null,{"$f":"'Sommaire du rôle'!F34","v":4013950},{"$f":"'Sommaire du rôle'!G34","v":0},null,240837,0,null,240837]
[4,0.12,null,{"$f":"'Sommaire du rôle'!F35","v":5477860},{"$f":"'Sommaire du rôle'!G35","v":0},null,657343.19999999995,0,null,657343.19999999995]
[5,0.22,null,{"$f":"'Sommaire du rôle'!F36","v":3513090},{"$f":"'Sommaire du rôle'!G36","v":0},null,772879.8,0,null,772879.8]
[6,0.4,null,{"$f":"'Sommaire du rôle'!F37","v":3502990},{"$f":"'Sommaire du rôle'!G37","v":0},null,1401196,0,null,1401196]
[7,0.6,null,{"$f":"'Sommaire du rôle'!F38","v":3597215},{"$f":"'Sommaire du rôle'!G38","v":6579670},null,2158329,3947802,null,6106131]
[8,0.85,null,{"$f":"'Sommaire du rôle'!F39","v":2029370},{"$f":"'Sommaire du rôle'!G39","v":19235660},null,1724964.5,16350311,null,18075275.5]
[9,1,null,{"$f":"'Sommaire du rôle'!F40","v":288900},{"$f":"'Sommaire du rôle'!G40","v":0},null,288900,0,null,288900]
[10,1,null,{"$f":"'Sommaire du rôle'!F41","v":105068655},{"$f":"'Sommaire du rôle'!G41","v":5627790},null,105068655,5627790,null,110696445]
["11 Cours de triage","100%",null,{"$f":"'Sommaire du rôle'!F42","v":0},{"$f":"'Sommaire du rôle'!G42","v":0},null,0,0,null,0]
["12 CHSLD",0.2,null,{"$f":"'Sommaire du rôle'!F43","v":13938200},null,null,2787640,null,null,2787640]
["13 Cours de triage 40 %","40%",null,{"$f":"'Sommaire du rôle'!F44","v":0},null,null,0,null,null,0]
[" APPLICATION DU TNR QUAND TTVD",1,null,{"$f":"'Sommaire du rôle'!F45","v":5228300},{"$f":"'Sommaire du rôle'!G45","v":0},null,5228300,{"$f":"B99*E99","v":0},null,5228300]
["Total",null,null,null,null,null,{"$f":"SUM(G84:G99)","v":120420639.09999999},{"$f":"SUM(H84:H99)","v":25925903},null,{"$f":"G100+H100","v":146346542.09999999}]
[]
["ASSIETTE AU TAUX NON RÉSIDENTIEL SOUS-CATÉGORIE 1",null,null,null,null,null,null,null,null,null,null,"ASSIETTE AU TAUX NON RÉSIDENTIEL SOUS-CATÉGORIE 2",null,null,null,null,null,null,null,null,null,null,"ASSIETTE AU TAUX NON RÉSIDENTIEL SOUS-CATÉGORIE 3",null,null,null,null,null,null,null,null,null,null,"ASSIETTE AU TAUX NON RÉSIDENTIEL SOUS-CATÉGORIE 4",null,null,null,null,null,null,null,null,null,null,"ASSIETTE AU TAUX NON RÉSIDENTIEL SOUS-CATÉGORIE 5",null,null,null,null,null,null,null,null,null,null,"ASSIETTE AU TAUX NON RÉSIDENTIEL SOUS-CATÉGORIE 6",null,null,null,null,null,null,null,null,null,null,"ASSIETTE AU TAUX NON RÉSIDENTIEL SOUS-CATÉGORIE 7",null,null,null,null,null,null,null,null,null,null,"ASSIETTE AU TAUX NON RÉSIDENTIEL SOUS-CATÉGORIE 8",null,null,null,null,null,null,null,null,null,null,"ASSIETTE AU TAUX NON RÉSIDENTIEL SOUS-CATÉGORIE 9",null,null,null,null,null,null,null,null,null,null,"ASSIETTE AU TAUX NON RÉSIDENTIEL SOUS-CATÉGORIE 10"]
["Classe non résidentielle","Pourcentage de taxation",null,"VAL. NR À 100 % ET IND. CL. 2 À 50 %",null,null,null,null,null,null,null,"Classe non résidentielle","Pourcentage de taxation",null,"VAL. NR À 100 % ET IND. CL. 2 À 50 %",null,null,null,null,null,null,null,"Classe non résidentielle","Pourcentage de taxation",null,"VAL. NR À 100 % ET IND. CL. 2 À 50 %",null,null,null,null,null,null,null,"Classe non résidentielle","Pourcentage de taxation",null,"VAL. NR À 100 % ET IND. CL. 2 À 50 %",null,null,null,null,null,null,null,"Classe non résidentielle","Pourcentage de taxation",null,"VAL. NR À 100 % ET IND. CL. 2 À 50 %",null,null,null,null,null,null,null,"Classe non résidentielle","Pourcentage de taxation",null,"VAL. NR À 100 % ET IND. CL. 2 À 50 %",null,null,null,null,null,null,null,"Classe non résidentielle","Pourcentage de taxation",null,"VAL. NR À 100 % ET IND. CL. 2 À 50 %",null,null,null,null,null,null,null,"Classe non résidentielle","Pourcentage de taxation",null,"VAL. NR À 100 % ET IND. CL. 2 À 50 %",null,null,null,null,null,null,null,"Classe non résidentielle","Pourcentage de taxation",null,"VAL. NR À 100 % ET IND. CL. 2 À 50 %",null,null,null,null,null,null,null,"Classe non résidentielle","Pourcentage de taxation",null,"VAL. NR À 100 % ET IND. CL. 2 À 50 %"]
[null,null,null,"  Imposables","Compensables",null,"Imposables pondérées","Compensables pondérées",null,"Total",null,null,null,null,"  Imposables","Compensables",null,"Imposables pondérées","Compensables pondérées",null,"Total",null,null,null,null,"  Imposables","Compensables",null,"Imposables pondérées","Compensables pondérées",null,"Total",null,null,null,null,"  Imposables","Compensables",null,"Imposables pondérées","Compensables pondérées",null,"Total",null,null,null,null,"  Imposables","Compensables",null,"Imposables pondérées","Compensables pondérées",null,"Total",null,null,null,null,"  Imposables","Compensables",null,"Imposables pondérées","Compensables pondérées",null,"Total",null,null,null,null,"  Imposables","Compensables",null,"Imposables pondérées","Compensables pondérées",null,"Total",null,null,null,null,"  Imposables","Compensables",null,"Imposables pondérées","Compensables pondérées",null,"Total",null,null,null,null,"  Imposables","Compensables",null,"Imposables pondérées","Compensables pondérées",null,"Total",null,null,null,null,"  Imposables","Compensables",null,"Imposables pondérées","Compensables pondérées",null,"Total"]
[null,"(1)",null,"(2)","(3)",null,"(4) = (1) X (2)","(5) = (1 ) X  (3)",null,"(6) = (4) + (5)",null,null,"(1)",null,"(2)","(3)",null,"(4) = (1) X (2)","(5) = (1 ) X  (3)",null,"(6) = (4) + (5)",null,null,"(1)",null,"(2)","(3)",null,"(4) = (1) X (2)","(5) = (1 ) X  (3)",null,"(6) = (4) + (5)",null,null,"(1)",null,"(2)","(3)",null,"(4) = (1) X (2)","(5) = (1 ) X  (3)",null,"(6) = (4) + (5)",null,null,"(1)",null,"(2)","(3)",null,"(4) = (1) X (2)","(5) = (1 ) X  (3)",null,"(6) = (4) + (5)",null,null,"(1)",null,"(2)","(3)",null,"(4) = (1) X (2)","(5) = (1 ) X  (3)",null,"(6) = (4) + (5)",null,null,"(1)",null,"(2)","(3)",null,"(4) = (1) X (2)","(5) = (1 ) X  (3)",null,"(6) = (4) + (5)",null,null,"(1)",null,"(2)","(3)",null,"(4) = (1) X (2)","(5) = (1 ) X  (3)",null,"(6) = (4) + (5)",null,null,"(1)",null,"(2)","(3)",null,"(4) = (1) X (2)","(5) = (1 ) X  (3)",null,"(6) = (4) + (5)",null,null,"(1)",null,"(2)","(3)",null,"(4) = (1) X (2)","(5) = (1 ) X  (3)",null,"(6) = (4) + (5)"]
[" 1A",1E-3,null,{"$f":"'Sommaire du rôle'!H30","v":6957650},{"$f":"'Sommaire du rôle'!I30","v":0},null,{"$f":"B106*D106","v":6957.6500000000005},{"$f":"B106*E106","v":0},null,{"$f":"G106+H106","v":6957.6500000000005},null," 1A",1E-3,null,{"$f":"'Sommaire du rôle'!J30","v":6957650},{"$f":"'Sommaire du rôle'!K30","v":0},null,{"$f":"M106*O106","v":6957.6500000000005},{"$f":"M106*P106","v":0},null,{"$f":"R106+S106","v":6957.6500000000005},null," 1A",1E-3,null,{"$f":"'Sommaire du rôle'!L30","v":6957650},{"$f":"'Sommaire du rôle'!M30","v":0},null,{"$f":"X106*Z106","v":6957.6500000000005},{"$f":"X106*AA106","v":0},null,{"$f":"AC106+AD106","v":6957.6500000000005},null," 1A",1E-3,null,{"$f":"'Sommaire du rôle'!N30","v":6957650},{"$f":"'Sommaire du rôle'!O30","v":0},null,{"$f":"AI106*AK106","v":6957.6500000000005},{"$f":"AI106*AL106","v":0},null,{"$f":"AN106+AO106","v":6957.6500000000005},null," 1A",1E-3,null,{"$f":"'Sommaire du rôle'!P30","v":6957650},{"$f":"'Sommaire du rôle'!Q30","v":0},null,{"$f":"AT106*AV106","v":6957.6500000000005},{"$f":"AT106*AW106","v":0},null,{"$f":"AY106+AZ106","v":6957.6500000000005},null," 1A",1E-3,null,{"$f":"'Sommaire du rôle'!R30","v":6957650},{"$f":"'Sommaire du rôle'!S30","v":0},null,{"$f":"BE106*BG106","v":6957.6500000000005},{"$f":"BE106*BH106","v":0},null,{"$f":"BJ106+BK106","v":6957.6500000000005},null," 1A",1E-3,null,{"$f":"'Sommaire du rôle'!T30","v":6957650},{"$f":"'Sommaire du rôle'!U30","v":0},null,{"$f":"BP106*BR106","v":6957.6500000000005},{"$f":"BP106*BS106","v":0},null,{"$f":"BU106+BV106","v":6957.6500000000005},null," 1A",1E-3,null,{"$f":"'Sommaire du rôle'!V30","v":6957650},{"$f":"'Sommaire du rôle'!W30","v":0},null,{"$f":"CA106*CC106","v":6957.6500000000005},{"$f":"CA106*CD106","v":0},null,{"$f":"CF106+CG106","v":6957.6500000000005},null," 1A",1E-3,null,{"$f":"'Sommaire du rôle'!X30","v":6957650},{"$f":"'Sommaire du rôle'!Y30","v":0},null,{"$f":"CL106*CN106","v":6957.6500000000005},{"$f":"CL106*CO106","v":0},null,{"$f":"CQ106+CR106","v":6957.6500000000005},null," 1A",1E-3,null,{"$f":"'Sommaire du rôle'!Z30","v":6957650},{"$f":"'Sommaire du rôle'!AA30","v":0},null,{"$f":"CW106*CY106","v":6957.6500000000005},{"$f":"CW106*CZ106","v":0},null,{"$f":"DB106+DC106","v":6957.6500000000005}]
[" 1B",5.0000000000000001E-3,null,{"$f":"'Sommaire du rôle'!H31","v":3155670},{"$f":"'Sommaire du rôle'!I31","v":0},null,{"$f":"B107*D107","v":15778.35},{"$f":"B107*E107","v":0},null,{"$f":"G107+H107","v":15778.35},null," 1B",5.0000000000000001E-3,null,{"$f":"'Sommaire du rôle'!J31","v":3155670},{"$f":"'Sommaire du rôle'!K31","v":0},null,{"$f":"M107*O107","v":15778.35},{"$f":"M107*P107","v":0},null,{"$f":"R107+S107","v":15778.35},null," 1B",5.0000000000000001E-3,null,{"$f":"'Sommaire du rôle'!L31","v":3155670},{"$f":"'Sommaire du rôle'!M31","v":0},null,{"$f":"X107*Z107","v":15778.35},{"$f":"X107*AA107","v":0},null,{"$f":"AC107+AD107","v":15778.35},null," 1B",5.0000000000000001E-3,null,{"$f":"'Sommaire du rôle'!N31","v":3155670},{"$f":"'Sommaire du rôle'!O31","v":0},null,{"$f":"AI107*AK107","v":15778.35},{"$f":"AI107*AL107","v":0},null,{"$f":"AN107+AO107","v":15778.35},null," 1B",5.0000000000000001E-3,null,{"$f":"'Sommaire du rôle'!P31","v":3155670},{"$f":"'Sommaire du rôle'!Q31","v":0},null,{"$f":"AT107*AV107","v":15778.35},{"$f":"AT107*AW107","v":0},null,{"$f":"AY107+AZ107","v":15778.35},null," 1B",5.0000000000000001E-3,null,{"$f":"'Sommaire du rôle'!R31","v":3155670},{"$f":"'Sommaire du rôle'!S31","v":0},null,{"$f":"BE107*BG107","v":15778.35},{"$f":"BE107*BH107","v":0},null,{"$f":"BJ107+BK107","v":15778.35},null," 1B",5.0000000000000001E-3,null,{"$f":"'Sommaire du rôle'!T31","v":3155670},{"$f":"'Sommaire du rôle'!U31","v":0},null,{"$f":"BP107*BR107","v":15778.35},{"$f":"BP107*BS107","v":0},null,{"$f":"BU107+BV107","v":15778.35},null," 1B",5.0000000000000001E-3,null,{"$f":"'Sommaire du rôle'!V31","v":3155670},{"$f":"'Sommaire du rôle'!W31","v":0},null,{"$f":"CA107*CC107","v":15778.35},{"$f":"CA107*CD107","v":0},null,{"$f":"CF107+CG107","v":15778.35},null," 1B",5.0000000000000001E-3,null,{"$f":"'Sommaire du rôle'!X31","v":3155670},{"$f":"'Sommaire du rôle'!Y31","v":0},null,{"$f":"CL107*CN107","v":15778.35},{"$f":"CL107*CO107","v":0},null,{"$f":"CQ107+CR107","v":15778.35},null," 1B",5.0000000000000001E-3,null,{"$f":"'Sommaire du rôle'!Z31","v":3155670},{"$f":"'Sommaire du rôle'!AA31","v":0},null,{"$f":"CW107*CY107","v":15778.35},{"$f":"CW107*CZ107","v":0},null,{"$f":"DB107+DC107","v":15778.35}]
[" 1C",0.01,null,{"$f":"'Sommaire du rôle'!H32","v":444950},{"$f":"'Sommaire du rôle'!I32","v":0},null,4449.5,0,null,4449.5,null," 1C",0.01,null,{"$f":"'Sommaire du rôle'!J32","v":444950},{"$f":"'Sommaire du rôle'!K32","v":0},null,4449.5,0,null,4449.5,null," 1C",0.01,null,{"$f":"'Sommaire du rôle'!L32","v":444950},{"$f":"'Sommaire du rôle'!M32","v":0},null,4449.5,0,null,4449.5,null," 1C",0.01,null,{"$f":"'Sommaire du rôle'!N32","v":444950},{"$f":"'Sommaire du rôle'!O32","v":0},null,4449.5,0,null,4449.5,null," 1C",0.01,null,{"$f":"'Sommaire du rôle'!P32","v":444950},{"$f":"'Sommaire du rôle'!Q32","v":0},null,4449.5,0,null,4449.5,null," 1C",0.01,null,{"$f":"'Sommaire du rôle'!R32","v":444950},{"$f":"'Sommaire du rôle'!S32","v":0},null,4449.5,0,null,4449.5,null," 1C",0.01,null,{"$f":"'Sommaire du rôle'!T32","v":444950},{"$f":"'Sommaire du rôle'!U32","v":0},null,4449.5,0,null,4449.5,null," 1C",0.01,null,{"$f":"'Sommaire du rôle'!V32","v":444950},{"$f":"'Sommaire du rôle'!W32","v":0},null,4449.5,0,null,4449.5,null," 1C",0.01,null,{"$f":"'Sommaire du rôle'!X32","v":444950},{"$f":"'Sommaire du rôle'!Y32","v":0},null,4449.5,0,null,4449.5,null," 1C",0.01,null,{"$f":"'Sommaire du rôle'!Z32","v":444950},{"$f":"'Sommaire du rôle'!AA32","v":0},null,4449.5,0,null,4449.5]
[2,0.03,null,{"$f":"'Sommaire du rôle'!H33","v":2146970},{"$f":"'Sommaire du rôle'!I33","v":0},null,64409.1,0,null,64409.1,null,2,0.03,null,{"$f":"'Sommaire du rôle'!J33","v":2146970},{"$f":"'Sommaire du rôle'!K33","v":0},null,64409.1,0,null,64409.1,null,2,0.03,null,{"$f":"'Sommaire du rôle'!L33","v":2146970},{"$f":"'Sommaire du rôle'!M33","v":0},null,64409.1,0,null,64409.1,null,2,0.03,null,{"$f":"'Sommaire du rôle'!N33","v":2146970},{"$f":"'Sommaire du rôle'!O33","v":0},null,64409.1,0,null,64409.1,null,2,0.03,null,{"$f":"'Sommaire du rôle'!P33","v":2146970},{"$f":"'Sommaire du rôle'!Q33","v":0},null,64409.1,0,null,64409.1,null,2,0.03,null,{"$f":"'Sommaire du rôle'!R33","v":2146970},{"$f":"'Sommaire du rôle'!S33","v":0},null,64409.1,0,null,64409.1,null,2,0.03,null,{"$f":"'Sommaire du rôle'!T33","v":2146970},{"$f":"'Sommaire du rôle'!U33","v":0},null,64409.1,0,null,64409.1,null,2,0.03,null,{"$f":"'Sommaire du rôle'!V33","v":2146970},{"$f":"'Sommaire du rôle'!W33","v":0},null,64409.1,0,null,64409.1,null,2,0.03,null,{"$f":"'Sommaire du rôle'!X33","v":2146970},{"$f":"'Sommaire du rôle'!Y33","v":0},null,64409.1,0,null,64409.1,null,2,0.03,null,{"$f":"'Sommaire du rôle'!Z33","v":2146970},{"$f":"'Sommaire du rôle'!AA33","v":0},null,64409.1,0,null,64409.1]
[3,0.06,null,{"$f":"'Sommaire du rôle'!H34","v":4013950},{"$f":"'Sommaire du rôle'!I34","v":0},null,240837,0,null,240837,null,3,0.06,null,{"$f":"'Sommaire du rôle'!J34","v":4013950},{"$f":"'Sommaire du rôle'!K34","v":0},null,240837,0,null,240837,null,3,0.06,null,{"$f":"'Sommaire du rôle'!L34","v":4013950},{"$f":"'Sommaire du rôle'!M34","v":0},null,240837,0,null,240837,null,3,0.06,null,{"$f":"'Sommaire du rôle'!N34","v":4013950},{"$f":"'Sommaire du rôle'!O34","v":0},null,240837,0,null,240837,null,3,0.06,null,{"$f":"'Sommaire du rôle'!P34","v":4013950},{"$f":"'Sommaire du rôle'!Q34","v":0},null,240837,0,null,240837,null,3,0.06,null,{"$f":"'Sommaire du rôle'!R34","v":4013950},{"$f":"'Sommaire du rôle'!S34","v":0},null,240837,0,null,240837,null,3,0.06,null,{"$f":"'Sommaire du rôle'!T34","v":4013950},{"$f":"'Sommaire du rôle'!U34","v":0},null,240837,0,null,240837,null,3,0.06,null,{"$f":"'Sommaire du rôle'!V34","v":4013950},{"$f":"'Sommaire du rôle'!W34","v":0},null,240837,0,null,240837,null,3,0.06,null,{"$f":"'Sommaire du rôle'!X34","v":4013950},{"$f":"'Sommaire du rôle'!Y34","v":0},null,240837,0,null,240837,null,3,0.06,null,{"$f":"'Sommaire du rôle'!Z34","v":4013950},{"$f":"'Sommaire du rôle'!AA34","v":0},null,240837,0,null,240837]
[4,0.12,null,{"$f":"'Sommaire du rôle'!H35","v":5477860},{"$f":"'Sommaire du rôle'!I35","v":0},null,657343.19999999995,0,null,657343.19999999995,null,4,0.12,null,{"$f":"'Sommaire du rôle'!J35","v":5477860},{"$f":"'Sommaire du rôle'!K35","v":0},null,657343.19999999995,0,null,657343.19999999995,null,4,0.12,null,{"$f":"'Sommaire du rôle'!L35","v":5477860},{"$f":"'Sommaire du rôle'!M35","v":0},null,657343.19999999995,0,null,657343.19999999995,null,4,0.12,null,{"$f":"'Sommaire du rôle'!N35","v":5477860},{"$f":"'Sommaire du rôle'!O35","v":0},null,657343.19999999995,0,null,657343.19999999995,null,4,0.12,null,{"$f":"'Sommaire du rôle'!P35","v":5477860},{"$f":"'Sommaire du rôle'!Q35","v":0},null,657343.19999999995,0,null,657343.19999999995,null,4,0.12,null,{"$f":"'Sommaire du rôle'!R35","v":5477860},{"$f":"'Sommaire du rôle'!S35","v":0},null,657343.19999999995,0,null,657343.19999999995,null,4,0.12,null,{"$f":"'Sommaire du rôle'!T35","v":5477860},{"$f":"'Sommaire du rôle'!U35","v":0},null,657343.19999999995,0,null,657343.19999999995,null,4,0.12,null,{"$f":"'Sommaire du rôle'!V35","v":5477860},{"$f":"'Sommaire du rôle'!W35","v":0},null,657343.19999999995,0,null,657343.19999999995,null,4,0.12,null,{"$f":"'Sommaire du rôle'!X35","v":5477860},{"$f":"'Sommaire du rôle'!Y35","v":0},null,657343.19999999995,0,null,657343.19999999995,null,4,0.12,null,{"$f":"'Sommaire du rôle'!Z35","v":5477860},{"$f":"'Sommaire du rôle'!AA35","v":0},null,657343.19999999995,0,null,657343.19999999995]
[5,0.22,null,{"$f":"'Sommaire du rôle'!H36","v":3513090},{"$f":"'Sommaire du rôle'!I36","v":0},null,772879.8,0,null,772879.8,null,5,0.22,null,{"$f":"'Sommaire du rôle'!J36","v":3513090},{"$f":"'Sommaire du rôle'!K36","v":0},null,772879.8,0,null,772879.8,null,5,0.22,null,{"$f":"'Sommaire du rôle'!L36","v":3513090},{"$f":"'Sommaire du rôle'!M36","v":0},null,772879.8,0,null,772879.8,null,5,0.22,null,{"$f":"'Sommaire du rôle'!N36","v":3513090},{"$f":"'Sommaire du rôle'!O36","v":0},null,772879.8,0,null,772879.8,null,5,0.22,null,{"$f":"'Sommaire du rôle'!P36","v":3513090},{"$f":"'Sommaire du rôle'!Q36","v":0},null,772879.8,0,null,772879.8,null,5,0.22,null,{"$f":"'Sommaire du rôle'!R36","v":3513090},{"$f":"'Sommaire du rôle'!S36","v":0},null,772879.8,0,null,772879.8,null,5,0.22,null,{"$f":"'Sommaire du rôle'!T36","v":3513090},{"$f":"'Sommaire du rôle'!U36","v":0},null,772879.8,0,null,772879.8,null,5,0.22,null,{"$f":"'Sommaire du rôle'!V36","v":3513090},{"$f":"'Sommaire du rôle'!W36","v":0},null,772879.8,0,null,772879.8,null,5,0.22,null,{"$f":"'Sommaire du rôle'!X36","v":3513090},{"$f":"'Sommaire du rôle'!Y36","v":0},null,772879.8,0,null,772879.8,null,5,0.22,null,{"$f":"'Sommaire du rôle'!Z36","v":3513090},{"$f":"'Sommaire du rôle'!AA36","v":0},null,772879.8,0,null,772879.8]
[6,0.4,null,{"$f":"'Sommaire du rôle'!H37","v":3502990},{"$f":"'Sommaire du rôle'!I37","v":0},null,1401196,0,null,1401196,null,6,0.4,null,{"$f":"'Sommaire du rôle'!J37","v":3502990},{"$f":"'Sommaire du rôle'!K37","v":0},null,1401196,0,null,1401196,null,6,0.4,null,{"$f":"'Sommaire du rôle'!L37","v":3502990},{"$f":"'Sommaire du rôle'!M37","v":0},null,1401196,0,null,1401196,null,6,0.4,null,{"$f":"'Sommaire du rôle'!N37","v":3502990},{"$f":"'Sommaire du rôle'!O37","v":0},null,1401196,0,null,1401196,null,6,0.4,null,{"$f":"'Sommaire du rôle'!P37","v":3502990},{"$f":"'Sommaire du rôle'!Q37","v":0},null,1401196,0,null,1401196,null,6,0.4,null,{"$f":"'Sommaire du rôle'!R37","v":3502990},{"$f":"'Sommaire du rôle'!S37","v":0},null,1401196,0,null,1401196,null,6,0.4,null,{"$f":"'Sommaire du rôle'!T37","v":3502990},{"$f":"'Sommaire du rôle'!U37","v":0},null,1401196,0,null,1401196,null,6,0.4,null,{"$f":"'Sommaire du rôle'!V37","v":3502990},{"$f":"'Sommaire du rôle'!W37","v":0},null,1401196,0,null,1401196,null,6,0.4,null,{"$f":"'Sommaire du rôle'!X37","v":3502990},{"$f":"'Sommaire du rôle'!Y37","v":0},null,1401196,0,null,1401196,null,6,0.4,null,{"$f":"'Sommaire du rôle'!Z37","v":3502990},{"$f":"'Sommaire du rôle'!AA37","v":0},null,1401196,0,null,1401196]
[7,0.6,null,{"$f":"'Sommaire du rôle'!H38","v":3597215},{"$f":"'Sommaire du rôle'!I38","v":6579670},null,2158329,3947802,null,6106131,null,7,0.6,null,{"$f":"'Sommaire du rôle'!J38","v":3597215},{"$f":"'Sommaire du rôle'!K38","v":6579670},null,2158329,3947802,null,6106131,null,7,0.6,null,{"$f":"'Sommaire du rôle'!L38","v":3597215},{"$f":"'Sommaire du rôle'!M38","v":6579670},null,2158329,3947802,null,6106131,null,7,0.6,null,{"$f":"'Sommaire du rôle'!N38","v":3597215},{"$f":"'Sommaire du rôle'!O38","v":6579670},null,2158329,3947802,null,6106131,null,7,0.6,null,{"$f":"'Sommaire du rôle'!P38","v":3597215},{"$f":"'Sommaire du rôle'!Q38","v":6579670},null,2158329,3947802,null,6106131,null,7,0.6,null,{"$f":"'Sommaire du rôle'!R38","v":3597215},{"$f":"'Sommaire du rôle'!S38","v":6579670},null,2158329,3947802,null,6106131,null,7,0.6,null,{"$f":"'Sommaire du rôle'!T38","v":3597215},{"$f":"'Sommaire du rôle'!U38","v":6579670},null,2158329,3947802,null,6106131,null,7,0.6,null,{"$f":"'Sommaire du rôle'!V38","v":3597215},{"$f":"'Sommaire du rôle'!W38","v":6579670},null,2158329,3947802,null,6106131,null,7,0.6,null,{"$f":"'Sommaire du rôle'!X38","v":3597215},{"$f":"'Sommaire du rôle'!Y38","v":6579670},null,2158329,3947802,null,6106131,null,7,0.6,null,{"$f":"'Sommaire du rôle'!Z38","v":3597215},{"$f":"'Sommaire du rôle'!AA38","v":6579670},null,2158329,3947802,null,6106131]
[8,0.85,null,{"$f":"'Sommaire du rôle'!H39","v":2029370},{"$f":"'Sommaire du rôle'!I39","v":19235660},null,1724964.5,16350311,null,18075275.5,null,8,0.85,null,{"$f":"'Sommaire du rôle'!J39","v":2029370},{"$f":"'Sommaire du rôle'!K39","v":19235660},null,1724964.5,16350311,null,18075275.5,null,8,0.85,null,{"$f":"'Sommaire du rôle'!L39","v":2029370},{"$f":"'Sommaire du rôle'!M39","v":19235660},null,1724964.5,16350311,null,18075275.5,null,8,0.85,null,{"$f":"'Sommaire du rôle'!N39","v":2029370},{"$f":"'Sommaire du rôle'!O39","v":19235660},null,1724964.5,16350311,null,18075275.5,null,8,0.85,null,{"$f":"'Sommaire du rôle'!P39","v":2029370},{"$f":"'Sommaire du rôle'!Q39","v":19235660},null,1724964.5,16350311,null,18075275.5,null,8,0.85,null,{"$f":"'Sommaire du rôle'!R39","v":2029370},{"$f":"'Sommaire du rôle'!S39","v":19235660},null,1724964.5,16350311,null,18075275.5,null,8,0.85,null,{"$f":"'Sommaire du rôle'!T39","v":2029370},{"$f":"'Sommaire du rôle'!U39","v":19235660},null,1724964.5,16350311,null,18075275.5,null,8,0.85,null,{"$f":"'Sommaire du rôle'!V39","v":2029370},{"$f":"'Sommaire du rôle'!W39","v":19235660},null,1724964.5,16350311,null,18075275.5,null,8,0.85,null,{"$f":"'Sommaire du rôle'!X39","v":2029370},{"$f":"'Sommaire du rôle'!Y39","v":19235660},null,1724964.5,16350311,null,18075275.5,null,8,0.85,null,{"$f":"'Sommaire du rôle'!Z39","v":2029370},{"$f":"'Sommaire du rôle'!AA39","v":19235660},null,1724964.5,16350311,null,18075275.5]
[9,1,null,{"$f":"'Sommaire du rôle'!H40","v":288900},{"$f":"'Sommaire du rôle'!I40","v":0},null,288900,0,null,288900,null,9,1,null,{"$f":"'Sommaire du rôle'!J40","v":288900},{"$f":"'Sommaire du rôle'!K40","v":0},null,288900,0,null,288900,null,9,1,null,{"$f":"'Sommaire du rôle'!L40","v":288900},{"$f":"'Sommaire du rôle'!M40","v":0},null,288900,0,null,288900,null,9,1,null,{"$f":"'Sommaire du rôle'!N40","v":288900},{"$f":"'Sommaire du rôle'!O40","v":0},null,288900,0,null,288900,null,9,1,null,{"$f":"'Sommaire du rôle'!P40","v":288900},{"$f":"'Sommaire du rôle'!Q40","v":0},null,288900,0,null,288900,null,9,1,null,{"$f":"'Sommaire du rôle'!R40","v":288900},{"$f":"'Sommaire du rôle'!S40","v":0},null,288900,0,null,288900,null,9,1,null,{"$f":"'Sommaire du rôle'!T40","v":288900},{"$f":"'Sommaire du rôle'!U40","v":0},null,288900,0,null,288900,null,9,1,null,{"$f":"'Sommaire du rôle'!V40","v":288900},{"$f":"'Sommaire du rôle'!W40","v":0},null,288900,0,null,288900,null,9,1,null,{"$f":"'Sommaire du rôle'!X40","v":288900},{"$f":"'Sommaire du rôle'!Y40","v":0},null,288900,0,null,288900,null,9,1,null,{"$f":"'Sommaire du rôle'!Z40","v":288900},{"$f":"'Sommaire du rôle'!AA40","v":0},null,288900,0,null,288900]
[10,1,null,{"$f":"'Sommaire du rôle'!H41","v":105068655},{"$f":"'Sommaire du rôle'!I41","v":5627790},null,105068655,5627790,null,110696445,null,10,1,null,{"$f":"'Sommaire du rôle'!J41","v":105068655},{"$f":"'Sommaire du rôle'!K41","v":5627790},null,105068655,5627790,null,110696445,null,10,1,null,{"$f":"'Sommaire du rôle'!L41","v":105068655},{"$f":"'Sommaire du rôle'!M41","v":5627790},null,105068655,5627790,null,110696445,null,10,1,null,{"$f":"'Sommaire du rôle'!N41","v":105068655},{"$f":"'Sommaire du rôle'!O41","v":5627790},null,105068655,5627790,null,110696445,null,10,1,null,{"$f":"'Sommaire du rôle'!P41","v":105068655},{"$f":"'Sommaire du rôle'!Q41","v":5627790},null,105068655,5627790,null,110696445,null,10,1,null,{"$f":"'Sommaire du rôle'!R41","v":105068655},{"$f":"'Sommaire du rôle'!S41","v":5627790},null,105068655,5627790,null,110696445,null,10,1,null,{"$f":"'Sommaire du rôle'!T41","v":105068655},{"$f":"'Sommaire du rôle'!U41","v":5627790},null,105068655,5627790,null,110696445,null,10,1,null,{"$f":"'Sommaire du rôle'!V41","v":105068655},{"$f":"'Sommaire du rôle'!W41","v":5627790},null,105068655,5627790,null,110696445,null,10,1,null,{"$f":"'Sommaire du rôle'!X41","v":105068655},{"$f":"'Sommaire du rôle'!Y41","v":5627790},null,105068655,5627790,null,110696445,null,10,1,null,{"$f":"'Sommaire du rôle'!Z41","v":105068655},{"$f":"'Sommaire du rôle'!AA41","v":5627790},null,105068655,5627790,null,110696445]
["11 Cours de triage","100%",null,{"$f":"'Sommaire du rôle'!H42","v":0},{"$f":"'Sommaire du rôle'!I42","v":0},null,0,0,null,0,null,"11 Cours de triage","100%",null,{"$f":"'Sommaire du rôle'!J42","v":0},{"$f":"'Sommaire du rôle'!K42","v":0},null,0,0,null,0,null,"11 Cours de triage","100%",null,{"$f":"'Sommaire du rôle'!L42","v":0},{"$f":"'Sommaire du rôle'!M42","v":0},null,0,0,null,0,null,"11 Cours de triage","100%",null,{"$f":"'Sommaire du rôle'!N42","v":0},{"$f":"'Sommaire du rôle'!O42","v":0},null,0,0,null,0,null,"11 Cours de triage","100%",null,{"$f":"'Sommaire du rôle'!P42","v":0},{"$f":"'Sommaire du rôle'!Q42","v":0},null,0,0,null,0,null,"11 Cours de triage","100%",null,{"$f":"'Sommaire du rôle'!R42","v":0},{"$f":"'Sommaire du rôle'!S42","v":0},null,0,0,null,0,null,"11 Cours de triage","100%",null,{"$f":"'Sommaire du rôle'!T42","v":0},{"$f":"'Sommaire du rôle'!U42","v":0},null,0,0,null,0,null,"11 Cours de triage","100%",null,{"$f":"'Sommaire du rôle'!V42","v":0},{"$f":"'Sommaire du rôle'!W42","v":0},null,0,0,null,0,null,"11 Cours de triage","100%",null,{"$f":"'Sommaire du rôle'!X42","v":0},{"$f":"'Sommaire du rôle'!Y42","v":0},null,0,0,null,0,null,"11 Cours de triage","100%",null,{"$f":"'Sommaire du rôle'!Z42","v":0},{"$f":"'Sommaire du rôle'!AA42","v":0},null,0,0,null,0]
["12 CHSLD",0.2,null,{"$f":"'Sommaire du rôle'!H43","v":0},null,null,0,null,null,0,null,"12 CHSLD",0.2,null,{"$f":"'Sommaire du rôle'!J43","v":0},null,null,0,null,null,0,null,"12 CHSLD",0.2,null,{"$f":"'Sommaire du rôle'!L43","v":0},null,null,0,null,null,0,null,"12 CHSLD",0.2,null,{"$f":"'Sommaire du rôle'!N43","v":0},null,null,0,null,null,0,null,"12 CHSLD",0.2,null,{"$f":"'Sommaire du rôle'!P43","v":0},null,null,0,null,null,0,null,"12 CHSLD",0.2,null,{"$f":"'Sommaire du rôle'!R43","v":0},null,null,0,null,null,0,null,"12 CHSLD",0.2,null,{"$f":"'Sommaire du rôle'!T43","v":0},null,null,0,null,null,0,null,"12 CHSLD",0.2,null,{"$f":"'Sommaire du rôle'!V43","v":0},null,null,0,null,null,0,null,"12 CHSLD",0.2,null,{"$f":"'Sommaire du rôle'!X43","v":0},null,null,0,null,null,0,null,"12 CHSLD",0.2,null,{"$f":"'Sommaire du rôle'!Z43","v":0},null,null,0,null,null,0]
["13 Cours de triage 40 %","40%",null,{"$f":"'Sommaire du rôle'!H44","v":0},null,null,0,null,null,0,null,"13 Cours de triage 40 %","40%",null,{"$f":"'Sommaire du rôle'!J44","v":0},null,null,0,null,null,0,null,"13 Cours de triage 40 %","40%",null,{"$f":"'Sommaire du rôle'!L44","v":0},null,null,0,null,null,0,null,"13 Cours de triage 40 %","40%",null,{"$f":"'Sommaire du rôle'!N44","v":0},null,null,0,null,null,0,null,"13 Cours de triage 40 %","40%",null,{"$f":"'Sommaire du rôle'!P44","v":0},null,null,0,null,null,0,null,"13 Cours de triage 40 %","40%",null,{"$f":"'Sommaire du rôle'!R44","v":0},null,null,0,null,null,0,null,"13 Cours de triage 40 %","40%",null,{"$f":"'Sommaire du rôle'!T44","v":0},null,null,0,null,null,0,null,"13 Cours de triage 40 %","40%",null,{"$f":"'Sommaire du rôle'!V44","v":0},null,null,0,null,null,0,null,"13 Cours de triage 40 %","40%",null,{"$f":"'Sommaire du rôle'!X44","v":0},null,null,0,null,null,0,null,"13 Cours de triage 40 %","40%",null,{"$f":"'Sommaire du rôle'!Z44","v":0},null,null,0,null,null,0]
[" APPLICATION DU TNR QUAND TTVD",1,null,{"$f":"'Sommaire du rôle'!H45","v":0},{"$f":"'Sommaire du rôle'!I45","v":0},null,0,{"$f":"B121*E121","v":0},null,0,null," APPLICATION DU TNR QUAND TTVD",1,null,{"$f":"'Sommaire du rôle'!J45","v":0},{"$f":"'Sommaire du rôle'!K45","v":0},null,0,{"$f":"M121*P121","v":0},null,0,null," APPLICATION DU TNR QUAND TTVD",1,null,{"$f":"'Sommaire du rôle'!L45","v":0},{"$f":"'Sommaire du rôle'!M45","v":0},null,0,{"$f":"X121*AA121","v":0},null,0,null," APPLICATION DU TNR QUAND TTVD",1,null,{"$f":"'Sommaire du rôle'!N45","v":0},{"$f":"'Sommaire du rôle'!O45","v":0},null,0,{"$f":"AI121*AL121","v":0},null,0,null," APPLICATION DU TNR QUAND TTVD",1,null,{"$f":"'Sommaire du rôle'!P45","v":0},{"$f":"'Sommaire du rôle'!Q45","v":0},null,0,{"$f":"AT121*AW121","v":0},null,0,null," APPLICATION DU TNR QUAND TTVD",1,null,{"$f":"'Sommaire du rôle'!R45","v":0},{"$f":"'Sommaire du rôle'!S45","v":0},null,0,{"$f":"BE121*BH121","v":0},null,0,null," APPLICATION DU TNR QUAND TTVD",1,null,{"$f":"'Sommaire du rôle'!T45","v":0},{"$f":"'Sommaire du rôle'!U45","v":0},null,0,{"$f":"BP121*BS121","v":0},null,0,null," APPLICATION DU TNR QUAND TTVD",1,null,{"$f":"'Sommaire du rôle'!AE45","v":0},{"$f":"'Sommaire du rôle'!AF45","v":0},null,0,{"$f":"CA121*CD121","v":0},null,0,null," APPLICATION DU TNR QUAND TTVD",1,null,{"$f":"'Sommaire du rôle'!X45","v":0},{"$f":"'Sommaire du rôle'!Y45","v":0},null,0,{"$f":"CL121*CO121","v":0},null,0,null," APPLICATION DU TNR QUAND TTVD",1,null,{"$f":"'Sommaire du rôle'!Z45","v":0},{"$f":"'Sommaire du rôle'!AA45","v":0},null,0,{"$f":"CW121*CZ121","v":0},null,0]
["Total",null,null,null,null,null,{"$f":"SUM(G106:G121)","v":112404699.09999999},{"$f":"SUM(H106:H121)","v":25925903},null,{"$f":"G122+H122","v":138330602.09999999},null,"Total",null,null,null,null,null,{"$f":"SUM(R106:R121)","v":112404699.09999999},{"$f":"SUM(S106:S121)","v":25925903},null,{"$f":"R122+S122","v":138330602.09999999},null,"Total",null,null,null,null,null,{"$f":"SUM(AC106:AC121)","v":112404699.09999999},{"$f":"SUM(AD106:AD121)","v":25925903},null,{"$f":"AC122+AD122","v":138330602.09999999},null,"Total",null,null,null,null,null,{"$f":"SUM(AN106:AN121)","v":112404699.09999999},{"$f":"SUM(AO106:AO121)","v":25925903},null,{"$f":"AN122+AO122","v":138330602.09999999},null,"Total",null,null,null,null,null,{"$f":"SUM(AY106:AY121)","v":112404699.09999999},{"$f":"SUM(AZ106:AZ121)","v":25925903},null,{"$f":"AY122+AZ122","v":138330602.09999999},null,"Total",null,null,null,null,null,{"$f":"SUM(BJ106:BJ121)","v":112404699.09999999},{"$f":"SUM(BK106:BK121)","v":25925903},null,{"$f":"BJ122+BK122","v":138330602.09999999},null,"Total",null,null,null,null,null,{"$f":"SUM(BU106:BU121)","v":112404699.09999999},{"$f":"SUM(BV106:BV121)","v":25925903},null,{"$f":"BU122+BV122","v":138330602.09999999},null,"Total",null,null,null,null,null,{"$f":"SUM(CF106:CF121)","v":112404699.09999999},{"$f":"SUM(CG106:CG121)","v":25925903},null,{"$f":"CF122+CG122","v":138330602.09999999},null,"Total",null,null,null,null,null,{"$f":"SUM(CQ106:CQ121)","v":112404699.09999999},{"$f":"SUM(CR106:CR121)","v":25925903},null,{"$f":"CQ122+CR122","v":138330602.09999999},null,"Total",null,null,null,null,null,{"$f":"SUM(DB106:DB121)","v":112404699.09999999},{"$f":"SUM(DC106:DC121)","v":25925903},null,{"$f":"DB122+DC122","v":138330602.09999999}]
[]
["ASSIETTE SOUS-CATÉGORIE RÉSIDUELLE"]
["Classe non résidentielle","Pourcentage de taxation",null,"VALEUR À 100 %"]
[null,null,null,"  Imposables","Compensables",null,"Imposables pondérées","Compensables pondérées",null,"Total"]
[null,"(1)",null,"(2)","(3)",null,"(4) = (1) X (2)","(5) = (1) X (3)",null,"(6) = (4) + (5)"]
[" 1A",0.999,null,{"$f":"'Sommaire du rôle'!F53","v":6957650},{"$f":"'Sommaire du rôle'!G53","v":0},null,{"$f":"D128*B128","v":6950692.3499999996},{"$f":"B128*E128","v":0},null,{"$f":"G128+H128","v":6950692.3499999996},2359638]
[" 1B",0.995,null,{"$f":"'Sommaire du rôle'!F54","v":3155670},{"$f":"'Sommaire du rôle'!G54","v":0},null,{"$f":"D129*B129","v":3139891.65},{"$f":"B129*E129","v":0},null,{"$f":"G129+H129","v":3139891.65},670132.5]
[" 1C",0.99,null,{"$f":"'Sommaire du rôle'!F55","v":444950},{"$f":"'Sommaire du rôle'!G55","v":0},null,440500.5,0,null,440500.5,4405005]
[2,0.97,null,{"$f":"'Sommaire du rôle'!F56","v":2146970},{"$f":"'Sommaire du rôle'!G56","v":0},null,2082560.9,0,null,2082560.9,21413332]
[3,0.94,null,{"$f":"'Sommaire du rôle'!F57","v":4013950},{"$f":"'Sommaire du rôle'!G57","v":0},null,3773113,0,null,3773113,36190282]
[4,0.88,null,{"$f":"'Sommaire du rôle'!F58","v":5477860},{"$f":"'Sommaire du rôle'!G58","v":0},null,4820516.8,0,null,4820516.8,27846104]
[5,0.78,null,{"$f":"'Sommaire du rôle'!F59","v":3513090},{"$f":"'Sommaire du rôle'!G59","v":0},null,2740210.2,0,null,2740210.2,22550424]
[6,0.6,null,{"$f":"'Sommaire du rôle'!F60","v":3502990},{"$f":"'Sommaire du rôle'!G60","v":0},null,2101794,0,null,2101794,19039560]
[7,0.4,null,{"$f":"'Sommaire du rôle'!F61","v":3597215},{"$f":"'Sommaire du rôle'!G61","v":6579670},null,1438886,2631868,null,4070754,37782600]
[8,0.15000000000000002,null,{"$f":"'Sommaire du rôle'!F62","v":2029370},{"$f":"'Sommaire du rôle'!G62","v":19235660},null,304405.50000000006,{"$f":"B137*E137","v":2885349.0000000005},null,3189754.5000000005,32037030.000000004]
["IMMEUBLES SANS PARTIE NON RÉSIDENTIELLE",1,null,{"$f":"'Sommaire du rôle'!F63","v":733457532.81818187},{"$f":"'Sommaire du rôle'!G63","v":190980},null,733457532.81818187,{"$f":"B138*E138","v":190980},null,733648512.81818187,7336485128]
["12  CHSLD",0.8,null,{"$f":"'Sommaire du rôle'!F64","v":13938200},{"$f":"'Sommaire du rôle'!G64","v":0},null,11150560]
["13 Cours de triage ",0.6,null,{"$f":"'Sommaire du rôle'!F65","v":0},{"$f":"'Sommaire du rôle'!G65","v":0},null,0]
["Total",null,null,null,null,null,{"$f":"SUM(G128:G140)","v":772400663.71818185},{"$f":"SUM(H128:H138)","v":5708197},0,{"$f":"G141+H141","v":778108860.71818185}]
[]
["ASSIETTE AU TAUX RÉSIDENTIEL SOUS-CATÉGORIE 1",null,null,null,null,null,null,null,null,null,null,"ASSIETTE AU TAUX RÉSIDENTIEL SOUS-CATÉGORIE 2",null,null,null,null,null,null,null,null,null,null,"ASSIETTE AU TAUX RÉSIDENTIEL SOUS-CATÉGORIE 3",null,null,null,null,null,null,null,null,null,null,"ASSIETTE AU TAUX RÉSIDENTIEL SOUS-CATÉGORIE 4",null,null,null,null,null,null,null,null,null,null,"ASSIETTE AU TAUX RÉSIDENTIEL SOUS-CATÉGORIE 5",null,null,null,null,null,null,null,null,null,null,"ASSIETTE AU TAUX RÉSIDENTIEL SOUS-CATÉGORIE 6",null,null,null,null,null,null,null,null,null,null,"ASSIETTE AU TAUX RÉSIDENTIEL SOUS-CATÉGORIE 7",null,null,null,null,null,null,null,null,null,null,"ASSIETTE AU TAUX RÉSIDENTIEL SOUS-CATÉGORIE 8",null,null,null,null,null,null,null,null,null,null,"ASSIETTE AU TAUX RÉSIDENTIEL SOUS-CATÉGORIE 9",null,null,null,null,null,null,null,null,null,null,"ASSIETTE AU TAUX RÉSIDENTIEL SOUS-CATÉGORIE 10"]
["Classe non résidentielle","Pourcentage de taxation",null,"VALEUR À 100 %",null,null,null,null,null,null,null,"Classe non résidentielle","Pourcentage de taxation",null,"VALEUR À 100 %",null,null,null,null,null,null,null,"Classe non résidentielle","Pourcentage de taxation",null,"VALEUR À 100 %",null,null,null,null,null,null,null,"Classe non résidentielle","Pourcentage de taxation",null,"VALEUR À 100 %",null,null,null,null,null,null,null,"Classe non résidentielle","Pourcentage de taxation",null,"VALEUR À 100 %",null,null,null,null,null,null,null,"Classe non résidentielle","Pourcentage de taxation",null,"VALEUR À 100 %",null,null,null,null,null,null,null,"Classe non résidentielle","Pourcentage de taxation",null,"VALEUR À 100 %",null,null,null,null,null,null,null,"Classe non résidentielle","Pourcentage de taxation",null,"VALEUR À 100 %",null,null,null,null,null,null,null,"Classe non résidentielle","Pourcentage de taxation",null,"VALEUR À 100 %",null,null,null,null,null,null,null,"Classe non résidentielle","Pourcentage de taxation",null,"VALEUR À 100 %"]
[null,null,null,"  Imposables","Compensables",null,"Imposables pondérées","Compensables pondérées",null,"Total",null,null,null,null,"  Imposables","Compensables",null,"Imposables pondérées","Compensables pondérées",null,"Total",null,null,null,null,"  Imposables","Compensables",null,"Imposables pondérées","Compensables pondérées",null,"Total",null,null,null,null,"  Imposables","Compensables",null,"Imposables pondérées","Compensables pondérées",null,"Total",null,null,null,null,"  Imposables","Compensables",null,"Imposables pondérées","Compensables pondérées",null,"Total",null,null,null,null,"  Imposables","Compensables",null,"Imposables pondérées","Compensables pondérées",null,"Total",null,null,null,null,"  Imposables","Compensables",null,"Imposables pondérées","Compensables pondérées",null,"Total",null,null,null,null,"  Imposables","Compensables",null,"Imposables pondérées","Compensables pondérées",null,"Total",null,null,null,null,"  Imposables","Compensables",null,"Imposables pondérées","Compensables pondérées",null,"Total",null,null,null,null,"  Imposables","Compensables",null,"Imposables pondérées","Compensables pondérées",null,"Total"]
[null,"(1)",null,"(2)","(3)",null,"(4) = (1) X (2)","(5) = (1) X (3)",null,"(6) = (4) + (5)",null,null,"(1)",null,"(2)","(3)",null,"(4) = (1) X (2)","(5) = (1) X (3)",null,"(6) = (4) + (5)",null,null,"(1)",null,"(2)","(3)",null,"(4) = (1) X (2)","(5) = (1) X (3)",null,"(6) = (4) + (5)",null,null,"(1)",null,"(2)","(3)",null,"(4) = (1) X (2)","(5) = (1) X (3)",null,"(6) = (4) + (5)",null,null,"(1)",null,"(2)","(3)",null,"(4) = (1) X (2)","(5) = (1) X (3)",null,"(6) = (4) + (5)",null,null,"(1)",null,"(2)","(3)",null,"(4) = (1) X (2)","(5) = (1) X (3)",null,"(6) = (4) + (5)",null,null,"(1)",null,"(2)","(3)",null,"(4) = (1) X (2)","(5) = (1) X (3)",null,"(6) = (4) + (5)",null,null,"(1)",null,"(2)","(3)",null,"(4) = (1) X (2)","(5) = (1) X (3)",null,"(6) = (4) + (5)",null,null,"(1)",null,"(2)","(3)",null,"(4) = (1) X (2)","(5) = (1) X (3)",null,"(6) = (4) + (5)",null,null,"(1)",null,"(2)","(3)",null,"(4) = (1) X (2)","(5) = (1) X (3)",null,"(6) = (4) + (5)"]
[" 1A",0.999,null,{"$f":"'Sommaire du rôle'!H53","v":6957650},{"$f":"'Sommaire du rôle'!I53","v":0},null,{"$f":"D147*B147","v":6950692.3499999996},{"$f":"B147*E147","v":0},null,{"$f":"G147+H147","v":6950692.3499999996},null," 1A",0.999,null,{"$f":"'Sommaire du rôle'!J53","v":6957650},{"$f":"'Sommaire du rôle'!K53","v":0},null,{"$f":"O147*M147","v":6950692.3499999996},{"$f":"M147*P147","v":0},null,{"$f":"R147+S147","v":6950692.3499999996},null," 1A",0.999,null,{"$f":"'Sommaire du rôle'!L53","v":6957650},{"$f":"'Sommaire du rôle'!M53","v":0},null,{"$f":"Z147*X147","v":6950692.3499999996},{"$f":"X147*AA147","v":0},null,{"$f":"AC147+AD147","v":6950692.3499999996},null," 1A",0.999,null,{"$f":"'Sommaire du rôle'!N53","v":6957650},{"$f":"'Sommaire du rôle'!O53","v":0},null,{"$f":"AK147*AI147","v":6950692.3499999996},{"$f":"AI147*AL147","v":0},null,{"$f":"AN147+AO147","v":6950692.3499999996},null," 1A",0.999,null,{"$f":"'Sommaire du rôle'!P53","v":6957650},{"$f":"'Sommaire du rôle'!Q53","v":0},null,{"$f":"AV147*AT147","v":6950692.3499999996},{"$f":"AT147*AW147","v":0},null,{"$f":"AY147+AZ147","v":6950692.3499999996},null," 1A",0.999,null,{"$f":"'Sommaire du rôle'!R53","v":6957650},{"$f":"'Sommaire du rôle'!S53","v":0},null,{"$f":"BG147*BE147","v":6950692.3499999996},{"$f":"BE147*BH147","v":0},null,{"$f":"BJ147+BK147","v":6950692.3499999996},null," 1A",0.999,null,{"$f":"'Sommaire du rôle'!T53","v":6957650},{"$f":"'Sommaire du rôle'!U53","v":0},null,{"$f":"BR147*BP147","v":6950692.3499999996},{"$f":"BP147*BS147","v":0},null,{"$f":"BU147+BV147","v":6950692.3499999996},null," 1A",0.999,null,{"$f":"'Sommaire du rôle'!V53","v":6957650},{"$f":"'Sommaire du rôle'!W53","v":0},null,{"$f":"CC147*CA147","v":6950692.3499999996},{"$f":"CA147*CD147","v":0},null,{"$f":"CF147+CG147","v":6950692.3499999996},null," 1A",0.999,null,{"$f":"'Sommaire du rôle'!X53","v":6957650},{"$f":"'Sommaire du rôle'!Y53","v":0},null,{"$f":"CN147*CL147","v":6950692.3499999996},{"$f":"CL147*CO147","v":0},null,{"$f":"CQ147+CR147","v":6950692.3499999996},null," 1A",0.999,null,{"$f":"'Sommaire du rôle'!Z53","v":6957650},{"$f":"'Sommaire du rôle'!AA53","v":0},null,{"$f":"CY147*CW147","v":6950692.3499999996},{"$f":"CW147*CZ147","v":0},null,{"$f":"DB147+DC147","v":6950692.3499999996}]
[" 1B",0.995,null,{"$f":"'Sommaire du rôle'!H54","v":3155670},{"$f":"'Sommaire du rôle'!I54","v":0},null,{"$f":"D148*B148","v":3139891.65},{"$f":"B148*E148","v":0},null,{"$f":"G148+H148","v":3139891.65},null," 1B",0.995,null,{"$f":"'Sommaire du rôle'!J54","v":3155670},{"$f":"'Sommaire du rôle'!K54","v":0},null,{"$f":"O148*M148","v":3139891.65},{"$f":"M148*P148","v":0},null,{"$f":"R148+S148","v":3139891.65},null," 1B",0.995,null,{"$f":"'Sommaire du rôle'!L54","v":3155670},{"$f":"'Sommaire du rôle'!M54","v":0},null,{"$f":"Z148*X148","v":3139891.65},{"$f":"X148*AA148","v":0},null,{"$f":"AC148+AD148","v":3139891.65},null," 1B",0.995,null,{"$f":"'Sommaire du rôle'!N54","v":3155670},{"$f":"'Sommaire du rôle'!O54","v":0},null,{"$f":"AK148*AI148","v":3139891.65},{"$f":"AI148*AL148","v":0},null,{"$f":"AN148+AO148","v":3139891.65},null," 1B",0.995,null,{"$f":"'Sommaire du rôle'!P54","v":3155670},{"$f":"'Sommaire du rôle'!Q54","v":0},null,{"$f":"AV148*AT148","v":3139891.65},{"$f":"AT148*AW148","v":0},null,{"$f":"AY148+AZ148","v":3139891.65},null," 1B",0.995,null,{"$f":"'Sommaire du rôle'!R54","v":3155670},{"$f":"'Sommaire du rôle'!S54","v":0},null,{"$f":"BG148*BE148","v":3139891.65},{"$f":"BE148*BH148","v":0},null,{"$f":"BJ148+BK148","v":3139891.65},null," 1B",0.995,null,{"$f":"'Sommaire du rôle'!T54","v":3155670},{"$f":"'Sommaire du rôle'!U54","v":0},null,{"$f":"BR148*BP148","v":3139891.65},{"$f":"BP148*BS148","v":0},null,{"$f":"BU148+BV148","v":3139891.65},null," 1B",0.995,null,{"$f":"'Sommaire du rôle'!V54","v":3155670},{"$f":"'Sommaire du rôle'!W54","v":0},null,{"$f":"CC148*CA148","v":3139891.65},{"$f":"CA148*CD148","v":0},null,{"$f":"CF148+CG148","v":3139891.65},null," 1B",0.995,null,{"$f":"'Sommaire du rôle'!X54","v":3155670},{"$f":"'Sommaire du rôle'!Y54","v":0},null,{"$f":"CN148*CL148","v":3139891.65},{"$f":"CL148*CO148","v":0},null,{"$f":"CQ148+CR148","v":3139891.65},null," 1B",0.995,null,{"$f":"'Sommaire du rôle'!Z54","v":3155670},{"$f":"'Sommaire du rôle'!AA54","v":0},null,{"$f":"CY148*CW148","v":3139891.65},{"$f":"CW148*CZ148","v":0},null,{"$f":"DB148+DC148","v":3139891.65}]
[" 1C",0.99,null,{"$f":"'Sommaire du rôle'!H55","v":444950},{"$f":"'Sommaire du rôle'!I55","v":0},null,440500.5,0,null,440500.5,null," 1C",0.99,null,{"$f":"'Sommaire du rôle'!J55","v":444950},{"$f":"'Sommaire du rôle'!K55","v":0},null,440500.5,0,null,440500.5,null," 1C",0.99,null,{"$f":"'Sommaire du rôle'!L55","v":444950},{"$f":"'Sommaire du rôle'!M55","v":0},null,440500.5,0,null,440500.5,null," 1C",0.99,null,{"$f":"'Sommaire du rôle'!N55","v":444950},{"$f":"'Sommaire du rôle'!O55","v":0},null,440500.5,0,null,440500.5,null," 1C",0.99,null,{"$f":"'Sommaire du rôle'!P55","v":444950},{"$f":"'Sommaire du rôle'!Q55","v":0},null,440500.5,0,null,440500.5,null," 1C",0.99,null,{"$f":"'Sommaire du rôle'!R55","v":444950},{"$f":"'Sommaire du rôle'!S55","v":0},null,440500.5,0,null,440500.5,null," 1C",0.99,null,{"$f":"'Sommaire du rôle'!T55","v":444950},{"$f":"'Sommaire du rôle'!U55","v":0},null,440500.5,0,null,440500.5,null," 1C",0.99,null,{"$f":"'Sommaire du rôle'!V55","v":444950},{"$f":"'Sommaire du rôle'!W55","v":0},null,440500.5,0,null,440500.5,null," 1C",0.99,null,{"$f":"'Sommaire du rôle'!X55","v":444950},{"$f":"'Sommaire du rôle'!Y55","v":0},null,440500.5,0,null,440500.5,null," 1C",0.99,null,{"$f":"'Sommaire du rôle'!Z55","v":444950},{"$f":"'Sommaire du rôle'!AA55","v":0},null,440500.5,0,null,440500.5]
[2,0.97,null,{"$f":"'Sommaire du rôle'!H56","v":2146970},{"$f":"'Sommaire du rôle'!I56","v":0},null,2082560.9,0,null,2082560.9,null,2,0.97,null,{"$f":"'Sommaire du rôle'!J56","v":2146970},{"$f":"'Sommaire du rôle'!K56","v":0},null,2082560.9,0,null,2082560.9,null,2,0.97,null,{"$f":"'Sommaire du rôle'!L56","v":2146970},{"$f":"'Sommaire du rôle'!M56","v":0},null,2082560.9,0,null,2082560.9,null,2,0.97,null,{"$f":"'Sommaire du rôle'!N56","v":2146970},{"$f":"'Sommaire du rôle'!O56","v":0},null,2082560.9,0,null,2082560.9,null,2,0.97,null,{"$f":"'Sommaire du rôle'!P56","v":2146970},{"$f":"'Sommaire du rôle'!Q56","v":0},null,2082560.9,0,null,2082560.9,null,2,0.97,null,{"$f":"'Sommaire du rôle'!R56","v":2146970},{"$f":"'Sommaire du rôle'!S56","v":0},null,2082560.9,0,null,2082560.9,null,2,0.97,null,{"$f":"'Sommaire du rôle'!T56","v":2146970},{"$f":"'Sommaire du rôle'!U56","v":0},null,2082560.9,0,null,2082560.9,null,2,0.97,null,{"$f":"'Sommaire du rôle'!V56","v":2146970},{"$f":"'Sommaire du rôle'!W56","v":0},null,2082560.9,0,null,2082560.9,null,2,0.97,null,{"$f":"'Sommaire du rôle'!X56","v":2146970},{"$f":"'Sommaire du rôle'!Y56","v":0},null,2082560.9,0,null,2082560.9,null,2,0.97,null,{"$f":"'Sommaire du rôle'!Z56","v":2146970},{"$f":"'Sommaire du rôle'!AA56","v":0},null,2082560.9,0,null,2082560.9]
[3,0.94,null,{"$f":"'Sommaire du rôle'!H57","v":4013950},{"$f":"'Sommaire du rôle'!I57","v":0},null,3773113,0,null,3773113,null,3,0.94,null,{"$f":"'Sommaire du rôle'!J57","v":4013950},{"$f":"'Sommaire du rôle'!K57","v":0},null,3773113,0,null,3773113,null,3,0.94,null,{"$f":"'Sommaire du rôle'!L57","v":4013950},{"$f":"'Sommaire du rôle'!M57","v":0},null,3773113,0,null,3773113,null,3,0.94,null,{"$f":"'Sommaire du rôle'!N57","v":4013950},{"$f":"'Sommaire du rôle'!O57","v":0},null,3773113,0,null,3773113,null,3,0.94,null,{"$f":"'Sommaire du rôle'!P57","v":4013950},{"$f":"'Sommaire du rôle'!Q57","v":0},null,3773113,0,null,3773113,null,3,0.94,null,{"$f":"'Sommaire du rôle'!R57","v":4013950},{"$f":"'Sommaire du rôle'!S57","v":0},null,3773113,0,null,3773113,null,3,0.94,null,{"$f":"'Sommaire du rôle'!T57","v":4013950},{"$f":"'Sommaire du rôle'!U57","v":0},null,3773113,0,null,3773113,null,3,0.94,null,{"$f":"'Sommaire du rôle'!V57","v":4013950},{"$f":"'Sommaire du rôle'!W57","v":0},null,3773113,0,null,3773113,null,3,0.94,null,{"$f":"'Sommaire du rôle'!X57","v":4013950},{"$f":"'Sommaire du rôle'!Y57","v":0},null,3773113,0,null,3773113,null,3,0.94,null,{"$f":"'Sommaire du rôle'!Z57","v":4013950},{"$f":"'Sommaire du rôle'!AA57","v":0},null,3773113,0,null,3773113]
[4,0.88,null,{"$f":"'Sommaire du rôle'!H58","v":5477860},{"$f":"'Sommaire du rôle'!I58","v":0},null,4820516.8,0,null,4820516.8,null,4,0.88,null,{"$f":"'Sommaire du rôle'!J58","v":5477860},{"$f":"'Sommaire du rôle'!K58","v":0},null,4820516.8,0,null,4820516.8,null,4,0.88,null,{"$f":"'Sommaire du rôle'!L58","v":5477860},{"$f":"'Sommaire du rôle'!M58","v":0},null,4820516.8,0,null,4820516.8,null,4,0.88,null,{"$f":"'Sommaire du rôle'!N58","v":5477860},{"$f":"'Sommaire du rôle'!O58","v":0},null,4820516.8,0,null,4820516.8,null,4,0.88,null,{"$f":"'Sommaire du rôle'!P58","v":5477860},{"$f":"'Sommaire du rôle'!Q58","v":0},null,4820516.8,0,null,4820516.8,null,4,0.88,null,{"$f":"'Sommaire du rôle'!R58","v":5477860},{"$f":"'Sommaire du rôle'!S58","v":0},null,4820516.8,0,null,4820516.8,null,4,0.88,null,{"$f":"'Sommaire du rôle'!T58","v":5477860},{"$f":"'Sommaire du rôle'!U58","v":0},null,4820516.8,0,null,4820516.8,null,4,0.88,null,{"$f":"'Sommaire du rôle'!V58","v":5477860},{"$f":"'Sommaire du rôle'!W58","v":0},null,4820516.8,0,null,4820516.8,null,4,0.88,null,{"$f":"'Sommaire du rôle'!X58","v":5477860},{"$f":"'Sommaire du rôle'!Y58","v":0},null,4820516.8,0,null,4820516.8,null,4,0.88,null,{"$f":"'Sommaire du rôle'!Z58","v":5477860},{"$f":"'Sommaire du rôle'!AA58","v":0},null,4820516.8,0,null,4820516.8]
[5,0.78,null,{"$f":"'Sommaire du rôle'!H59","v":3513090},{"$f":"'Sommaire du rôle'!I59","v":0},null,2740210.2,0,null,2740210.2,null,5,0.78,null,{"$f":"'Sommaire du rôle'!J59","v":3513090},{"$f":"'Sommaire du rôle'!K59","v":0},null,2740210.2,0,null,2740210.2,null,5,0.78,null,{"$f":"'Sommaire du rôle'!L59","v":3513090},{"$f":"'Sommaire du rôle'!M59","v":0},null,2740210.2,0,null,2740210.2,null,5,0.78,null,{"$f":"'Sommaire du rôle'!N59","v":3513090},{"$f":"'Sommaire du rôle'!O59","v":0},null,2740210.2,0,null,2740210.2,null,5,0.78,null,{"$f":"'Sommaire du rôle'!P59","v":3513090},{"$f":"'Sommaire du rôle'!Q59","v":0},null,2740210.2,0,null,2740210.2,null,5,0.78,null,{"$f":"'Sommaire du rôle'!R59","v":3513090},{"$f":"'Sommaire du rôle'!S59","v":0},null,2740210.2,0,null,2740210.2,null,5,0.78,null,{"$f":"'Sommaire du rôle'!T59","v":3513090},{"$f":"'Sommaire du rôle'!U59","v":0},null,2740210.2,0,null,2740210.2,null,5,0.78,null,{"$f":"'Sommaire du rôle'!V59","v":3513090},{"$f":"'Sommaire du rôle'!W59","v":0},null,2740210.2,0,null,2740210.2,null,5,0.78,null,{"$f":"'Sommaire du rôle'!X59","v":3513090},{"$f":"'Sommaire du rôle'!Y59","v":0},null,2740210.2,0,null,2740210.2,null,5,0.78,null,{"$f":"'Sommaire du rôle'!Z59","v":3513090},{"$f":"'Sommaire du rôle'!AA59","v":0},null,2740210.2,0,null,2740210.2]
[6,0.6,null,{"$f":"'Sommaire du rôle'!H60","v":3502990},{"$f":"'Sommaire du rôle'!I60","v":0},null,2101794,0,null,2101794,null,6,0.6,null,{"$f":"'Sommaire du rôle'!J60","v":3502990},{"$f":"'Sommaire du rôle'!K60","v":0},null,2101794,0,null,2101794,null,6,0.6,null,{"$f":"'Sommaire du rôle'!L60","v":3502990},{"$f":"'Sommaire du rôle'!M60","v":0},null,2101794,0,null,2101794,null,6,0.6,null,{"$f":"'Sommaire du rôle'!N60","v":3502990},{"$f":"'Sommaire du rôle'!O60","v":0},null,2101794,0,null,2101794,null,6,0.6,null,{"$f":"'Sommaire du rôle'!P60","v":3502990},{"$f":"'Sommaire du rôle'!Q60","v":0},null,2101794,0,null,2101794,null,6,0.6,null,{"$f":"'Sommaire du rôle'!R60","v":3502990},{"$f":"'Sommaire du rôle'!S60","v":0},null,2101794,0,null,2101794,null,6,0.6,null,{"$f":"'Sommaire du rôle'!T60","v":3502990},{"$f":"'Sommaire du rôle'!U60","v":0},null,2101794,0,null,2101794,null,6,0.6,null,{"$f":"'Sommaire du rôle'!V60","v":3502990},{"$f":"'Sommaire du rôle'!W60","v":0},null,2101794,0,null,2101794,null,6,0.6,null,{"$f":"'Sommaire du rôle'!X60","v":3502990},{"$f":"'Sommaire du rôle'!Y60","v":0},null,2101794,0,null,2101794,null,6,0.6,null,{"$f":"'Sommaire du rôle'!Z60","v":3502990},{"$f":"'Sommaire du rôle'!AA60","v":0},null,2101794,0,null,2101794]
[7,0.4,null,{"$f":"'Sommaire du rôle'!H61","v":3597215},{"$f":"'Sommaire du rôle'!I61","v":6579670},null,1438886,2631868,null,4070754,null,7,0.4,null,{"$f":"'Sommaire du rôle'!J61","v":3597215},{"$f":"'Sommaire du rôle'!K61","v":6579670},null,1438886,2631868,null,4070754,null,7,0.4,null,{"$f":"'Sommaire du rôle'!L61","v":3597215},{"$f":"'Sommaire du rôle'!M61","v":6579670},null,1438886,2631868,null,4070754,null,7,0.4,null,{"$f":"'Sommaire du rôle'!N61","v":3597215},{"$f":"'Sommaire du rôle'!O61","v":6579670},null,1438886,2631868,null,4070754,null,7,0.4,null,{"$f":"'Sommaire du rôle'!P61","v":3597215},{"$f":"'Sommaire du rôle'!Q61","v":6579670},null,1438886,2631868,null,4070754,null,7,0.4,null,{"$f":"'Sommaire du rôle'!R61","v":3597215},{"$f":"'Sommaire du rôle'!S61","v":6579670},null,1438886,2631868,null,4070754,null,7,0.4,null,{"$f":"'Sommaire du rôle'!T61","v":3597215},{"$f":"'Sommaire du rôle'!U61","v":6579670},null,1438886,2631868,null,4070754,null,7,0.4,null,{"$f":"'Sommaire du rôle'!V61","v":3597215},{"$f":"'Sommaire du rôle'!W61","v":6579670},null,1438886,2631868,null,4070754,null,7,0.4,null,{"$f":"'Sommaire du rôle'!X61","v":3597215},{"$f":"'Sommaire du rôle'!Y61","v":6579670},null,1438886,2631868,null,4070754,null,7,0.4,null,{"$f":"'Sommaire du rôle'!Z61","v":3597215},{"$f":"'Sommaire du rôle'!AA61","v":6579670},null,1438886,2631868,null,4070754]
[8,0.15000000000000002,null,{"$f":"'Sommaire du rôle'!H62","v":2029370},{"$f":"'Sommaire du rôle'!I62","v":19235660},null,304405.50000000006,{"$f":"B156*E156","v":2885349.0000000005},null,3189754.5000000005,null,8,0.15000000000000002,null,{"$f":"'Sommaire du rôle'!J62","v":2029370},{"$f":"'Sommaire du rôle'!K62","v":19235660},null,304405.50000000006,{"$f":"M156*P156","v":2885349.0000000005},null,3189754.5000000005,null,8,0.15000000000000002,null,{"$f":"'Sommaire du rôle'!L62","v":2029370},{"$f":"'Sommaire du rôle'!M62","v":19235660},null,304405.50000000006,{"$f":"X156*AA156","v":2885349.0000000005},null,3189754.5000000005,null,8,0.15000000000000002,null,{"$f":"'Sommaire du rôle'!N62","v":2029370},{"$f":"'Sommaire du rôle'!O62","v":19235660},null,304405.50000000006,{"$f":"AI156*AL156","v":2885349.0000000005},null,3189754.5000000005,null,8,0.15000000000000002,null,{"$f":"'Sommaire du rôle'!P62","v":2029370},{"$f":"'Sommaire du rôle'!Q62","v":19235660},null,304405.50000000006,{"$f":"AT156*AW156","v":2885349.0000000005},null,3189754.5000000005,null,8,0.15000000000000002,null,{"$f":"'Sommaire du rôle'!R62","v":2029370},{"$f":"'Sommaire du rôle'!S62","v":19235660},null,304405.50000000006,{"$f":"BE156*BH156","v":2885349.0000000005},null,3189754.5000000005,null,8,0.15000000000000002,null,{"$f":"'Sommaire du rôle'!T62","v":2029370},{"$f":"'Sommaire du rôle'!U62","v":19235660},null,304405.50000000006,{"$f":"BP156*BS156","v":2885349.0000000005},null,3189754.5000000005,null,8,0.15000000000000002,null,{"$f":"'Sommaire du rôle'!V62","v":2029370},{"$f":"'Sommaire du rôle'!W62","v":19235660},null,304405.50000000006,{"$f":"CA156*CD156","v":2885349.0000000005},null,3189754.5000000005,null,8,0.15000000000000002,null,{"$f":"'Sommaire du rôle'!X62","v":2029370},{"$f":"'Sommaire du rôle'!Y62","v":19235660},null,304405.50000000006,{"$f":"CL156*CO156","v":2885349.0000000005},null,3189754.5000000005,null,8,0.15000000000000002,null,{"$f":"'Sommaire du rôle'!Z62","v":2029370},{"$f":"'Sommaire du rôle'!AA62","v":19235660},null,304405.50000000006,{"$f":"CW156*CZ156","v":2885349.0000000005},null,3189754.5000000005]
["IMMEUBLES SANS PARTIE NON RÉSIDENTIELLE",1,null,{"$f":"'Sommaire du rôle'!H63","v":733457532.81818187},{"$f":"'Sommaire du rôle'!I63","v":190980},null,733457532.81818187,{"$f":"B157*E157","v":190980},null,733648512.81818187,null,"IMMEUBLES SANS PARTIE NON RÉSIDENTIELLE",1,null,{"$f":"'Sommaire du rôle'!J63","v":733457532.81818187},{"$f":"'Sommaire du rôle'!K63","v":190980},null,733457532.81818187,{"$f":"M157*P157","v":190980},null,733648512.81818187,null,"IMMEUBLES SANS PARTIE NON RÉSIDENTIELLE",1,null,{"$f":"'Sommaire du rôle'!L63","v":733457532.81818187},{"$f":"'Sommaire du rôle'!M63","v":190980},null,733457532.81818187,{"$f":"X157*AA157","v":190980},null,733648512.81818187,null,"IMMEUBLES SANS PARTIE NON RÉSIDENTIELLE",1,null,{"$f":"'Sommaire du rôle'!N63","v":733457532.81818187},{"$f":"'Sommaire du rôle'!O63","v":190980},null,733457532.81818187,{"$f":"AI157*AL157","v":190980},null,733648512.81818187,null,"IMMEUBLES SANS PARTIE NON RÉSIDENTIELLE",1,null,{"$f":"'Sommaire du rôle'!P63","v":733457532.81818187},{"$f":"'Sommaire du rôle'!Q63","v":190980},null,733457532.81818187,{"$f":"AT157*AW157","v":190980},null,733648512.81818187,null,"IMMEUBLES SANS PARTIE NON RÉSIDENTIELLE",1,null,{"$f":"'Sommaire du rôle'!R63","v":733457532.81818187},{"$f":"'Sommaire du rôle'!S63","v":190980},null,733457532.81818187,{"$f":"BE157*BH157","v":190980},null,733648512.81818187,null,"IMMEUBLES SANS PARTIE NON RÉSIDENTIELLE",1,null,{"$f":"'Sommaire du rôle'!T63","v":733457532.81818187},{"$f":"'Sommaire du rôle'!U63","v":190980},null,733457532.81818187,{"$f":"BP157*BS157","v":190980},null,733648512.81818187,null,"IMMEUBLES SANS PARTIE NON RÉSIDENTIELLE",1,null,{"$f":"'Sommaire du rôle'!V63","v":733457532.81818187},{"$f":"'Sommaire du rôle'!W63","v":190980},null,733457532.81818187,{"$f":"CA157*CD157","v":190980},null,733648512.81818187,null,"IMMEUBLES SANS PARTIE NON RÉSIDENTIELLE",1,null,{"$f":"'Sommaire du rôle'!X63","v":733457532.81818187},{"$f":"'Sommaire du rôle'!Y63","v":190980},null,733457532.81818187,{"$f":"CL157*CO157","v":190980},null,733648512.81818187,null,"IMMEUBLES SANS PARTIE NON RÉSIDENTIELLE",1,null,{"$f":"'Sommaire du rôle'!Z63","v":733457532.81818187},{"$f":"'Sommaire du rôle'!AA63","v":190980},null,733457532.81818187,{"$f":"CW157*CZ157","v":190980},null,733648512.81818187]
["12  CHSLD",0.8,null,null,null,null,0,null,null,null,null,"12  CHSLD",0.8,null,null,null,null,0,null,null,null,null,"12  CHSLD",0.8,null,null,null,null,0,null,null,null,null,"12  CHSLD",0.8,null,null,null,null,0,null,null,null,null,"12  CHSLD",0.8,null,null,null,null,0,null,null,null,null,"12  CHSLD",0.8,null,null,null,null,0,null,null,null,null,"12  CHSLD",0.8,null,null,null,null,0,null,null,null,null,"12  CHSLD",0.8,null,null,null,null,0,null,null,null,null,"12  CHSLD",0.8,null,null,null,null,null,null,null,null,null,"12  CHSLD",0.8]
["13 Cours de triage ",0.6,null,null,null,null,0,null,null,null,null,"13 Cours de triage ",0.6,null,null,null,null,0,null,null,null,null,"13 Cours de triage ",0.6,null,null,null,null,0,null,null,null,null,"13 Cours de triage ",0.6,null,null,null,null,0,null,null,null,null,"13 Cours de triage ",0.6,null,null,null,null,0,null,null,null,null,"13 Cours de triage ",0.6,null,null,null,null,0,null,null,null,null,"13 Cours de triage ",0.6,null,null,null,null,0,null,null,null,null,"13 Cours de triage ",0.6,null,null,null,null,0,null,null,null,null,"13 Cours de triage ",0.6,null,null,null,null,null,null,null,null,null,"13 Cours de triage ",0.6]
["Total",null,null,null,null,null,{"$f":"SUM(G147:G159)","v":761250103.71818185},{"$f":"SUM(H147:H157)","v":5708197},0,{"$f":"G160+H160","v":766958300.71818185},null,"Total",null,null,null,null,null,{"$f":"SUM(R147:R159)","v":761250103.71818185},{"$f":"SUM(S147:S157)","v":5708197},null,{"$f":"R160+S160","v":766958300.71818185},null,"Total",null,null,null,null,null,{"$f":"SUM(AC147:AC159)","v":761250103.71818185},{"$f":"SUM(AD147:AD157)","v":5708197},null,{"$f":"AC160+AD160","v":766958300.71818185},null,"Total",null,null,null,null,null,{"$f":"SUM(AN147:AN159)","v":761250103.71818185},{"$f":"SUM(AO147:AO157)","v":5708197},null,{"$f":"AN160+AO160","v":766958300.71818185},null,"Total",null,null,null,null,null,{"$f":"SUM(AY147:AY159)","v":761250103.71818185},{"$f":"SUM(AZ147:AZ157)","v":5708197},null,{"$f":"AY160+AZ160","v":766958300.71818185},null,"Total",null,null,null,null,null,{"$f":"SUM(BJ147:BJ159)","v":761250103.71818185},{"$f":"SUM(BK147:BK157)","v":5708197},null,{"$f":"BJ160+BK160","v":766958300.71818185},null,"Total",null,null,null,null,null,{"$f":"SUM(BU147:BU159)","v":761250103.71818185},{"$f":"SUM(BV147:BV157)","v":5708197},null,{"$f":"BU160+BV160","v":766958300.71818185},null,"Total",null,null,null,null,null,{"$f":"SUM(CF147:CF159)","v":761250103.71818185},{"$f":"SUM(CG147:CG157)","v":5708197},null,{"$f":"CF160+CG160","v":766958300.71818185},null,"Total",null,null,null,null,null,{"$f":"SUM(CQ147:CQ159)","v":761250103.71818185},{"$f":"SUM(CR147:CR157)","v":5708197},null,{"$f":"CQ160+CR160","v":766958300.71818185},null,"Total",null,null,null,null,null,{"$f":"SUM(DB147:DB159)","v":761250103.71818185},{"$f":"SUM(DC147:DC157)","v":5708197},null,{"$f":"DB160+DC160","v":766958300.71818185}]

{"sheet":"Scénario-taux variés","index":3,"n_rows":221,"n_cols":12,"rows_kept":221,"cut":false,"hidden":false,"merged":[[7,0,7,2],[12,4,12,5],[138,4,138,5],[12,6,13,7],[24,0,24,3],[36,0,36,2],[37,0,37,2],[38,0,38,3],[14,2,14,3],[15,2,15,3],[16,2,16,3],[17,2,17,3],[18,2,18,3],[19,2,19,3],[20,2,20,3],[21,2,21,3],[22,2,22,3],[23,2,23,3],[25,2,25,3],[26,2,26,3],[27,2,27,3],[33,2,33,3],[34,2,34,3],[28,2,28,3],[29,2,29,3],[30,2,30,3],[31,2,31,3],[32,2,32,3]]}
[]
[]
["CHOIX DES COEFFICIENTS SELON LES BALISES ET CALCUL DU TAUX DE BASE"]
["Il faut remplir les cases ombragées (motif à points) pour faire fonctionner le simulateur."]
["Note : Les assiettes de taxation du modèle n'incluent que les valeurs imposables."]
[]
["Nom de la municipalité =",null,null,null,null,"Année:"]
["Population de la municipalité ou de l'agglomération, s'il y a lieu =",null,null,null,1000000,"habitants",null,{"$f":"IF(E8=0,\"Inscrivez  la population\",\"-\")","v":"-"}]
["Recettes de la taxe foncière générale =",null,null,null,94624103,"(prévues au budget)",null,{"$f":"IF(E9=0,\"Inscrivez des recettes\",\"-\")","v":"-"}]
["Nom du scénario =",null,null,null,"Scénario 1"]
[]
["MULTIPLES DU TAUX DE BASE "]
[null,null,null,null,"Balises des coefficients par rapport au taux de base (TB)",null,"Choisir un coefficient par rapport au taux de base",null,"Validation","Explication"]
[null,null,null,null,"Minimum ","Maximum"]
["Taux sous-catégorie résidentielle 1 (TSCR 1)",null,{"$f":"IF('Sommaire du rôle'!$H$50>0,'Sommaire du rôle'!$H$50,\"-\")","v":"sr1"},null,0.66600000000000004,1.333,1,"X TB",{"$f":"IF(G15>0,IF(AND(E15<=G15,F15>=G15),\"-\",\"INVALIDE\"),\"-\")","v":"-"},{"$f":"IF(I15=\"INVALIDE\",IF(G15<E15,\"Le coefficient est inférieur au minimum.\",\"Le coefficient est supérieur au maximum.\"),\"-\")","v":"-"},{"$f":"IF(I15=\"INVALIDE\",1,0)","v":0}]
["Taux sous-catégorie résidentielle 2 (TSCR 2)",null,{"$f":"IF('Sommaire du rôle'!$J$50>0,'Sommaire du rôle'!$J$50,\"-\")","v":"sr2"},null,0.66600000000000004,1.333,1.333,"X TB",{"$f":"IF(G16>0,IF(AND(E16<=G16,F16>=G16),\"-\",\"INVALIDE\"),\"-\")","v":"-"},{"$f":"IF(I16=\"INVALIDE\",IF(G16<E16,\"Le coefficient est inférieur au minimum.\",\"Le coefficient est supérieur au maximum.\"),\"-\")","v":"-"},0]
["Taux sous-catégorie résidentielle 3 (TSCR 3)",null,{"$f":"IF('Sommaire du rôle'!$L$50>0,'Sommaire du rôle'!$L$50,\"-\")","v":"sr3"},null,0.66600000000000004,1.333,1.333,"X TB","-","-",0]
["Taux sous-catégorie résidentielle 4 (TSCR 4)",null,{"$f":"IF('Sommaire du rôle'!$N$50>0,'Sommaire du rôle'!$N$50,\"-\")","v":"sr4"},null,0.66600000000000004,1.333,1.333,"X TB","-","-",0]
["Taux sous-catégorie résidentielle 5 (TSCR 5)",null,{"$f":"IF('Sommaire du rôle'!$N$50>0,'Sommaire du rôle'!$P$50,\"-\")","v":"sr5"},null,0.66600000000000004,1.333,1.333,"X TB","-","-",0]
["Taux sous-catégorie résidentielle 6 (TSCR 6)",null,{"$f":"IF('Sommaire du rôle'!$R$50>0,'Sommaire du rôle'!$R$50,\"-\")","v":"sr6"},null,0.66600000000000004,1.333,1.333,"X TB","-","-",0]
["Taux sous-catégorie résidentielle 7 (TSCR 7)",null,{"$f":"IF('Sommaire du rôle'!$T$50>0,'Sommaire du rôle'!$T$50,\"-\")","v":"sr7"},null,0.66600000000000004,1.333,1.333,"X TB","-","-",0]
["Taux sous-catégorie résidentielle 8 (TSCR 8)",null,{"$f":"IF('Sommaire du rôle'!$V$50>0,'Sommaire du rôle'!$V$50,\"-\")","v":"sr8"},null,0.66600000000000004,1.333,1.333,"X TB","-","-",0]
["Taux sous-catégorie résidentielle 9 (TSCR 9)",null,{"$f":"IF('Sommaire du rôle'!$X$50>0,'Sommaire du rôle'!$X$50,\"-\")","v":"sr9"},null,0.66600000000000004,1.333,1.333,"X TB","-","-",0]
["Taux sous-catégorie résidentielle 10 (TSCR 10)",null,{"$f":"IF('Sommaire du rôle'!$Z$50>0,'Sommaire du rôle'!$Z$50,\"-\")","v":"sr10"},null,0.66600000000000004,1.333,1.333,"X TB","-","-",0]
["Taux non résidentiel ou sous-catégorie de référence (TINR)",null,null,null,1,{"$f":"'Balises-Taux'!B10","v":4.8},{"$f":"F25","v":4.8},"X TB",{"$f":"IF(G25>0,IF(AND(E25<=G25,F25>=G25),\"-\",\"INVALIDE\"),\"-\")","v":"-"},{"$f":"IF(I25=\"INVALIDE\",IF(G25<E25,\"Le coefficient est inférieur au minimum.\",\"Le coefficient est supérieur au maximum.\"),\"-\")","v":"-"},{"$f":"IF(I25=\"INVALIDE\",1,0)","v":0}]
["Taux sous-catégorie non résidentielle 1 (TSCNR 1)",null,{"$f":"IF('Sommaire du rôle'!$H$27>0,'Sommaire du rôle'!$H$27,\"-\")","v":"snr1"},null,{"$f":"IF('Balises-Taux'!C20=\"-\",E25,'Balises-Taux'!C20/'Balises-Taux'!H14)","v":3.1968000000000001},{"$f":"IF('Balises-Taux'!F20=\"-\",'Scénario-taux variés'!F25,'Balises-Taux'!F20/'Balises-Taux'!H14)","v":4.8},{"$f":"G25","v":4.8},"X TB",{"$f":"IF(G26>0,IF(AND(E26<=G26,F26>=G26),\"-\",\"INVALIDE\"),\"-\")","v":"-"},{"$f":"IF(I26=\"INVALIDE\",IF(G26<E26,\"Le coefficient est inférieur au minimum.\",\"Le coefficient est supérieur au maximum.\"),\"-\")","v":"-"},{"$f":"IF(I26=\"INVALIDE\",1,0)","v":0}]
["Taux sous-catégorie non résidentielle 2 (TSCNR 2)",null,{"$f":"IF('Sommaire du rôle'!$J$27>0,'Sommaire du rôle'!$J$27,\"-\")","v":"snr2"},null,{"$f":"E26","v":3.1968000000000001},{"$f":"F26","v":4.8},{"$f":"G26","v":4.8},"X TB","-","-",0]
["Taux sous-catégorie non résidentielle 3 (TSCNR 3)",null,{"$f":"IF('Sommaire du rôle'!$L$27>0,'Sommaire du rôle'!$L$27,\"-\")","v":"snr3"},null,{"$f":"E27","v":3.1968000000000001},{"$f":"F27","v":4.8},4.8,"X TB","-","-",0]
["Taux sous-catégorie non résidentielle 4 (TSCNR 4)",null,{"$f":"IF('Sommaire du rôle'!$N$27>0,'Sommaire du rôle'!$N$27,\"-\")","v":"snr4"},null,{"$f":"E28","v":3.1968000000000001},4.8,4.8,"X TB","-","-",0]
["Taux sous-catégorie non résidentielle 5 (TSCNR 5)",null,{"$f":"IF('Sommaire du rôle'!$N$27>0,'Sommaire du rôle'!$P$27,\"-\")","v":"snr5"},null,3.1968000000000001,4.8,4.8,"X TB","-","-",0]
["Taux sous-catégorie non résidentielle 6 (TSCNR 6)",null,{"$f":"IF('Sommaire du rôle'!$R$27>0,'Sommaire du rôle'!$R$27,\"-\")","v":"snr6"},null,3.1968000000000001,4.8,4.8,"X TB","-","-",0]
["Taux sous-catégorie non résidentielle 7 (TSCNR 7)",null,{"$f":"IF('Sommaire du rôle'!$T$27>0,'Sommaire du rôle'!$T$27,\"-\")","v":"snr7"},null,3.1968000000000001,4.8,4.8,"X TB","-","-",0]
["Taux sous-catégorie non résidentielle 8 (TSCNR 8)",null,{"$f":"IF('Sommaire du rôle'!$V$27>0,'Sommaire du rôle'!$V$27,\"-\")","v":"snr8"},null,3.1968000000000001,4.8,4.8,"X TB","-","-",0]
["Taux sous-catégorie non résidentielle 9 (TSCNR 9)",null,{"$f":"IF('Sommaire du rôle'!$X$27>0,'Sommaire du rôle'!$X$27,\"-\")","v":"snr9"},null,3.1968000000000001,4.8,4.8,"X TB","-","-",0]
["Taux sous-catégorie non résidentielle 10 (TSCNR 10)",null,{"$f":"IF('Sommaire du rôle'!$Z$27>0,'Sommaire du rôle'!$Z$27,\"-\")","v":"snr10"},null,3.1968000000000001,4.8,4.8,"X TB","-","-",0]
["Taux industriel (TIND)",null,null,null,{"$f":"IF('Balises-Taux'!C27=\"-\",1,'Balises-Taux'!C27/'Balises-Taux'!H14)","v":3.1968000000000001},{"$f":"IF('Balises-Taux'!F27=\"-\",'Balises-Taux'!E10,'Balises-Taux'!F27/'Balises-Taux'!H14)","v":5},{"$f":"'Balises-Taux'!E10","v":5},"X TB","-","-",0]
["Taux des terrains vagues desservis (TTVD) ",null,null,null,1,4,4,"X TB",{"$f":"IF(G37>0,IF(AND(E37<=G37,F37>=G37),\"-\",\"INVALIDE\"),\"-\")","v":"-"},{"$f":"IF(I37=\"INVALIDE\",IF(G37<E37,\"Le coefficient est inférieur au minimum.\",\"Le coefficient est supérieur au maximum.\"),\"-\")","v":"-"},{"$f":"IF(I37=\"INVALIDE\",1,0)","v":0}]
["Taux forestier (TFOREST)",null,null,null,0.66600000000000004,1,1,"X TB",{"$f":"IF(G38>0,IF(AND(E38<=G38,F38>=G38),\"-\",\"INVALIDE\"),\"-\")","v":"-"},{"$f":"IF(I38=\"INVALIDE\",IF(G38<E38,\"Le coefficient est inférieur au minimum.\",\"Le coefficient est supérieur au maximum.\"),\"-\")","v":"-"},0]
["Taux agricole (TAGRI) ",null,null,null,0.66600000000000004,1,1,"X TB",{"$f":"IF(G39>0,IF(AND(E39<=G39,F39>=G39),\"-\",\"INVALIDE\"),\"-\")","v":"-"},{"$f":"IF(I39=\"INVALIDE\",IF(G39<E39,\"Le coefficient est inférieur au minimum.\",\"Le coefficient est supérieur au maximum.\"),\"-\")","v":"-"},0]
[null,"= dépend du taux non résidentiel ou du taux de la sous-catégorie de référence",null,null,null,null,null,null,null,null,{"$f":"SUM(K15:K39)","v":0}]
[]
["D'où :"]
[]
["Taux de base","X","Assiette imposable TB",null,"Recettes de taxes prélevées sur les"]
["TB",null,{"$f":"IF('Sommaire du rôle'!F66>0,'Sommaire du rôle'!F83,'Sommaire du rôle'!O71)","v":772400663.71818185},null,"valeurs soumises au taux de base (catégorie résiduelle ou sous-catégorie résiduelle)"]
[null,"+"]
["Taux sous-catégorie résidentielle 1","X","Assiette imposable TB",null,"Recettes de taxes prélevées sur les"]
[{"$f":"IF(G15>0,G15,1)","v":1},null,{"$f":"'Sommaire du rôle'!G83","v":761250103.71818185},null,"valeurs soumises au taux sous-catégorie résidentielle 1"]
[null,"+"]
["Taux sous-catégorie résidentielle 2","X","Assiette imposable TB",null,"Recettes de taxes prélevées sur les"]
[{"$f":"IF(G16>0,G16,1)","v":1.333},null,{"$f":"'Sommaire du rôle'!H83","v":761250103.71818185},null,"valeurs soumises au taux sous-catégorie résidentielle 2"]
[null,"+"]
["Taux sous-catégorie résidentielle 3","X","Assiette imposable TB",null,"Recettes de taxes prélevées sur les"]
[{"$f":"IF(G17>0,G17,1)","v":1.333},null,{"$f":"'Sommaire du rôle'!I83","v":761250103.71818185},null,"valeurs soumises au taux sous-catégorie résidentielle 3"]
[]
["Taux sous-catégorie résidentielle 4","X","Assiette imposable TB",null,"Recettes de taxes prélevées sur les"]
[{"$f":"IF(G18>0,G18,1)","v":1.333},null,{"$f":"'Sommaire du rôle'!J83","v":761250103.71818185},null,"valeurs soumises au taux sous-catégorie résidentielle 4"]
[null,"+"]
["Taux sous-catégorie résidentielle 5","X","Assiette imposable TB",null,"Recettes de taxes prélevées sur les"]
[{"$f":"IF(G19>0,G19,1)","v":1.333},null,{"$f":"'Sommaire du rôle'!K83","v":761250103.71818185},null,"valeurs soumises au taux sous-catégorie résidentielle 5"]
[null,"+"]
["Taux sous-catégorie résidentielle 6","X","Assiette imposable TB",null,"Recettes de taxes prélevées sur les"]
[{"$f":"IF(G20>0,G20,1)","v":1.333},null,{"$f":"'Sommaire du rôle'!L83","v":761250103.71818185},null,"valeurs soumises au taux sous-catégorie résidentielle 6"]
[null,"+"]
["Taux sous-catégorie résidentielle 7","X","Assiette imposable TB",null,"Recettes de taxes prélevées sur les"]
[{"$f":"IF(G21>0,G21,1)","v":1.333},null,{"$f":"'Sommaire du rôle'!M83","v":761250103.71818185},null,"valeurs soumises au taux sous-catégorie résidentielle 7"]
[null,"+"]
["Taux sous-catégorie résidentielle 8","X","Assiette imposable TB",null,"Recettes de taxes prélevées sur les"]
[{"$f":"IF(G22>0,G22,1)","v":1.333},null,{"$f":"'Sommaire du rôle'!N83","v":761250103.71818185},null,"valeurs soumises au taux sous-catégorie résidentielle 8"]
[null,"+"]
["Taux sous-catégorie résidentielle 9","X","Assiette imposable TB",null,"Recettes de taxes prélevées sur les"]
[{"$f":"IF(G23>0,G23,1)","v":1.333},null,{"$f":"'Sommaire du rôle'!O83","v":761250103.71818185},null,"valeurs soumises au taux sous-catégorie résidentielle 9"]
[null,"+"]
["Taux sous-catégorie résidentielle 10","X","Assiette imposable TB",null,"Recettes de taxes prélevées sur les"]
[{"$f":"IF(G24>0,G24,1)","v":1.333},null,{"$f":"'Sommaire du rôle'!P83","v":761250103.71818185},null,"valeurs soumises au taux sous-catégorie résidentielle 10"]
[null,"+"]
["Taux INR","X","Assiette imposable  TINR",null,"Recettes de taxes prélevées sur les"]
[{"$f":"IF(G25>0,G25,1)","v":4.8},null,{"$f":"IF('Sommaire du rôle'!F46>0,'Sommaire du rôle'!F77,'Sommaire du rôle'!F71)","v":120420639.09999999},null,"valeurs soumises au taux INR ou de référence"]
[null,"+"]
["Taux sous-catégorie non résidentielle 1","X","Assiette imposable TB",null,"Recettes de taxes prélevées sur les"]
[{"$f":"IF(G26>0,G26,IF($G$25>0,$G$25,1))","v":4.8},null,{"$f":"'Sommaire du rôle'!G77","v":112404699.09999999},null,"valeurs soumises au taux sous-catégorie non résidentielle 1"]
[null,"+"]
["Taux sous-catégorie non résidentielle 2","X","Assiette imposable TB",null,"Recettes de taxes prélevées sur les"]
[{"$f":"IF(G27>0,G27,IF($G$25>0,$G$25,1))","v":4.8},null,{"$f":"'Sommaire du rôle'!H77","v":112404699.09999999},null,"valeurs soumises au taux sous-catégorie non résidentielle 2"]
[null,"+"]
["Taux sous-catégorie non résidentielle 3","X","Assiette imposable TB",null,"Recettes de taxes prélevées sur les"]
[{"$f":"IF(G28>0,G28,IF($G$25>0,$G$25,1))","v":4.8},null,{"$f":"'Sommaire du rôle'!I77","v":112404699.09999999},null,"valeurs soumises au taux sous-catégorie non résidentielle 3"]
[]
["Taux sous-catégorie non résidentielle 4","X","Assiette imposable TB",null,"Recettes de taxes prélevées sur les"]
[{"$f":"IF(G29>0,G29,IF($G$25>0,$G$25,1))","v":4.8},null,{"$f":"'Sommaire du rôle'!J77","v":112404699.09999999},null,"valeurs soumises au taux sous-catégorie non résidentielle 4"]
[null,"+"]
["Taux sous-catégorie non résidentielle 5","X","Assiette imposable TB",null,"Recettes de taxes prélevées sur les"]
[{"$f":"IF(G30>0,G30,IF($G$25>0,$G$25,1))","v":4.8},null,{"$f":"'Sommaire du rôle'!K77","v":112404699.09999999},null,"valeurs soumises au taux sous-catégorie non résidentielle 5"]
[null,"+"]
["Taux sous-catégorie non résidentielle 6","X","Assiette imposable TB",null,"Recettes de taxes prélevées sur les"]
[{"$f":"IF(G31>0,G31,IF($G$25>0,$G$25,1))","v":4.8},null,{"$f":"'Sommaire du rôle'!L77","v":112404699.09999999},null,"valeurs soumises au taux sous-catégorie non résidentielle 6"]
[null,"+"]
["Taux sous-catégorie non résidentielle 7","X","Assiette imposable TB",null,"Recettes de taxes prélevées sur les"]
[{"$f":"IF(G32>0,G32,IF($G$25>0,$G$25,1))","v":4.8},null,{"$f":"'Sommaire du rôle'!M77","v":112404699.09999999},null,"valeurs soumises au taux sous-catégorie non résidentielle 7"]
[null,"+"]
["Taux sous-catégorie non résidentielle 8","X","Assiette imposable TB",null,"Recettes de taxes prélevées sur les"]
[{"$f":"IF(G33>0,G33,IF($G$25>0,$G$25,1))","v":4.8},null,{"$f":"'Sommaire du rôle'!N77","v":112404699.09999999},null,"valeurs soumises au taux sous-catégorie non résidentielle 8"]
[null,"+"]
["Taux sous-catégorie non résidentielle 9","X","Assiette imposable TB",null,"Recettes de taxes prélevées sur les"]
[{"$f":"IF(G34>0,G34,IF($G$25>0,$G$25,1))","v":4.8},null,{"$f":"'Sommaire du rôle'!O77","v":112404699.09999999},null,"valeurs soumises au taux sous-catégorie non résidentielle 9"]
[null,"+"]
["Taux sous-catégorie non résidentielle 10","X","Assiette imposable TB",null,"Recettes de taxes prélevées sur les"]
[{"$f":"IF(G35>0,G35,IF($G$25>0,$G$25,1))","v":4.8},null,{"$f":"'Sommaire du rôle'!P77","v":112404699.09999999},null,"valeurs soumises au taux sous-catégorie non résidentielle 10"]
[null,"+"]
["Taux IND","X","Assiette imposable  TIND",null,"Recettes de taxes prélevées sur les"]
[{"$f":"IF(G36>0,G36,IF($G$25>0,$G$25,1))","v":5},null,{"$f":"'Sommaire du rôle'!H71","v":239376640},null,"valeurs soumises au taux industriel"]
[null,"+"]
["Taux TVD","X","Assiette imposable  TVD",null,"Recettes de taxes prélevées sur les"]
[{"$f":"IF(G37>0,G37,1)","v":4},null,{"$f":"'Sommaire du rôle'!L23","v":76716400},null,"valeurs soumises au taux TVD"]
[null,"+"]
["Taux forestier","X","Assiette imposable Taux forestier",null,"Recettes de taxes prélevées sur les"]
[{"$f":"IF(G38>0,G38,1)","v":1},null,{"$f":"'Sommaire du rôle'!N6","v":50000000},null,"valeurs soumises au taux forestier"]
[null,"+"]
["Taux agricole","X","Assiette imposable Taux agricole",null,"Recettes de taxes prélevées sur les"]
[{"$f":"IF(G39>0,G39,1)","v":1},null,{"$f":"'Sommaire du rôle'!L6","v":270604300},null,"valeurs soumises au taux agricole"]
[null,"+"]
["TTVD − TB","X","Assiette imposable TTVD − TB",null,"Recettes de taxes prélevées sur les"]
[{"$f":"MAX(G37-1,0)","v":3},null,{"$f":"'Sommaire du rôle'!L22","v":5228300},null,"valeurs soumises au TTVD − TB"]
[]
[null,"=",{"$f":"E9","v":94624103},null,"Recettes de la taxe foncière générale"]
[]
["D'où :",{"$f":"C45+(A78*C78)+(A111*C111)+(A114*C114)+(A117*C117)+(A120*C120)+(A123*C123)+(A48*C48)+(A51*C51)+(A54*C54)+(A57*C57)+(A60*C60)+(A63*C63)+(A66*C66)+(A69*C69)+(A72*C72)+(A75*C75)+(A81*C81)+(A84*C84)+(A87*C87)+(A90*C90)+(A93*C93)+(A96*C96)+(A99*C99)+(A102*C102)+(A105*C105)+(A108*C108)","v":18479850886.223392}]
[null,"="]
[null,{"$f":"E9","v":94624103}]
[]
[null,null,"soit TB","=",{"$f":"B129","v":94624103}]
[null,null,null,null,{"$f":"B127","v":18479850886.223392}]
[]
[null,null,"TB","=",{"$f":"E131/E132","v":5.1203932100199814E-3}]
[]
[null,null,"TB","=",{"$f":"E134*100","v":0.51203932100199812},"$/100$",{"$f":"IF(K40>0,\"AVERTISSEMENT: Un ou plusieurs taux sont invalides et ne respectent pas les règles de la LFM. Par conséquent, TB est erroné.\",\"-\")","v":"-"}]
[]
["TAUX en $ / 100 $ SELON LA CATÉGORIE D'IMMEUBLES",null,null,null,null," (Voir onglet « Balises-Taux » pour plus de détails)"]
[null,null,"Taux généré",null,"Balises des taux",null,"Validation du taux","Explication"]
[null,null,null,null,"Minimum","Maximum"]
["TB \n(catégorie résiduelle ou sous-catégorie résiduelle)","=",{"$f":"E136","v":0.51203932100199812},null,null,null,{"$f":"IF(G136=\"-\",\"-\",\"ERRONÉ\")","v":"-"},{"$f":"IF(G141=\"ERRONÉ\", \"Non-respect de la LFM.\",\"-\")","v":"-"},null,null,null,{"$f":"G169","v":0.92171720711007976}]
["TSCR 1","=",{"$f":"IF('Sommaire du rôle'!H66>0,IF('Scénario-taux variés'!G15>0,'Scénario-taux variés'!G15*'Scénario-taux variés'!$C$141,$C$141),\"-\")","v":0.51203932100199812},null,{"$f":"'Balises-Taux'!$C$15","v":0.34101818778733078},{"$f":"'Balises-Taux'!$F$15","v":0.68254841489566342},{"$f":"I15","v":"-"},{"$f":"IF(G142=\"INVALIDE\",IF(C142<E142,\"Taux inférieur au minimum.\",\"Taux supérieur au maximum.\"),\"-\")","v":"-"},null,null,null,{"$f":"L141","v":0.92171720711007976}]
["TSCR 2","=",{"$f":"IF('Sommaire du rôle'!J66>0,IF('Scénario-taux variés'!G16>0,'Scénario-taux variés'!G16*'Scénario-taux variés'!$C$141,$C$141),\"-\")","v":0.68254841489566342},null,{"$f":"'Balises-Taux'!$C$15","v":0.34101818778733078},{"$f":"'Balises-Taux'!$F$15","v":0.68254841489566342},{"$f":"I16","v":"-"},{"$f":"IF(G143=\"INVALIDE\",IF(C143<E143,\"Taux inférieur au minimum.\",\"Taux supérieur au maximum.\"),\"-\")","v":"-"},null,null,null,{"$f":"L142","v":0.92171720711007976}]
["TSCR 3","=",{"$f":"IF('Sommaire du rôle'!L66>0,IF('Scénario-taux variés'!G17>0,'Scénario-taux variés'!G17*'Scénario-taux variés'!$C$141,$C$141),\"-\")","v":0.68254841489566342},null,{"$f":"'Balises-Taux'!$C$15","v":0.34101818778733078},{"$f":"'Balises-Taux'!$F$15","v":0.68254841489566342},"-","-",null,null,null,0.92171720711007976]
["TSCR 4","=",{"$f":"IF('Sommaire du rôle'!N66>0,IF('Scénario-taux variés'!G18>0,'Scénario-taux variés'!G18*'Scénario-taux variés'!$C$141,$C$141),\"-\")","v":0.68254841489566342},null,{"$f":"'Balises-Taux'!$C$15","v":0.34101818778733078},{"$f":"'Balises-Taux'!$F$15","v":0.68254841489566342},"-","-",null,null,null,0.92171720711007976]
["TSCR 5","=",{"$f":"IF('Sommaire du rôle'!P66>0,IF('Scénario-taux variés'!G19>0,'Scénario-taux variés'!G19*'Scénario-taux variés'!$C$141,$C$141),\"-\")","v":0.68254841489566342},null,{"$f":"'Balises-Taux'!$C$15","v":0.34101818778733078},{"$f":"'Balises-Taux'!$F$15","v":0.68254841489566342},"-","-",null,null,null,0.92171720711007976]
["TSCR 6","=",{"$f":"IF('Sommaire du rôle'!R66>0,IF('Scénario-taux variés'!G20>0,'Scénario-taux variés'!G20*'Scénario-taux variés'!$C$141,$C$141),\"-\")","v":0.68254841489566342},null,{"$f":"'Balises-Taux'!$C$15","v":0.34101818778733078},{"$f":"'Balises-Taux'!$F$15","v":0.68254841489566342},"-","-",null,null,null,0.92171720711007976]
["TSCR 7","=",{"$f":"IF('Sommaire du rôle'!T66>0,IF('Scénario-taux variés'!G21>0,'Scénario-taux variés'!G21*'Scénario-taux variés'!$C$141,$C$141),\"-\")","v":0.68254841489566342},null,{"$f":"'Balises-Taux'!$C$15","v":0.34101818778733078},{"$f":"'Balises-Taux'!$F$15","v":0.68254841489566342},"-","-",null,null,null,0.92171720711007976]
["TSCR 8","=",{"$f":"IF('Sommaire du rôle'!V66>0,IF('Scénario-taux variés'!G22>0,'Scénario-taux variés'!G22*'Scénario-taux variés'!$C$141,$C$141),\"-\")","v":0.68254841489566342},null,{"$f":"'Balises-Taux'!$C$15","v":0.34101818778733078},{"$f":"'Balises-Taux'!$F$15","v":0.68254841489566342},"-","-",null,null,null,0.92171720711007976]
["TSCR 9","=",{"$f":"IF('Sommaire du rôle'!X66>0,IF('Scénario-taux variés'!G23>0,'Scénario-taux variés'!G23*'Scénario-taux variés'!$C$141,$C$141),\"-\")","v":0.68254841489566342},null,{"$f":"'Balises-Taux'!$C$15","v":0.34101818778733078},{"$f":"'Balises-Taux'!$F$15","v":0.68254841489566342},"-","-",null,null,null,0.92171720711007976]
["TSCR 10","=",{"$f":"IF('Sommaire du rôle'!Z66>0,IF('Scénario-taux variés'!G24>0,'Scénario-taux variés'!G24*'Scénario-taux variés'!$C$141,$C$141),\"-\")","v":0.68254841489566342},null,{"$f":"'Balises-Taux'!$C$15","v":0.34101818778733078},{"$f":"'Balises-Taux'!$F$15","v":0.68254841489566342},"-","-",null,null,null,0.92171720711007976]
["TINR \n(catégorie non résidentielle ou sous-catégorie de référence)","=",{"$f":"IF('Sommaire du rôle'!F23>0,IF(G25>0,G25*C141,C141),\"-\")","v":2.4577887408095909},null,{"$f":"'Balises-Taux'!C17","v":0.51203932100199812},{"$f":"'Balises-Taux'!F17","v":2.4577887408095909},{"$f":"'Balises-Taux'!I17","v":"-"},"-",null,null,null,0.92171720711007976]
["TSCNR 1","=",{"$f":"IF('Sommaire du rôle'!H46>0,IF(G26>0,G26*$C$141,IF($C$152>0,$C$152,$C$141)),\"-\")","v":2.4577887408095909},null,{"$f":"E152","v":0.51203932100199812},{"$f":"F152","v":2.4577887408095909},{"$f":"I26","v":"-"},{"$f":"IF(G153=\"INVALIDE\",IF(C153<E153,\"Taux inférieur au minimum.\",\"Taux supérieur au maximum.\"),\"-\")","v":"-"},null,null,null,0.92171720711007976]
["TSCNR 2","=",{"$f":"IF('Sommaire du rôle'!J46>0,IF(G27>0,G27*$C$141,IF($C$152>0,$C$152,$C$141)),\"-\")","v":2.4577887408095909},null,{"$f":"E153","v":0.51203932100199812},{"$f":"F153","v":2.4577887408095909},{"$f":"I27","v":"-"},{"$f":"IF(G154=\"INVALIDE\",IF(C154<E154,\"Taux inférieur au minimum.\",\"Taux supérieur au maximum.\"),\"-\")","v":"-"},null,null,null,0.92171720711007976]
["TSCNR 3","=",{"$f":"IF('Sommaire du rôle'!L46>0,IF(G28>0,G28*$C$141,IF($C$152>0,$C$152,$C$141)),\"-\")","v":2.4577887408095909},null,0.51203932100199812,2.4577887408095909,"-","-",null,null,null,0.92171720711007976]
["TSCNR 4","=",{"$f":"IF('Sommaire du rôle'!N46>0,IF(G29>0,G29*$C$141,IF($C$152>0,$C$152,$C$141)),\"-\")","v":2.4577887408095909},null,0.51203932100199812,2.4577887408095909,"-","-",null,null,null,0.92171720711007976]
["TSCNR 5","=",{"$f":"IF('Sommaire du rôle'!P46>0,IF(G30>0,G30*$C$141,IF($C$152>0,$C$152,$C$141)),\"-\")","v":2.4577887408095909},null,0.51203932100199812,2.4577887408095909,"-","-",null,null,null,0.92171720711007976]
["TSCNR 6","=",{"$f":"IF('Sommaire du rôle'!R46>0,IF(G31>0,G31*$C$141,IF($C$152>0,$C$152,$C$141)),\"-\")","v":2.4577887408095909},null,0.51203932100199812,2.4577887408095909,"-","-",null,null,null,0.92171720711007976]
["TSCNR 7","=",{"$f":"IF('Sommaire du rôle'!T46>0,IF(G32>0,G32*$C$141,IF($C$152>0,$C$152,$C$141)),\"-\")","v":2.4577887408095909},null,0.51203932100199812,2.4577887408095909,"-","-",null,null,null,0.92171720711007976]
["TSCNR 8","=",{"$f":"IF('Sommaire du rôle'!V46>0,IF(G33>0,G33*$C$141,IF($C$152>0,$C$152,$C$141)),\"-\")","v":2.4577887408095909},null,0.51203932100199812,2.4577887408095909,"-","-",null,null,null,0.92171720711007976]
["TSCNR 9","=",{"$f":"IF('Sommaire du rôle'!X46>0,IF(G34>0,G34*$C$141,IF($C$152>0,$C$152,$C$141)),\"-\")","v":2.4577887408095909},null,0.51203932100199812,2.4577887408095909,"-","-",null,null,null,0.92171720711007976]
["TSCNR 10","=",{"$f":"IF('Sommaire du rôle'!Z46>0,IF(G35>0,G35*$C$141,IF($C$152>0,$C$152,$C$141)),\"-\")","v":2.4577887408095909},null,0.51203932100199812,2.4577887408095909,"-","-",null,null,null,{"$f":"L152","v":0.92171720711007976}]
["TIND","=",{"$f":"IF('Sommaire du rôle'!I23>0,IF(G36>0,A111*C141,IF(C152>0,C152,C141)),\"-\")","v":2.5601966050099905},null,{"$f":"'Balises-Taux'!C27","v":1.6368873013791876},{"$f":"'Balises-Taux'!F27","v":2.5601966050099905},{"$f":"'Balises-Taux'!I27","v":"-"},{"$f":"'Balises-Taux'!J27","v":"-"},null,null,null,0.92171720711007976]
["TTVD","=",{"$f":"IF(('Sommaire du rôle'!F22+'Sommaire du rôle'!G22+'Sommaire du rôle'!L23+'Sommaire du rôle'!N23>0),IF(G37>0,G37*C141,C141),\"-\")","v":2.0481572840079925},null,{"$f":"'Balises-Taux'!C30","v":0.51203932100199812},{"$f":"'Balises-Taux'!F30","v":2.0481572840079925},{"$f":"'Balises-Taux'!I30","v":"-"},{"$f":"'Balises-Taux'!J30","v":"-"},null,null,null,0.92171720711007976]
["TFOREST","=",{"$f":"IF('Sommaire du rôle'!N6>0,IF(G38>0,G38*C141,C141),\"-\")","v":0.51203932100199812},null,{"$f":"'Balises-Taux'!C32","v":0.34101818778733078},{"$f":"'Balises-Taux'!F32","v":0.51203932100199812},{"$f":"'Balises-Taux'!I32","v":"-"},{"$f":"'Balises-Taux'!J32","v":"-"},null,null,null,0.92171720711007976]
["TAGRI","=",{"$f":"IF('Sommaire du rôle'!L6>0,IF(G39>0,G39*C141,C141),\"-\")","v":0.51203932100199812},null,{"$f":"'Balises-Taux'!C34","v":0.34101818778733078},{"$f":"'Balises-Taux'!F34","v":0.51203932100199812},{"$f":"'Balises-Taux'!I34","v":"-"},{"$f":"'Balises-Taux'!J34","v":"-"},null,null,null,0.92171720711007976]
["(TTVD − TB)","=",{"$f":"IF(AND(C164>0,('Sommaire du rôle'!F22+'Sommaire du rôle'!G22)>0),C164-C141,\"-\")","v":1.5361179630059945},null,null,null,null,null,null,null,null,0.92171720711007976]
[]
["Si la municipalité n'utilise pas de taux variés, le taux unique sera :",null,null,null,null,null,{"$f":"(F221/C221)*100","v":0.92171720711007976},"$/100$"]
[]
[]
[]
[]
[]
[]
[]
[]
[]
[]
[]
[]
[]
[]
[]
[]
[]
[]
[]
[]
["ASSIETTES IMPOSABLES ET RECETTES "]
[null,null,"Assiettes imposables",null,"Part des assiettes imposables","Recettes","Part des recettes","Écart des recettes avec taux variés vs taux unique "]
["Résiduelle ou sous-catégorie résiduelle","=",{"$f":"C45","v":772400663.71818185},null,{"$f":"C192/C$221","v":7.5238227889176904E-2},{"$f":"IF(C192>0,IF(G141=\"INVALIDE\",\"ERREUR\",C192*C141/100),0)","v":3954995.1139175054},{"$f":"F192/F$221","v":4.179690996825098E-2},{"$f":"F192-(F$221*E192)","v":-3164354.7114054393}]
["Sous-catégorie résidentielle 1","=",{"$f":"C48","v":761250103.71818185},null,{"$f":"C193/C$221","v":7.4152070906435052E-2},3897899.8622055845,{"$f":"F193/F$221","v":4.1193519818154431E-2},{"$f":"F193-(F$221*E193)","v":-3118673.3329082262}]
["Sous-catégorie résidentielle 2","=",{"$f":"C51","v":761250103.71818185},null,7.4152070906435052E-2,5195900.5163200442,5.4910961917599858E-2,-1820672.6787937665]
["Sous-catégorie résidentielle 3","=",{"$f":"C54","v":761250103.71818185},null,7.4152070906435052E-2,5195900.5163200442,5.4910961917599858E-2,-1820672.6787937665]
["Sous-catégorie résidentielle 4","=",{"$f":"C57","v":761250103.71818185},null,7.4152070906435052E-2,5195900.5163200442,5.4910961917599858E-2,-1820672.6787937665]
["Sous-catégorie résidentielle 5","=",{"$f":"C60","v":761250103.71818185},null,7.4152070906435052E-2,5195900.5163200442,5.4910961917599858E-2,-1820672.6787937665]
["Sous-catégorie résidentielle 6","=",{"$f":"C63","v":761250103.71818185},null,7.4152070906435052E-2,5195900.5163200442,5.4910961917599858E-2,-1820672.6787937665]
["Sous-catégorie résidentielle 7","=",{"$f":"C66","v":761250103.71818185},null,7.4152070906435052E-2,5195900.5163200442,5.4910961917599858E-2,-1820672.6787937665]
["Sous-catégorie résidentielle 8","=",{"$f":"C69","v":761250103.71818185},null,7.4152070906435052E-2,5195900.5163200442,5.4910961917599858E-2,-1820672.6787937665]
["Sous-catégorie résidentielle 9","=",{"$f":"C72","v":761250103.71818185},null,7.4152070906435052E-2,5195900.5163200442,5.4910961917599858E-2,-1820672.6787937665]
["Sous-catégorie résidentielle 10","=",{"$f":"C75","v":761250103.71818185},null,7.4152070906435052E-2,5195900.5163200442,5.4910961917599858E-2,-1820672.6787937665]
["Non résidentielle ou sous-catégorie de référence","=",{"$f":"C78","v":120420639.09999999},null,{"$f":"C203/C$221","v":1.1729968541911875E-2},2959684.9094107514,{"$f":"F203/F$221","v":3.1278340460577501E-2},{"$f":"F203-(F$221*E203)","v":1849747.1579141228}]
["Sous-catégorie non résidentielle 1","=",{"$f":"C81","v":112404699.09999999},null,{"$f":"C204/C$221","v":1.0949149533338344E-2},2762670.0386206997,{"$f":"F204/F$221","v":2.9196261322769961E-2},{"$f":"F204-(F$221*E204)","v":1726616.5854156907}]
["Sous-catégorie non résidentielle 2","=",{"$f":"C84","v":112404699.09999999},null,1.0949149533338344E-2,2762670.0386206997,2.9196261322769961E-2,1726616.5854156907]
["Sous-catégorie non résidentielle 3","=",{"$f":"C87","v":112404699.09999999},null,1.0949149533338344E-2,2762670.0386206997,2.9196261322769961E-2,1726616.5854156907]
["Sous-catégorie non résidentielle 4","=",{"$f":"C90","v":112404699.09999999},null,1.0949149533338344E-2,2762670.0386206997,2.9196261322769961E-2,1726616.5854156907]
["Sous-catégorie non résidentielle 5","=",{"$f":"C93","v":112404699.09999999},null,1.0949149533338344E-2,2762670.0386206997,2.9196261322769961E-2,1726616.5854156907]
["Sous-catégorie non résidentielle 6","=",{"$f":"C96","v":112404699.09999999},null,1.0949149533338344E-2,2762670.0386206997,2.9196261322769961E-2,1726616.5854156907]
["Sous-catégorie non résidentielle 7","=",{"$f":"C99","v":112404699.09999999},null,1.0949149533338344E-2,2762670.0386206997,2.9196261322769961E-2,1726616.5854156907]
["Sous-catégorie non résidentielle 8","=",{"$f":"C102","v":112404699.09999999},null,1.0949149533338344E-2,2762670.0386206997,2.9196261322769961E-2,1726616.5854156907]
["Sous-catégorie non résidentielle 9","=",{"$f":"C105","v":112404699.09999999},null,1.0949149533338344E-2,2762670.0386206997,2.9196261322769961E-2,1726616.5854156907]
["Sous-catégorie non résidentielle 10","=",{"$f":"C108","v":112404699.09999999},null,1.0949149533338344E-2,2762670.0386206997,2.9196261322769961E-2,1726616.5854156907]
["Industrielle","=",{"$f":"C111","v":239376640},null,{"$f":"C214/C$221","v":2.3317269181214337E-2},6128512.6104669869,{"$f":"F214/F$221","v":6.4766929526053105E-2},{"$f":"F214-(F$221*E214)","v":3922136.9297850369}]
["Terrains vagues desservis","=",{"$f":"C114","v":76716400},null,{"$f":"C215/C$221","v":7.4728133430802248E-3},1571272.5346287074,{"$f":"F215/F$221","v":1.6605415373170916E-2},{"$f":"F215-(F$221*E215)","v":864164.27515331027}]
["Forestier","=",{"$f":"C117","v":50000000},null,{"$f":"C216/C$221","v":4.8704145026879685E-3},256019.66050099905,{"$f":"F216/F$221","v":2.7056495373171375E-3},{"$f":"F216-(F$221*E216)","v":-204838.94305404086}]
["Agricole","=",{"$f":"C120","v":270604300},null,{"$f":"C217/C$221","v":2.6359102144194516E-2},1385600.4203222098,{"$f":"F217/F$221","v":1.4643207981820557E-2},{"$f":"F217-(F$221*E217)","v":-1108605.9759575718}]
["TTVD − TB","=",null,null,null,{"$f":"IF(A220>0,A220*C167/100,0)","v":80312.855459842409},{"$f":"F218/F221","v":8.4875684855731154E-4},{"$f":"F218","v":80312.855459842409}]
["  Assiette imposable "]
[{"$f":"C123","v":5228300}]
["Total",null,{"$f":"SUM(C192:C217)","v":10266066671.000002},null,{"$f":"SUM(E192:E217)","v":1},{"$f":"IF(K40>0,\"ERREUR\",SUM(F192:F217,F218))","v":94624102.999999955},{"$f":"SUM(G192:G218)","v":1.0000000000000004},{"$f":"SUM(H192:H218)","v":5.2663381211459637E-8}]

{"sheet":"Balises-Taux","index":4,"n_rows":34,"n_cols":10,"rows_kept":34,"cut":false,"hidden":false,"merged":[[2,0,2,5],[13,1,13,2],[13,4,13,5],[3,1,3,2],[3,4,3,5],[9,1,9,2],[9,4,9,5],[12,1,12,2],[12,4,12,5]]}
["Nom du scénario",{"$f":"'Scénario-taux variés'!E10","v":"Scénario 1"}]
["Population de la municipalité",{"$f":"'Scénario-taux variés'!E8","v":1000000},"habitants"]
["DÉTERMINATION DES COEFFICIENTS DU TAUX DE BASE POUR LES IMMEUBLES NON RÉSIDENTIELS ET INDUSTRIELS"]
[null,"Coefficient non résidentiel",null,null,"Coefficient industriel"]
["Population de la municipalité","Coefficient du taux de base ","Coefficient à retenir",null,"Coefficient du taux de base ","Coefficient à retenir"]
["Moins de 5 000 habitants",4.0999999999999996,{"$f":"IF($B$2<5000,B6,\"-\")","v":"-"},null,4.5,{"$f":"IF($B$2<5000,E6,\"-\")","v":"-"}]
["De 5 000 à 99 999 habitants",4.4000000000000004,{"$f":"IF(AND($B$2>=5000,$B$2<=99999),B7,\"-\")","v":"-"},null,5,{"$f":"IF(AND($B$2>=5000,$B$2<=99999),E7,\"-\")","v":"-"}]
["De 100 000 à 199 999 habitants",4.45,{"$f":"IF(AND($B$2>=100000,$B$2<=199999),B8,\"-\")","v":"-"},null,5,{"$f":"IF(AND($B$2>=100000,$B$2<=199999),E8,\"-\")","v":"-"}]
["200 000 habitants et plus",4.8,{"$f":"IF($B$2>=200000,B9,\"-\")","v":4.8},null,5,{"$f":"IF($B$2>=200000,E9,\"-\")","v":5}]
["Coefficient correspondant à la taille de la municipalité",{"$f":"SUM(C6:C9)","v":4.8},null,null,{"$f":"SUM(F6:F9)","v":5}]
[]
["TAUX EN $ PAR 100 $ D'ÉVALUATION SELON LA CATÉGORIE D'IMMEUBLES"]
[null,"Minimum",null,null,"Maximum",null,null," Taux choisi","Validation du taux","Explication"]
["Taux de base (TB)",null,null,null,null,null,null,{"$f":"'Scénario-taux variés'!C141","v":0.51203932100199812},{"$f":"'Scénario-taux variés'!G141","v":"-"},{"$f":"'Scénario-taux variés'!H141","v":"-"}]
["Taux sous-catégorie résidentielle","TB X 66,6%",{"$f":"0.666*H14","v":0.34101818778733078},null,"TB X 133,3%",{"$f":"H14*1.333","v":0.68254841489566342}]
[]
["Taux non résidentiel ou référence (TINR)","TB",{"$f":"IF('Sommaire du rôle'!F23>0,H14,\"-\")","v":0.51203932100199812},null,"TB X Coefficient non résidentiel",{"$f":"IF('Sommaire du rôle'!F23>0,H14*B10,\"-\")","v":2.4577887408095909},null,{"$f":"'Scénario-taux variés'!C152","v":2.4577887408095909},{"$f":"IF(AND(C17<=H17,F17>=H17),\"-\",\"INVALIDE\")","v":"-"},{"$f":"IF(I17=\"INVALIDE\",IF(H17<C17,\"Taux inférieur au minimum.\",\"Taux supérieur au maximum.\"),\"-\")","v":"-"}]
["Taux sous-catégorie non résidentielle","TB",{"$f":"H14","v":0.51203932100199812},null,"TB X Coefficient non résidentiel",{"$f":"F17","v":2.4577887408095909}]
[null,"TINR X 66,6 %",{"$f":"H17*0.666","v":1.6368873013791876},null,"TINR X 133,3 %",{"$f":"H17*1.333","v":3.2762323914991844}]
[null,"Plus grand entre les deux balises ",{"$f":"IF('Sommaire du rôle'!F23>0,MAX(C18:C19),\"-\")","v":1.6368873013791876},null,"Plus petit entre les deux balises",{"$f":"IF('Sommaire du rôle'!F23>0,MIN(F18:F19),\"-\")","v":2.4577887408095909}]
[]
[]
[]
["Taux industriel (TIND)"]
[null,"TB",{"$f":"IF('Sommaire du rôle'!I23>0,H14,\"-\")","v":0.51203932100199812},null,"TB X Coefficient industriel",{"$f":"IF('Sommaire du rôle'!I23>0,H14*E10,\"-\")","v":2.5601966050099905}]
[null,"TINR X 66,6 %",{"$f":"IF('Sommaire du rôle'!I23>0,H17*0.666,\"-\")","v":1.6368873013791876},null,"TINR X 133,3 %",{"$f":"IF('Sommaire du rôle'!I23>0,H17*1.333,\"-\")","v":3.2762323914991844}]
[null,"Plus grand entre les deux balises ",{"$f":"IF(AND('Sommaire du rôle'!F23>0,'Sommaire du rôle'!I23>0),MAX(C25:C26),\"-\")","v":1.6368873013791876},null,"Plus petit entre les deux balises",{"$f":"IF(AND('Sommaire du rôle'!F23>0,'Sommaire du rôle'!I23>0),MIN(F25:F26),\"-\")","v":2.5601966050099905},null,{"$f":"'Scénario-taux variés'!C163","v":2.5601966050099905},{"$f":"IF(AND(C27<=H27,F27>=H27),\"-\",\"INVALIDE\")","v":"-"},{"$f":"IF(I27=\"INVALIDE\",IF(H27<C27,\"Taux inférieur au minimum.\",\"Taux supérieur au maximum.\"),\"-\")","v":"-"}]
[null,{"$f":"IF(C27>F27,\"AVERTISSEMENT: TINR génère une incohérence dans les balises du TIND.\",\"\")","v":""}]
[]
["Taux des terrains vagues desservis (TTVD)","TB",{"$f":"IF(('Sommaire du rôle'!F22+'Sommaire du rôle'!G22+'Sommaire du rôle'!L23+'Sommaire du rôle'!N23)>0,H14,\"-\")","v":0.51203932100199812},null,"TB X 4",{"$f":"IF(('Sommaire du rôle'!F22+'Sommaire du rôle'!G22+'Sommaire du rôle'!L23+'Sommaire du rôle'!N23)>0,H14*4,\"-\")","v":2.0481572840079925},null,{"$f":"'Scénario-taux variés'!C164","v":2.0481572840079925},{"$f":"IF(AND(C30<=H30,F30>=H30),\"-\",\"INVALIDE\")","v":"-"},{"$f":"IF(I30=\"INVALIDE\",IF(H30<C30,\"Taux inférieur au minimum.\",\"Taux supérieur au maximum.\"),\"-\")","v":"-"}]
[]
["Taux des immeubles forestiers (TFOREST)","TB X 66,6%",{"$f":"IF('Sommaire du rôle'!N6>0,H14*0.666,\"-\")","v":0.34101818778733078},null,"TB",{"$f":"IF('Sommaire du rôle'!N6>0,H14,\"-\")","v":0.51203932100199812},null,{"$f":"'Scénario-taux variés'!C165","v":0.51203932100199812},{"$f":"IF(AND(C32<=H32,F32>=H32),\"-\",\"INVALIDE\")","v":"-"},{"$f":"IF(I32=\"INVALIDE\",IF(H32<C32,\"Taux inférieur au minimum.\",\"Taux supérieur au maximum.\"),\"-\")","v":"-"}]
[]
["Taux des immeubles agricoles (TAGRI)","TB X 66,6%",{"$f":"IF('Sommaire du rôle'!L6>0,H14*0.666,\"-\")","v":0.34101818778733078},null,"TB",{"$f":"IF('Sommaire du rôle'!L6>0,H14,\"-\")","v":0.51203932100199812},null,{"$f":"'Scénario-taux variés'!C166","v":0.51203932100199812},{"$f":"IF(AND(C34<=H34,F34>=H34),\"-\",\"INVALIDE\")","v":"-"},{"$f":"IF(I34=\"INVALIDE\",IF(H34<C34,\"Taux inférieur au minimum.\",\"Taux supérieur au maximum.\"),\"-\")","v":"-"}]

{"sheet":"Taux_max_balises","index":5,"n_rows":221,"n_cols":8,"rows_kept":221,"cut":false,"hidden":true,"merged":[[38,0,38,3],[138,4,138,5],[7,0,7,2],[12,4,12,5],[12,6,13,7],[24,0,24,3],[36,0,36,2],[37,0,37,2]]}
[]
[]
["CHOIX DES COEFFICIENTS SELON LES BALISES ET CALCUL DU TAUX DE BASE"]
["Il faut remplir les cases ombragées (motif à points) pour faire fonctionner le simulateur."]
["Note : Les assiettes de taxation du modèle n'incluent que les valeurs imposables."]
[]
["Nom de la municipalité =",null,null,null,null,"Année:",2024]
["Population de la municipalité ou de l'agglomération, s'il y a lieu =",null,null,null,100000,"habitants"]
["Recettes de la taxe foncière générale =",null,null,null,94624103,"(prévues au budget)"]
["Nom du scénario ="]
[]
["MULTIPLES DU TAUX DE BASE "]
[null,null,null,null,"Balises des coefficients par rapport au taux de base (TB)",null,"Choisir un coefficient par rapport au taux de base"]
[null,null,null,null,"Minimum ","Maximum"]
["Taux sous-catégorie résidentielle 1 (TSCR 1)",null,null,null,{"$f":"'Scénario-taux variés'!E15","v":0.66600000000000004},{"$f":"'Scénario-taux variés'!F15","v":1.333},{"$f":"F15","v":1.333},"X TB"]
["Taux sous-catégorie résidentielle 2 (TSCR 2)",null,null,null,{"$f":"'Scénario-taux variés'!E16","v":0.66600000000000004},{"$f":"'Scénario-taux variés'!F16","v":1.333},{"$f":"F16","v":1.333},"X TB"]
["Taux sous-catégorie résidentielle 3 (TSCR 3)",null,null,null,{"$f":"'Scénario-taux variés'!E17","v":0.66600000000000004},{"$f":"'Scénario-taux variés'!F17","v":1.333},1.333,"X TB"]
["Taux sous-catégorie résidentielle 4 (TSCR 4)",null,null,null,{"$f":"'Scénario-taux variés'!E18","v":0.66600000000000004},{"$f":"'Scénario-taux variés'!F18","v":1.333},1.333,"X TB"]
["Taux sous-catégorie résidentielle 5 (TSCR 5)",null,null,null,{"$f":"'Scénario-taux variés'!E19","v":0.66600000000000004},{"$f":"'Scénario-taux variés'!F19","v":1.333},1.333,"X TB"]
["Taux sous-catégorie résidentielle 6 (TSCR 6)",null,null,null,{"$f":"'Scénario-taux variés'!E20","v":0.66600000000000004},{"$f":"'Scénario-taux variés'!F20","v":1.333},1.333,"X TB"]
["Taux sous-catégorie résidentielle 7 (TSCR 7)",null,null,null,{"$f":"'Scénario-taux variés'!E21","v":0.66600000000000004},{"$f":"'Scénario-taux variés'!F21","v":1.333},1.333,"X TB"]
["Taux sous-catégorie résidentielle 8 (TSCR 8)",null,null,null,{"$f":"'Scénario-taux variés'!E22","v":0.66600000000000004},{"$f":"'Scénario-taux variés'!F22","v":1.333},1.333,"X TB"]
["Taux sous-catégorie résidentielle 9 (TSCR 9)",null,null,null,{"$f":"'Scénario-taux variés'!E23","v":0.66600000000000004},{"$f":"'Scénario-taux variés'!F23","v":1.333},1.333,"X TB"]
["Taux sous-catégorie résidentielle 10 (TSCR 10)",null,null,null,{"$f":"'Scénario-taux variés'!E24","v":0.66600000000000004},{"$f":"'Scénario-taux variés'!F24","v":1.333},1.333,"X TB"]
["Taux non résidentiel ou sous-catégorie de référence (TINR)",null,null,null,{"$f":"'Scénario-taux variés'!E25","v":1},{"$f":"'Scénario-taux variés'!F25","v":4.8},4.8,"X TB"]
["Taux sous-catégorie non résidentielle 1 (TSCNR 1)",null,null,null,{"$f":"'Balises taux_max_balises'!$C$22/'Balises taux_max_balises'!$H$14","v":3.1968000000000005},{"$f":"F25","v":4.8},4.8,"X TB"]
["Taux sous-catégorie non résidentielle 2 (TSCNR 2)",null,null,null,{"$f":"'Balises taux_max_balises'!$C$22/'Balises taux_max_balises'!$H$14","v":3.1968000000000005},{"$f":"F26","v":4.8},4.8,"X TB"]
["Taux sous-catégorie non résidentielle 3 (TSCNR 3)",null,null,null,{"$f":"'Balises taux_max_balises'!$C$22/'Balises taux_max_balises'!$H$14","v":3.1968000000000005},4.8,4.8,"X TB"]
["Taux sous-catégorie non résidentielle 4 (TSCNR 4)",null,null,null,{"$f":"'Balises taux_max_balises'!$C$22/'Balises taux_max_balises'!$H$14","v":3.1968000000000005},4.8,4.8,"X TB"]
["Taux sous-catégorie non résidentielle 5 (TSCNR 5)",null,null,null,{"$f":"'Balises taux_max_balises'!$C$22/'Balises taux_max_balises'!$H$14","v":3.1968000000000005},4.8,4.8,"X TB"]
["Taux sous-catégorie non résidentielle 6 (TSCNR 6)",null,null,null,{"$f":"'Balises taux_max_balises'!$C$22/'Balises taux_max_balises'!$H$14","v":3.1968000000000005},4.8,4.8,"X TB"]
["Taux sous-catégorie non résidentielle 7 (TSCNR 7)",null,null,null,{"$f":"'Balises taux_max_balises'!$C$22/'Balises taux_max_balises'!$H$14","v":3.1968000000000005},4.8,4.8,"X TB"]
["Taux sous-catégorie non résidentielle 8 (TSCNR 8)",null,null,null,{"$f":"'Balises taux_max_balises'!$C$22/'Balises taux_max_balises'!$H$14","v":3.1968000000000005},4.8,4.8,"X TB"]
["Taux sous-catégorie non résidentielle 9 (TSCNR 9)",null,null,null,{"$f":"'Balises taux_max_balises'!$C$22/'Balises taux_max_balises'!$H$14","v":3.1968000000000005},4.8,4.8,"X TB"]
["Taux sous-catégorie non résidentielle 10 (TSCNR 10)",null,null,null,{"$f":"'Balises taux_max_balises'!$C$22/'Balises taux_max_balises'!$H$14","v":3.1968000000000005},4.8,4.8,"X TB"]
["Taux industriel (TIND)",null,null,null,{"$f":"'Balises taux_max_balises'!$C$22/'Balises taux_max_balises'!$H$14","v":3.1968000000000005},{"$f":"'Balises taux_max_balises'!E10","v":5},5,"X TB"]
["Taux des terrains vagues desservis (TTVD) ",null,null,null,{"$f":"'Scénario-taux variés'!E37","v":1},{"$f":"'Scénario-taux variés'!F37","v":4},4,"X TB"]
["Taux forestier (TFOREST)",null,null,null,{"$f":"'Scénario-taux variés'!E38","v":0.66600000000000004},{"$f":"'Scénario-taux variés'!F38","v":1},1,"X TB"]
["Taux agricole (TAGRI) ",null,null,null,{"$f":"'Scénario-taux variés'!E39","v":0.66600000000000004},{"$f":"'Scénario-taux variés'!F39","v":1},1,"X TB"]
[null,"= dépend du taux non résidentiel ou du taux de la sous-catégorie de référence"]
[]
["D'où :"]
[]
["Taux de base","X","Assiette imposable TB",null,"Recettes de taxes prélevées sur les"]
["TB",null,{"$f":"IF('Sommaire du rôle'!F66>0,'Sommaire du rôle'!F83,'Sommaire du rôle'!O71)","v":772400663.71818185},null,"valeurs soumises au taux de base (catégorie résiduelle ou sous-catégorie résiduelle)"]
[null,"+"]
["Taux  sous-catégorie résidentielle 1","X","Assiette imposable TB",null,"Recettes de taxes prélevées sur les"]
[{"$f":"IF(G15>0,G15,1)","v":1.333},null,{"$f":"'Sommaire du rôle'!G83","v":761250103.71818185},null,"valeurs soumises au taux sous-catégorie résidentielle 1"]
[null,"+"]
["Taux  sous-catégorie résidentielle 2","X","Assiette imposable TB",null,"Recettes de taxes prélevées sur les"]
[{"$f":"IF(G16>0,G16,1)","v":1.333},null,{"$f":"'Sommaire du rôle'!H83","v":761250103.71818185},null,"valeurs soumises au taux sous-catégorie résidentielle 2"]
[null,"+"]
["Taux  sous-catégorie résidentielle 3","X","Assiette imposable TB",null,"Recettes de taxes prélevées sur les"]
[{"$f":"IF(G17>0,G17,1)","v":1.333},null,{"$f":"'Sommaire du rôle'!I83","v":761250103.71818185},null,"valeurs soumises au taux sous-catégorie résidentielle 3"]
[]
["Taux  sous-catégorie résidentielle 4","X","Assiette imposable TB",null,"Recettes de taxes prélevées sur les"]
[{"$f":"IF(G18>0,G18,1)","v":1.333},null,{"$f":"'Sommaire du rôle'!J83","v":761250103.71818185},null,"valeurs soumises au taux sous-catégorie résidentielle 4"]
[null,"+"]
["Taux  sous-catégorie résidentielle 5","X","Assiette imposable TB",null,"Recettes de taxes prélevées sur les"]
[{"$f":"IF(G19>0,G19,1)","v":1.333},null,{"$f":"'Sommaire du rôle'!K83","v":761250103.71818185},null,"valeurs soumises au taux sous-catégorie résidentielle 5"]
[null,"+"]
["Taux  sous-catégorie résidentielle 6","X","Assiette imposable TB",null,"Recettes de taxes prélevées sur les"]
[{"$f":"IF(G20>0,G20,1)","v":1.333},null,{"$f":"'Sommaire du rôle'!L83","v":761250103.71818185},null,"valeurs soumises au taux sous-catégorie résidentielle 6"]
[null,"+"]
["Taux  sous-catégorie résidentielle 7","X","Assiette imposable TB",null,"Recettes de taxes prélevées sur les"]
[{"$f":"IF(G21>0,G21,1)","v":1.333},null,{"$f":"'Sommaire du rôle'!M83","v":761250103.71818185},null,"valeurs soumises au taux sous-catégorie résidentielle 7"]
[null,"+"]
["Taux  sous-catégorie résidentielle 8","X","Assiette imposable TB",null,"Recettes de taxes prélevées sur les"]
[{"$f":"IF(G22>0,G22,1)","v":1.333},null,{"$f":"'Sommaire du rôle'!N83","v":761250103.71818185},null,"valeurs soumises au taux sous-catégorie résidentielle 8"]
[null,"+"]
["Taux  sous-catégorie résidentielle 9","X","Assiette imposable TB",null,"Recettes de taxes prélevées sur les"]
[{"$f":"IF(G23>0,G23,1)","v":1.333},null,{"$f":"'Sommaire du rôle'!O83","v":761250103.71818185},null,"valeurs soumises au taux sous-catégorie résidentielle 9"]
[null,"+"]
["Taux  sous-catégorie résidentielle 10","X","Assiette imposable TB",null,"Recettes de taxes prélevées sur les"]
[{"$f":"IF(G24>0,G24,1)","v":1.333},null,{"$f":"'Sommaire du rôle'!P83","v":761250103.71818185},null,"valeurs soumises au taux sous-catégorie résidentielle 10"]
[null,"+"]
["Taux INR","X","Assiette imposable  TINR",null,"Recettes de taxes prélevées sur les"]
[{"$f":"IF(G25>0,G25,1)","v":4.8},null,{"$f":"IF('Sommaire du rôle'!F46>0,'Sommaire du rôle'!F77,'Sommaire du rôle'!F71)","v":120420639.09999999},null,"valeurs soumises au taux INR ou de référence"]
[null,"+"]
["Taux  sous-catégorie non résidentielle 1","X","Assiette imposable TB",null,"Recettes de taxes prélevées sur les"]
[{"$f":"IF(G26>0,G26,IF($G$25>0,$G$25,1))","v":4.8},null,{"$f":"'Sommaire du rôle'!G77","v":112404699.09999999},null,"valeurs soumises au taux sous-catégorie non résidentielle 1"]
[null,"+"]
["Taux  sous-catégorie non résidentielle 2","X","Assiette imposable TB",null,"Recettes de taxes prélevées sur les"]
[{"$f":"IF(G27>0,G27,IF($G$25>0,$G$25,1))","v":4.8},null,{"$f":"'Sommaire du rôle'!H77","v":112404699.09999999},null,"valeurs soumises au taux sous-catégorie non résidentielle 2"]
[null,"+"]
["Taux  sous-catégorie non résidentielle 3","X","Assiette imposable TB",null,"Recettes de taxes prélevées sur les"]
[{"$f":"IF(G28>0,G28,IF($G$25>0,$G$25,1))","v":4.8},null,{"$f":"'Sommaire du rôle'!I77","v":112404699.09999999},null,"valeurs soumises au taux sous-catégorie non résidentielle 3"]
[]
["Taux  sous-catégorie non résidentielle 4","X","Assiette imposable TB",null,"Recettes de taxes prélevées sur les"]
[{"$f":"IF(G29>0,G29,IF($G$25>0,$G$25,1))","v":4.8},null,{"$f":"'Sommaire du rôle'!J77","v":112404699.09999999},null,"valeurs soumises au taux sous-catégorie non résidentielle 4"]
[null,"+"]
["Taux  sous-catégorie non résidentielle 5","X","Assiette imposable TB",null,"Recettes de taxes prélevées sur les"]
[{"$f":"IF(G30>0,G30,IF($G$25>0,$G$25,1))","v":4.8},null,{"$f":"'Sommaire du rôle'!K77","v":112404699.09999999},null,"valeurs soumises au taux sous-catégorie non résidentielle 5"]
[null,"+"]
["Taux non  sous-catégorie non résidentielle 6","X","Assiette imposable TB",null,"Recettes de taxes prélevées sur les"]
[{"$f":"IF(G31>0,G31,IF($G$25>0,$G$25,1))","v":4.8},null,{"$f":"'Sommaire du rôle'!L77","v":112404699.09999999},null,"valeurs soumises au taux sous-catégorie non résidentielle 6"]
[null,"+"]
["Taux non  sous-catégorie non résidentielle 7","X","Assiette imposable TB",null,"Recettes de taxes prélevées sur les"]
[{"$f":"IF(G32>0,G32,IF($G$25>0,$G$25,1))","v":4.8},null,{"$f":"'Sommaire du rôle'!M77","v":112404699.09999999},null,"valeurs soumises au taux sous-catégorie non résidentielle 7"]
[null,"+"]
["Taux non  sous-catégorie non résidentielle 8","X","Assiette imposable TB",null,"Recettes de taxes prélevées sur les"]
[{"$f":"IF(G33>0,G33,IF($G$25>0,$G$25,1))","v":4.8},null,{"$f":"'Sommaire du rôle'!N77","v":112404699.09999999},null,"valeurs soumises au taux sous-catégorie non résidentielle 8"]
[null,"+"]
["Taux non  sous-catégorie non résidentielle 9","X","Assiette imposable TB",null,"Recettes de taxes prélevées sur les"]
[{"$f":"IF(G34>0,G34,IF($G$25>0,$G$25,1))","v":4.8},null,{"$f":"'Sommaire du rôle'!O77","v":112404699.09999999},null,"valeurs soumises au taux sous-catégorie non résidentielle 9"]
[null,"+"]
["Taux non  sous-catégorie non résidentielle 10","X","Assiette imposable TB",null,"Recettes de taxes prélevées sur les"]
[{"$f":"IF(G35>0,G35,IF($G$25>0,$G$25,1))","v":4.8},null,{"$f":"'Sommaire du rôle'!P77","v":112404699.09999999},null,"valeurs soumises au taux sous-catégorie non résidentielle 10"]
[null,"+"]
["Taux IND","X","Assiette imposable  TIND",null,"Recettes de taxes prélevées sur les"]
[{"$f":"IF(G36>0,G36,IF($G$25>0,$G$25,1))","v":5},null,{"$f":"'Sommaire du rôle'!H71","v":239376640},null,"valeurs soumises au taux industriel"]
[null,"+"]
["Taux TVD","X","Assiette imposable  TVD",null,"Recettes de taxes prélevées sur les"]
[{"$f":"IF(G37>0,G37,1)","v":4},null,{"$f":"'Sommaire du rôle'!L23","v":76716400},null,"valeurs soumises au taux TVD"]
[null,"+"]
["Taux forestier","X","Assiette imposable Taux forestier",null,"Recettes de taxes prélevées sur les"]
[{"$f":"IF(G38>0,G38,1)","v":1},null,{"$f":"'Sommaire du rôle'!N6","v":50000000},null,"valeurs soumises au taux forestier"]
[null,"+"]
["Taux agricole","X","Assiette imposable Taux agricole",null,"Recettes de taxes prélevées sur les"]
[{"$f":"IF(G39>0,G39,1)","v":1},null,{"$f":"'Sommaire du rôle'!L6","v":270604300},null,"valeurs soumises au taux agricole"]
[null,"+"]
["TTVD − TB","X","Assiette imposable TTVD − TB",null,"Recettes de taxes prélevées sur les"]
[{"$f":"MAX(G37-1,0)","v":3},null,{"$f":"'Sommaire du rôle'!L22","v":5228300},null,"valeurs soumises au TTVD − TB"]
[]
[null,"=",{"$f":"E9","v":94624103},null,"Recettes de la taxe foncière générale"]
[]
["D'où :",{"$f":"C45+(A78*C78)+(A111*C111)+(A114*C114)+(A117*C117)+(A120*C120)+(A123*C123)+(A48*C48)+(A51*C51)+(A54*C54)+(A57*C57)+(A60*C60)+(A63*C63)+(A66*C66)+(A69*C69)+(A72*C72)+(A75*C75)+(A81*C81)+(A84*C84)+(A87*C87)+(A90*C90)+(A93*C93)+(A96*C96)+(A99*C99)+(A102*C102)+(A105*C105)+(A108*C108)","v":18733347170.761547}]
[null,"="]
[null,{"$f":"E9","v":94624103}]
[]
[null,null,"soit TB","=",{"$f":"B129","v":94624103}]
[null,null,null,null,{"$f":"B127","v":18733347170.761547}]
[]
[null,null,"TB","=",{"$f":"E131/E132","v":5.0511049700550309E-3}]
[]
[null,null,"TB","=",{"$f":"E134*100","v":0.50511049700550315},"$/100$",{"$f":"IF(I40>0,\"AVERTISSEMENT: Un ou plusieurs taux sont invalides et ne respectent pas les règles de la LFM. Par conséquent, TB est erroné.\",\"-\")","v":"-"}]
[]
["TAUX en $ / 100 $ SELON LA CATÉGORIE D'IMMEUBLES"]
[null,null,"Taux généré",null,"Balises des taux"]
[null,null,null,null,"Minimum","Maximum"]
["TB \n(catégorie résiduelle ou sous-catégorie résiduelle)","=",{"$f":"E136","v":0.50511049700550315}]
["TSCR 1","=",{"$f":"IF('Sommaire du rôle'!H66>0,IF(G15>0,G15*$C$141,$C$141),\"-\")","v":0.67331229250833569},null,{"$f":"'Balises-Taux'!$C$15","v":0.34101818778733078},{"$f":"'Balises-Taux'!$F$15","v":0.68254841489566342}]
["TSCR 2","=",{"$f":"IF('Sommaire du rôle'!J66>0,IF(G16>0,G16*$C$141,$C$141),\"-\")","v":0.67331229250833569},null,{"$f":"'Balises-Taux'!$C$15","v":0.34101818778733078},{"$f":"'Balises-Taux'!$F$15","v":0.68254841489566342}]
["TSCR 3","=",{"$f":"IF('Sommaire du rôle'!L66>0,IF(G17>0,G17*$C$141,$C$141),\"-\")","v":0.67331229250833569},null,{"$f":"'Balises-Taux'!$C$15","v":0.34101818778733078},{"$f":"'Balises-Taux'!$F$15","v":0.68254841489566342}]
["TSCR 4","=",{"$f":"IF('Sommaire du rôle'!N66>0,IF(G18>0,G18*$C$141,$C$141),\"-\")","v":0.67331229250833569},null,{"$f":"'Balises-Taux'!$C$15","v":0.34101818778733078},{"$f":"'Balises-Taux'!$F$15","v":0.68254841489566342}]
["TSCR 5","=",{"$f":"IF('Sommaire du rôle'!P66>0,IF(G19>0,G19*$C$141,$C$141),\"-\")","v":0.67331229250833569},null,{"$f":"'Balises-Taux'!$C$15","v":0.34101818778733078},{"$f":"'Balises-Taux'!$F$15","v":0.68254841489566342}]
["TSCR 6","=",{"$f":"IF('Sommaire du rôle'!R66>0,IF(G20>0,G20*$C$141,$C$141),\"-\")","v":0.67331229250833569},null,{"$f":"'Balises-Taux'!$C$15","v":0.34101818778733078},{"$f":"'Balises-Taux'!$F$15","v":0.68254841489566342}]
["TSCR 7","=",{"$f":"IF('Sommaire du rôle'!T66>0,IF(G21>0,G21*$C$141,$C$141),\"-\")","v":0.67331229250833569},null,{"$f":"'Balises-Taux'!$C$15","v":0.34101818778733078},{"$f":"'Balises-Taux'!$F$15","v":0.68254841489566342}]
["TSCR 8","=",{"$f":"IF('Sommaire du rôle'!V66>0,IF(G22>0,G22*$C$141,$C$141),\"-\")","v":0.67331229250833569},null,{"$f":"'Balises-Taux'!$C$15","v":0.34101818778733078},{"$f":"'Balises-Taux'!$F$15","v":0.68254841489566342}]
["TSCR 9","=",{"$f":"IF('Sommaire du rôle'!X66>0,IF(G23>0,G23*$C$141,$C$141),\"-\")","v":0.67331229250833569},null,{"$f":"'Balises-Taux'!$C$15","v":0.34101818778733078},{"$f":"'Balises-Taux'!$F$15","v":0.68254841489566342}]
["TSCR 10","=",{"$f":"IF('Sommaire du rôle'!Z66>0,IF(G24>0,G24*$C$141,$C$141),\"-\")","v":0.67331229250833569},null,{"$f":"'Balises-Taux'!$C$15","v":0.34101818778733078},{"$f":"'Balises-Taux'!$F$15","v":0.68254841489566342}]
["TINR \n(catégorie non résidentielle ou sous-catégorie de référence)","=",{"$f":"IF('Sommaire du rôle'!F23>0,IF(G25>0,G25*C141,C141),\"-\")","v":2.4245303856264151},null,{"$f":"'Balises-Taux'!C17","v":0.51203932100199812},{"$f":"'Balises-Taux'!F17","v":2.4577887408095909}]
["TSCNR 1","=",{"$f":"IF('Sommaire du rôle'!H46>0,IF(G26>0,G26*$C$141,IF($C$152>0,$C$152,$C$141)),\"-\")","v":2.4245303856264151},null,{"$f":"E152","v":0.51203932100199812},{"$f":"F152","v":2.4577887408095909}]
["TSCNR 2","=",{"$f":"IF('Sommaire du rôle'!J46>0,IF(G27>0,G27*$C$141,IF($C$152>0,$C$152,$C$141)),\"-\")","v":2.4245303856264151},null,{"$f":"E153","v":0.51203932100199812},2.4577887408095909]
["TSCNR 3","=",{"$f":"IF('Sommaire du rôle'!L46>0,IF(G28>0,G28*$C$141,IF($C$152>0,$C$152,$C$141)),\"-\")","v":2.4245303856264151},null,0.51203932100199812,2.4577887408095909]
["TSCNR 4","=",{"$f":"IF('Sommaire du rôle'!N46>0,IF(G29>0,G29*$C$141,IF($C$152>0,$C$152,$C$141)),\"-\")","v":2.4245303856264151},null,0.51203932100199812,2.4577887408095909]
["TSCNR 5","=",{"$f":"IF('Sommaire du rôle'!P46>0,IF(G30>0,G30*$C$141,IF($C$152>0,$C$152,$C$141)),\"-\")","v":2.4245303856264151},null,0.51203932100199812,2.4577887408095909]
["TSCNR 6","=",{"$f":"IF('Sommaire du rôle'!R46>0,IF(G31>0,G31*$C$141,IF($C$152>0,$C$152,$C$141)),\"-\")","v":2.4245303856264151},null,0.51203932100199812,2.4577887408095909]
["TSCNR 7","=",{"$f":"IF('Sommaire du rôle'!T46>0,IF(G32>0,G32*$C$141,IF($C$152>0,$C$152,$C$141)),\"-\")","v":2.4245303856264151},null,0.51203932100199812,2.4577887408095909]
["TSCNR 8","=",{"$f":"IF('Sommaire du rôle'!V46>0,IF(G33>0,G33*$C$141,IF($C$152>0,$C$152,$C$141)),\"-\")","v":2.4245303856264151},null,0.51203932100199812,2.4577887408095909]
["TSCNR 9","=",{"$f":"IF('Sommaire du rôle'!X46>0,IF(G34>0,G34*$C$141,IF($C$152>0,$C$152,$C$141)),\"-\")","v":2.4245303856264151},null,0.51203932100199812,2.4577887408095909]
["TSCNR 10","=",{"$f":"IF('Sommaire du rôle'!Z46>0,IF(G35>0,G35*$C$141,IF($C$152>0,$C$152,$C$141)),\"-\")","v":2.4245303856264151},null,0.51203932100199812,2.4577887408095909]
["TIND","=",{"$f":"IF('Sommaire du rôle'!I23>0,IF(G36>0,A111*C141,IF(C152>0,C152,C141)),\"-\")","v":2.5255524850275157},null,{"$f":"'Balises-Taux'!C27","v":1.6368873013791876},{"$f":"'Balises-Taux'!F27","v":2.5601966050099905}]
["TTVD","=",{"$f":"IF(('Sommaire du rôle'!F22+'Sommaire du rôle'!G22+'Sommaire du rôle'!L23+'Sommaire du rôle'!N23>0),IF(G37>0,G37*C141,C141),\"-\")","v":2.0204419880220126},null,{"$f":"'Balises-Taux'!C30","v":0.51203932100199812},{"$f":"'Balises-Taux'!F30","v":2.0481572840079925}]
["TFOREST","=",{"$f":"IF('Sommaire du rôle'!N6>0,IF(G38>0,G38*C141,C141),\"-\")","v":0.50511049700550315},null,{"$f":"'Balises-Taux'!C32","v":0.34101818778733078},{"$f":"'Balises-Taux'!F32","v":0.51203932100199812}]
["TAGRI","=",{"$f":"IF('Sommaire du rôle'!L6>0,IF(G39>0,G39*C141,C141),\"-\")","v":0.50511049700550315},null,{"$f":"'Balises-Taux'!C34","v":0.34101818778733078},{"$f":"'Balises-Taux'!F34","v":0.51203932100199812}]
["(TTVD − TB)","=",{"$f":"IF(AND(C164>0,('Sommaire du rôle'!F22+'Sommaire du rôle'!G22)>0),C164-C141,\"-\")","v":1.5153314910165094}]
[]
["Si la municipalité n'utilise pas de taux variés, le taux unique sera :",null,null,null,null,null,{"$f":"(F221/C221)*100","v":0.92171720711007998},"$/100$"]
[]
[]
[]
[]
[]
[]
[]
[]
[]
[]
[]
[]
[]
[]
[]
[]
[]
[]
[]
[]
["ASSIETTES IMPOSABLES ET RECETTES "]
[null,null,"Assiettes imposables",null,"Part des assiettes imposables","Recettes","Part des recettes","Écart des recettes avec taux variés vs taux unique "]
["Résiduelle ou sous-catégorie résiduelle","=",{"$f":"C45","v":772400663.71818185},null,{"$f":"C192/C$221","v":7.5238227889176904E-2},{"$f":"IF(C192>0,IF(G141=\"INVALIDE\",\"ERREUR\",C192*C141/100),0)","v":3901476.8313807137},{"$f":"F192/F$221","v":4.1231321700145623E-2},{"$f":"F192-(F$221*E192)","v":-3217872.9939422328}]
["Sous-catégorie résidentielle 1","=",{"$f":"C48","v":761250103.71818185},null,{"$f":"C193/C$221","v":7.4152070906435052E-2},5125590.5250669736,{"$f":"F193/F$221","v":5.4167916657207035E-2},{"$f":"F193-(F$221*E193)","v":-1890982.6700468389}]
["Sous-catégorie résidentielle 2","=",{"$f":"C51","v":761250103.71818185},null,7.4152070906435052E-2,5125590.5250669736,5.4167916657207035E-2,-1890982.6700468389]
["Sous-catégorie résidentielle 3","=",{"$f":"C54","v":761250103.71818185},null,7.4152070906435052E-2,5125590.5250669736,5.4167916657207035E-2,-1890982.6700468389]
["Sous-catégorie résidentielle 4","=",{"$f":"C57","v":761250103.71818185},null,7.4152070906435052E-2,5125590.5250669736,5.4167916657207035E-2,-1890982.6700468389]
["Sous-catégorie résidentielle 5","=",{"$f":"C60","v":761250103.71818185},null,7.4152070906435052E-2,5125590.5250669736,5.4167916657207035E-2,-1890982.6700468389]
["Sous-catégorie résidentielle 6","=",{"$f":"C63","v":761250103.71818185},null,7.4152070906435052E-2,5125590.5250669736,5.4167916657207035E-2,-1890982.6700468389]
["Sous-catégorie résidentielle 7","=",{"$f":"C66","v":761250103.71818185},null,7.4152070906435052E-2,5125590.5250669736,5.4167916657207035E-2,-1890982.6700468389]
["Sous-catégorie résidentielle 8","=",{"$f":"C69","v":761250103.71818185},null,7.4152070906435052E-2,5125590.5250669736,5.4167916657207035E-2,-1890982.6700468389]
["Sous-catégorie résidentielle 9","=",{"$f":"C72","v":761250103.71818185},null,7.4152070906435052E-2,5125590.5250669736,5.4167916657207035E-2,-1890982.6700468389]
["Sous-catégorie résidentielle 10","=",{"$f":"C75","v":761250103.71818185},null,7.4152070906435052E-2,5125590.5250669736,5.4167916657207035E-2,-1890982.6700468389]
["Non résidentielle ou sous-catégorie de référence","=",{"$f":"C78","v":120420639.09999999},null,{"$f":"C203/C$221","v":1.1729968541911875E-2},2919634.9855450238,{"$f":"F203/F$221","v":3.0855087583181891E-2},{"$f":"F203-(F$221*E203)","v":1809697.234048395}]
["Sous-catégorie non résidentielle 1","=",{"$f":"C81","v":112404699.09999999},null,{"$f":"C204/C$221","v":1.0949149533338344E-2},2725286.0845514415,{"$f":"F204/F$221","v":2.880118276578476E-2},{"$f":"F204-(F$221*E204)","v":1689232.6313464323}]
["Sous-catégorie non résidentielle 2","=",{"$f":"C84","v":112404699.09999999},null,1.0949149533338344E-2,2725286.0845514415,2.880118276578476E-2,1689232.6313464323]
["Sous-catégorie non résidentielle 3","=",{"$f":"C87","v":112404699.09999999},null,1.0949149533338344E-2,2725286.0845514415,2.880118276578476E-2,1689232.6313464323]
["Sous-catégorie non résidentielle 4","=",{"$f":"C90","v":112404699.09999999},null,1.0949149533338344E-2,2725286.0845514415,2.880118276578476E-2,1689232.6313464323]
["Sous-catégorie non résidentielle 5","=",{"$f":"C93","v":112404699.09999999},null,1.0949149533338344E-2,2725286.0845514415,2.880118276578476E-2,1689232.6313464323]
["Sous-catégorie non résidentielle 6","=",{"$f":"C96","v":112404699.09999999},null,1.0949149533338344E-2,2725286.0845514415,2.880118276578476E-2,1689232.6313464323]
["Sous-catégorie non résidentielle 7","=",{"$f":"C99","v":112404699.09999999},null,1.0949149533338344E-2,2725286.0845514415,2.880118276578476E-2,1689232.6313464323]
["Sous-catégorie non résidentielle 8","=",{"$f":"C102","v":112404699.09999999},null,1.0949149533338344E-2,2725286.0845514415,2.880118276578476E-2,1689232.6313464323]
["Sous-catégorie non résidentielle 9","=",{"$f":"C105","v":112404699.09999999},null,1.0949149533338344E-2,2725286.0845514415,2.880118276578476E-2,1689232.6313464323]
["Sous-catégorie non résidentielle 10","=",{"$f":"C108","v":112404699.09999999},null,1.0949149533338344E-2,2725286.0845514415,2.880118276578476E-2,1689232.6313464323]
["Industrielle","=",{"$f":"C111","v":239376640},null,{"$f":"C214/C$221","v":2.3317269181214337E-2},6045582.6800953699,{"$f":"F214/F$221","v":6.3890515084675317E-2},{"$f":"F214-(F$221*E214)","v":3839206.999413419}]
["Terrains vagues desservis","=",{"$f":"C114","v":76716400},null,{"$f":"C215/C$221","v":7.4728133430802248E-3},1550010.3572989192,{"$f":"F215/F$221","v":1.6380713878988311E-2},{"$f":"F215-(F$221*E215)","v":842902.09782352182}]
["Forestier","=",{"$f":"C117","v":50000000},null,{"$f":"C216/C$221","v":4.8704145026879685E-3},252555.24850275158,{"$f":"F216/F$221","v":2.6690371744158212E-3},{"$f":"F216-(F$221*E216)","v":-208303.35505228845}]
["Agricole","=",{"$f":"C120","v":270604300},null,{"$f":"C217/C$221","v":2.6359102144194516E-2},1366850.7246482628,{"$f":"F217/F$221","v":1.4445058725135424E-2},{"$f":"F217-(F$221*E217)","v":-1127355.6716315197}]
["TTVD − TB",null,null,null,null,{"$f":"IF(A220>0,A220*C167/100,0)","v":79226.07634481616},{"$f":"F218/F221","v":8.372716235398942E-4},{"$f":"F218","v":79226.07634481616}]
["  Assiette imposable "]
[{"$f":"C123","v":5228300}]
["Total",null,{"$f":"SUM(C192:C217)","v":10266066671.000002},null,{"$f":"SUM(E192:E217)","v":1},{"$f":"IF(I40>0,\"ERREUR\",SUM(F192:F217,F218))","v":94624102.999999985},{"$f":"SUM(G192:G218)","v":1.0000000000000009},{"$f":"SUM(H192:H218)","v":3.693276084959507E-8}]

{"sheet":"Comparaison des scénarios","index":6,"n_rows":87,"n_cols":5,"rows_kept":87,"cut":false,"hidden":false,"merged":[[0,0,0,6],[2,1,2,3]]}
["COMPARAISON DES DIFFÉRENTS SCÉNARIOS ($/100 $ d'évaluation)"]
[]
[]
["Catégorie",null,"Taux unique",{"$f":"'Scénario-taux variés'!E10","v":"Scénario 1"},"Scénario avec le maximum des balises "]
["TB \n(sous-catégorie résiduelle)",null,{"$f":"'Scénario-taux variés'!G169","v":0.92171720711007976},{"$f":"'Scénario-taux variés'!C141","v":0.51203932100199812},{"$f":"Taux_max_balises!C141","v":0.50511049700550315}]
["TSCR1",{"$f":"'Scénario-taux variés'!C15","v":"sr1"},{"$f":"$C$5","v":0.92171720711007976},{"$f":"'Scénario-taux variés'!C142","v":0.51203932100199812},{"$f":"Taux_max_balises!C142","v":0.67331229250833569}]
["TSCR2",{"$f":"'Scénario-taux variés'!C16","v":"sr2"},0.92171720711007976,{"$f":"'Scénario-taux variés'!C143","v":0.68254841489566342},{"$f":"Taux_max_balises!C143","v":0.67331229250833569}]
["TSCR3",{"$f":"'Scénario-taux variés'!C17","v":"sr3"},0.92171720711007976,{"$f":"'Scénario-taux variés'!C144","v":0.68254841489566342},{"$f":"Taux_max_balises!C144","v":0.67331229250833569}]
["TSCR4",{"$f":"'Scénario-taux variés'!C18","v":"sr4"},0.92171720711007976,{"$f":"'Scénario-taux variés'!C145","v":0.68254841489566342},{"$f":"Taux_max_balises!C145","v":0.67331229250833569}]
["TSCR5",{"$f":"'Scénario-taux variés'!C19","v":"sr5"},0.92171720711007976,{"$f":"'Scénario-taux variés'!C146","v":0.68254841489566342},{"$f":"Taux_max_balises!C146","v":0.67331229250833569}]
["TSCR6",{"$f":"'Scénario-taux variés'!C20","v":"sr6"},0.92171720711007976,{"$f":"'Scénario-taux variés'!C147","v":0.68254841489566342},{"$f":"Taux_max_balises!C147","v":0.67331229250833569}]
["TSCR7",{"$f":"'Scénario-taux variés'!C21","v":"sr7"},0.92171720711007976,{"$f":"'Scénario-taux variés'!C148","v":0.68254841489566342},{"$f":"Taux_max_balises!C148","v":0.67331229250833569}]
["TSCR8",{"$f":"'Scénario-taux variés'!C22","v":"sr8"},0.92171720711007976,{"$f":"'Scénario-taux variés'!C149","v":0.68254841489566342},{"$f":"Taux_max_balises!C149","v":0.67331229250833569}]
["TSCR9",{"$f":"'Scénario-taux variés'!C23","v":"sr9"},0.92171720711007976,{"$f":"'Scénario-taux variés'!C150","v":0.68254841489566342},{"$f":"Taux_max_balises!C150","v":0.67331229250833569}]
["TSCR10",{"$f":"'Scénario-taux variés'!C24","v":"sr10"},0.92171720711007976,{"$f":"'Scénario-taux variés'!C151","v":0.68254841489566342},{"$f":"Taux_max_balises!C151","v":0.67331229250833569}]
["TINR\n (taux de la sous-catégorie de référence)",null,0.92171720711007976,{"$f":"'Scénario-taux variés'!C152","v":2.4577887408095909},{"$f":"Taux_max_balises!C152","v":2.4245303856264151}]
["TSCNR1",null,0.92171720711007976,{"$f":"'Scénario-taux variés'!C153","v":2.4577887408095909},{"$f":"Taux_max_balises!C153","v":2.4245303856264151}]
["TSCNR2",{"$f":"'Scénario-taux variés'!C26","v":"snr1"},0.92171720711007976,{"$f":"'Scénario-taux variés'!C154","v":2.4577887408095909},{"$f":"Taux_max_balises!C154","v":2.4245303856264151}]
["TSCNR3",{"$f":"'Scénario-taux variés'!C27","v":"snr2"},0.92171720711007976,{"$f":"'Scénario-taux variés'!C155","v":2.4577887408095909},{"$f":"Taux_max_balises!C155","v":2.4245303856264151}]
["TSCNR4",{"$f":"'Scénario-taux variés'!C28","v":"snr3"},0.92171720711007976,{"$f":"'Scénario-taux variés'!C156","v":2.4577887408095909},{"$f":"Taux_max_balises!C156","v":2.4245303856264151}]
["TSCNR5",{"$f":"'Scénario-taux variés'!C29","v":"snr4"},0.92171720711007976,{"$f":"'Scénario-taux variés'!C157","v":2.4577887408095909},{"$f":"Taux_max_balises!C157","v":2.4245303856264151}]
["TSCNR6",{"$f":"'Scénario-taux variés'!C30","v":"snr5"},0.92171720711007976,{"$f":"'Scénario-taux variés'!C158","v":2.4577887408095909},{"$f":"Taux_max_balises!C158","v":2.4245303856264151}]
["TSCNR7",{"$f":"'Scénario-taux variés'!C31","v":"snr6"},0.92171720711007976,{"$f":"'Scénario-taux variés'!C159","v":2.4577887408095909},{"$f":"Taux_max_balises!C159","v":2.4245303856264151}]
["TSCNR8",{"$f":"'Scénario-taux variés'!C32","v":"snr7"},0.92171720711007976,{"$f":"'Scénario-taux variés'!C160","v":2.4577887408095909},{"$f":"Taux_max_balises!C160","v":2.4245303856264151}]
["TSCNR9",{"$f":"'Scénario-taux variés'!C33","v":"snr8"},0.92171720711007976,{"$f":"'Scénario-taux variés'!C161","v":2.4577887408095909},{"$f":"Taux_max_balises!C161","v":2.4245303856264151}]
["TSCNR10",{"$f":"'Scénario-taux variés'!C34","v":"snr9"},0.92171720711007976,{"$f":"'Scénario-taux variés'!C162","v":2.4577887408095909},{"$f":"Taux_max_balises!C162","v":2.4245303856264151}]
["TIND",null,0.92171720711007976,{"$f":"'Scénario-taux variés'!C163","v":2.5601966050099905},{"$f":"Taux_max_balises!C163","v":2.5255524850275157}]
["TTVD",null,0.92171720711007976,{"$f":"'Scénario-taux variés'!C164","v":2.0481572840079925},{"$f":"Taux_max_balises!C164","v":2.0204419880220126}]
["TFOREST",null,0.92171720711007976,{"$f":"'Scénario-taux variés'!C165","v":0.51203932100199812},{"$f":"Taux_max_balises!C165","v":0.50511049700550315}]
["TAGRI",null,0.92171720711007976,{"$f":"'Scénario-taux variés'!C166","v":0.51203932100199812},{"$f":"Taux_max_balises!C166","v":0.50511049700550315}]
["(TTVD − TB)",null,0.92171720711007976,{"$f":"'Scénario-taux variés'!C167","v":1.5361179630059945},{"$f":"Taux_max_balises!C167","v":1.5153314910165094}]
[]
[]
[]
[]
[]
[]
[]
[]
[]
[]
[]
[]
[]
[]
[]
[]
[]
[]
[]
[]
[]
[]
[]
[]
[]
[]
[]
[]
["Catégorie","Part des assiettes imposables","Recettes-Scénario ","Recettes-Scénario avec le maximum des balises"]
["Résiduelle ou sous-catégorie résiduelle",{"$f":"'Scénario-taux variés'!E192","v":7.5238227889176904E-2},{"$f":"'Scénario-taux variés'!G192","v":4.179690996825098E-2},{"$f":"Taux_max_balises!G192","v":4.1231321700145623E-2}]
["Sous-catégorie résidentielle 1",{"$f":"'Scénario-taux variés'!E193","v":7.4152070906435052E-2},{"$f":"'Scénario-taux variés'!G193","v":4.1193519818154431E-2},{"$f":"Taux_max_balises!G193","v":5.4167916657207035E-2}]
["Sous-catégorie résidentielle 2",{"$f":"'Scénario-taux variés'!E194","v":7.4152070906435052E-2},{"$f":"'Scénario-taux variés'!G194","v":5.4910961917599858E-2},{"$f":"Taux_max_balises!G194","v":5.4167916657207035E-2}]
["Sous-catégorie résidentielle 3",{"$f":"'Scénario-taux variés'!E195","v":7.4152070906435052E-2},{"$f":"'Scénario-taux variés'!G195","v":5.4910961917599858E-2},{"$f":"Taux_max_balises!G195","v":5.4167916657207035E-2}]
["Sous-catégorie résidentielle 4",{"$f":"'Scénario-taux variés'!E196","v":7.4152070906435052E-2},{"$f":"'Scénario-taux variés'!G196","v":5.4910961917599858E-2},{"$f":"Taux_max_balises!G196","v":5.4167916657207035E-2}]
["Sous-catégorie résidentielle 5",{"$f":"'Scénario-taux variés'!E197","v":7.4152070906435052E-2},{"$f":"'Scénario-taux variés'!G197","v":5.4910961917599858E-2},{"$f":"Taux_max_balises!G197","v":5.4167916657207035E-2}]
["Sous-catégorie résidentielle 6",{"$f":"'Scénario-taux variés'!E198","v":7.4152070906435052E-2},{"$f":"'Scénario-taux variés'!G198","v":5.4910961917599858E-2},{"$f":"Taux_max_balises!G198","v":5.4167916657207035E-2}]
["Sous-catégorie résidentielle 7",{"$f":"'Scénario-taux variés'!E199","v":7.4152070906435052E-2},{"$f":"'Scénario-taux variés'!G199","v":5.4910961917599858E-2},{"$f":"Taux_max_balises!G199","v":5.4167916657207035E-2}]
["Sous-catégorie résidentielle 8",{"$f":"'Scénario-taux variés'!E200","v":7.4152070906435052E-2},{"$f":"'Scénario-taux variés'!G200","v":5.4910961917599858E-2},{"$f":"Taux_max_balises!G200","v":5.4167916657207035E-2}]
["Sous-catégorie résidentielle 9",{"$f":"'Scénario-taux variés'!E201","v":7.4152070906435052E-2},{"$f":"'Scénario-taux variés'!G201","v":5.4910961917599858E-2},{"$f":"Taux_max_balises!G201","v":5.4167916657207035E-2}]
["Sous-catégorie résidentielle 10",{"$f":"'Scénario-taux variés'!E202","v":7.4152070906435052E-2},{"$f":"'Scénario-taux variés'!G202","v":5.4910961917599858E-2},{"$f":"Taux_max_balises!G202","v":5.4167916657207035E-2}]
["Non résidentielle ou sous-catégorie de référence",{"$f":"'Scénario-taux variés'!E203","v":1.1729968541911875E-2},{"$f":"'Scénario-taux variés'!G203","v":3.1278340460577501E-2},{"$f":"Taux_max_balises!G203","v":3.0855087583181891E-2}]
["Sous-catégorie non résidentielle 1",{"$f":"'Scénario-taux variés'!E204","v":1.0949149533338344E-2},{"$f":"'Scénario-taux variés'!G204","v":2.9196261322769961E-2},{"$f":"Taux_max_balises!G204","v":2.880118276578476E-2}]
["Sous-catégorie non résidentielle 2",{"$f":"'Scénario-taux variés'!E205","v":1.0949149533338344E-2},{"$f":"'Scénario-taux variés'!G205","v":2.9196261322769961E-2},{"$f":"Taux_max_balises!G205","v":2.880118276578476E-2}]
["Sous-catégorie non résidentielle 3",{"$f":"'Scénario-taux variés'!E206","v":1.0949149533338344E-2},{"$f":"'Scénario-taux variés'!G206","v":2.9196261322769961E-2},{"$f":"Taux_max_balises!G206","v":2.880118276578476E-2}]
["Sous-catégorie non résidentielle 4",{"$f":"'Scénario-taux variés'!E207","v":1.0949149533338344E-2},{"$f":"'Scénario-taux variés'!G207","v":2.9196261322769961E-2},{"$f":"Taux_max_balises!G207","v":2.880118276578476E-2}]
["Sous-catégorie non résidentielle 5",{"$f":"'Scénario-taux variés'!E208","v":1.0949149533338344E-2},{"$f":"'Scénario-taux variés'!G208","v":2.9196261322769961E-2},{"$f":"Taux_max_balises!G208","v":2.880118276578476E-2}]
["Sous-catégorie non résidentielle 6",{"$f":"'Scénario-taux variés'!E209","v":1.0949149533338344E-2},{"$f":"'Scénario-taux variés'!G209","v":2.9196261322769961E-2},{"$f":"Taux_max_balises!G209","v":2.880118276578476E-2}]
["Sous-catégorie non résidentielle 7",{"$f":"'Scénario-taux variés'!E210","v":1.0949149533338344E-2},{"$f":"'Scénario-taux variés'!G210","v":2.9196261322769961E-2},{"$f":"Taux_max_balises!G210","v":2.880118276578476E-2}]
["Sous-catégorie non résidentielle 8",{"$f":"'Scénario-taux variés'!E211","v":1.0949149533338344E-2},{"$f":"'Scénario-taux variés'!G211","v":2.9196261322769961E-2},{"$f":"Taux_max_balises!G211","v":2.880118276578476E-2}]
["Sous-catégorie non résidentielle 9",{"$f":"'Scénario-taux variés'!E212","v":1.0949149533338344E-2},{"$f":"'Scénario-taux variés'!G212","v":2.9196261322769961E-2},{"$f":"Taux_max_balises!G212","v":2.880118276578476E-2}]
["Sous-catégorie non résidentielle 10",{"$f":"'Scénario-taux variés'!E213","v":1.0949149533338344E-2},{"$f":"'Scénario-taux variés'!G213","v":2.9196261322769961E-2},{"$f":"Taux_max_balises!G213","v":2.880118276578476E-2}]
["Industrielle",{"$f":"'Scénario-taux variés'!E214","v":2.3317269181214337E-2},{"$f":"'Scénario-taux variés'!G214","v":6.4766929526053105E-2},{"$f":"Taux_max_balises!G214","v":6.3890515084675317E-2}]
["Terrains vagues désservis",{"$f":"'Scénario-taux variés'!E215","v":7.4728133430802248E-3},{"$f":"'Scénario-taux variés'!G215","v":1.6605415373170916E-2},{"$f":"Taux_max_balises!G215","v":1.6380713878988311E-2}]
["Forestier",{"$f":"'Scénario-taux variés'!E216","v":4.8704145026879685E-3},{"$f":"'Scénario-taux variés'!G216","v":2.7056495373171375E-3},{"$f":"Taux_max_balises!G216","v":2.6690371744158212E-3}]
["Agricole",{"$f":"'Scénario-taux variés'!E217","v":2.6359102144194516E-2},{"$f":"'Scénario-taux variés'!G217","v":1.4643207981820557E-2},{"$f":"Taux_max_balises!G217","v":1.4445058725135424E-2}]
["TTVD − TB",{"$f":"'Scénario-taux variés'!E218","v":0},{"$f":"'Scénario-taux variés'!G218","v":8.4875684855731154E-4},{"$f":"Taux_max_balises!G218","v":8.372716235398942E-4}]

{"sheet":"Résultats du scénario","index":7,"n_rows":168,"n_cols":11,"rows_kept":168,"cut":false,"hidden":false,"merged":[]}
[null,"Municipalité de ",{"$f":"'Scénario-taux variés'!E7","v":0}]
[null,"Année :",{"$f":"'Scénario-taux variés'!G7","v":0}]
[null,"Nom du scénario :",{"$f":"'Scénario-taux variés'!E10","v":"Scénario 1"}]
[]
["Taux de la taxe foncière générale"]
["TB",null,{"$f":"'Scénario-taux variés'!C141","v":0.51203932100199812},"/ 100 $"]
["TSCR 1",{"$f":"'Scénario-taux variés'!C15","v":"sr1"},{"$f":"'Scénario-taux variés'!C142","v":0.51203932100199812},"/ 100 $"]
["TSCR 2",{"$f":"'Scénario-taux variés'!C16","v":"sr2"},{"$f":"'Scénario-taux variés'!C143","v":0.68254841489566342},"/ 100 $"]
["TSCR 3",{"$f":"'Scénario-taux variés'!C17","v":"sr3"},{"$f":"'Scénario-taux variés'!C144","v":0.68254841489566342},"/ 100 $"]
["TSCR 4",{"$f":"'Scénario-taux variés'!C18","v":"sr4"},{"$f":"'Scénario-taux variés'!C145","v":0.68254841489566342},"/ 100 $"]
["TSCR 5",{"$f":"'Scénario-taux variés'!C19","v":"sr5"},{"$f":"'Scénario-taux variés'!C146","v":0.68254841489566342},"/ 100 $"]
["TSCR 6",{"$f":"'Scénario-taux variés'!C20","v":"sr6"},{"$f":"'Scénario-taux variés'!C147","v":0.68254841489566342},"/ 100 $"]
["TSCR 7",{"$f":"'Scénario-taux variés'!C21","v":"sr7"},{"$f":"'Scénario-taux variés'!C148","v":0.68254841489566342},"/ 100 $"]
["TSCR 8",{"$f":"'Scénario-taux variés'!C22","v":"sr8"},{"$f":"'Scénario-taux variés'!C149","v":0.68254841489566342},"/ 100 $"]
["TSCR 9",{"$f":"'Scénario-taux variés'!C23","v":"sr9"},{"$f":"'Scénario-taux variés'!C150","v":0.68254841489566342},"/ 100 $"]
["TSCR 10",{"$f":"'Scénario-taux variés'!C24","v":"sr10"},{"$f":"'Scénario-taux variés'!C151","v":0.68254841489566342},"/ 100 $"]
["TINR ou Taux sous-catégorie de référence",null,{"$f":"'Scénario-taux variés'!C152","v":2.4577887408095909},"/ 100 $"]
["TSCNR 1",{"$f":"'Scénario-taux variés'!C26","v":"snr1"},{"$f":"'Scénario-taux variés'!C153","v":2.4577887408095909},"/ 100 $"]
["TSCNR 2",{"$f":"'Scénario-taux variés'!C27","v":"snr2"},{"$f":"'Scénario-taux variés'!C154","v":2.4577887408095909},"/ 100 $"]
["TSCNR 3",{"$f":"'Scénario-taux variés'!C28","v":"snr3"},{"$f":"'Scénario-taux variés'!C155","v":2.4577887408095909},"/ 100 $"]
["TSCNR 4",{"$f":"'Scénario-taux variés'!C29","v":"snr4"},{"$f":"'Scénario-taux variés'!C156","v":2.4577887408095909},"/ 100 $"]
["TSCNR 5",{"$f":"'Scénario-taux variés'!C30","v":"snr5"},{"$f":"'Scénario-taux variés'!C157","v":2.4577887408095909},"/ 100 $"]
["TSCNR 6",{"$f":"'Scénario-taux variés'!C31","v":"snr6"},{"$f":"'Scénario-taux variés'!C158","v":2.4577887408095909},"/ 100 $"]
["TSCNR 7",{"$f":"'Scénario-taux variés'!C32","v":"snr7"},{"$f":"'Scénario-taux variés'!C159","v":2.4577887408095909},"/ 100 $"]
["TSCNR 8",{"$f":"'Scénario-taux variés'!C33","v":"snr8"},{"$f":"'Scénario-taux variés'!C160","v":2.4577887408095909},"/ 100 $"]
["TSCNR 9",{"$f":"'Scénario-taux variés'!C34","v":"snr9"},{"$f":"'Scénario-taux variés'!C161","v":2.4577887408095909},"/ 100 $"]
["TSCNR 10",{"$f":"'Scénario-taux variés'!C35","v":"snr10"},{"$f":"'Scénario-taux variés'!C162","v":2.4577887408095909},"/ 100 $"]
["TIND",null,{"$f":"'Scénario-taux variés'!C163","v":2.5601966050099905},"/ 100 $"]
["TTVD",null,{"$f":"'Scénario-taux variés'!C164","v":2.0481572840079925},"/ 100 $",null,null,null,null,null,null," "]
["TFOREST",null,{"$f":"'Scénario-taux variés'!C165","v":0.51203932100199812},"/ 100 $"]
["TAGRI",null,{"$f":"'Scénario-taux variés'!C166","v":0.51203932100199812},"/ 100 $"]
["(TTVD − TB)",null,{"$f":"'Scénario-taux variés'!C167","v":1.5361179630059945},"/ 100 $"]
[]
[]
[]
[]
[]
[]
[]
[]
[]
[]
[]
[]
[]
[]
[]
[]
[]
[]
[]
["Recettes des assiettes imposables"]
[null,null,"Assiettes ",null,null,"Recettes"]
["Catégorie",null,"Montant","Part ",null,"Montant","Part "]
["Résiduelle ou sous-catégorie résiduelle",null,{"$f":"IF('Sommaire du rôle'!F66>0,'Sommaire du rôle'!F83,'Sommaire du rôle'!O71)","v":772400663.71818185},{"$f":"C55/C$84","v":7.5238227889176904E-2},null,{"$f":"'Scénario-taux variés'!F192","v":3954995.1139175054},{"$f":"F55/F$84","v":4.179690996825098E-2}]
["Sous-catégorie résidentielle 1",{"$f":"B7","v":"sr1"},{"$f":"'Sommaire du rôle'!G$83","v":761250103.71818185},{"$f":"C56/C$84","v":7.4152070906435052E-2},null,{"$f":"'Scénario-taux variés'!F193","v":3897899.8622055845},{"$f":"F56/F$84","v":4.1193519818154431E-2}]
["Sous-catégorie résidentielle 2","sr2",{"$f":"'Sommaire du rôle'!H$83","v":761250103.71818185},7.4152070906435052E-2,null,{"$f":"'Scénario-taux variés'!F194","v":5195900.5163200442},5.4910961917599858E-2]
["Sous-catégorie résidentielle 3","sr3",{"$f":"'Sommaire du rôle'!I$83","v":761250103.71818185},7.4152070906435052E-2,null,{"$f":"'Scénario-taux variés'!F195","v":5195900.5163200442},5.4910961917599858E-2]
["Sous-catégorie résidentielle 4","sr4",{"$f":"'Sommaire du rôle'!J$83","v":761250103.71818185},7.4152070906435052E-2,null,{"$f":"'Scénario-taux variés'!F196","v":5195900.5163200442},5.4910961917599858E-2]
["Sous-catégorie résidentielle 5","sr5",{"$f":"'Sommaire du rôle'!K$83","v":761250103.71818185},7.4152070906435052E-2,null,{"$f":"'Scénario-taux variés'!F197","v":5195900.5163200442},5.4910961917599858E-2]
["Sous-catégorie résidentielle 6","sr6",{"$f":"'Sommaire du rôle'!L$83","v":761250103.71818185},7.4152070906435052E-2,null,{"$f":"'Scénario-taux variés'!F198","v":5195900.5163200442},5.4910961917599858E-2]
["Sous-catégorie résidentielle 7","sr7",{"$f":"'Sommaire du rôle'!M$83","v":761250103.71818185},7.4152070906435052E-2,null,{"$f":"'Scénario-taux variés'!F199","v":5195900.5163200442},5.4910961917599858E-2]
["Sous-catégorie résidentielle 8","sr8",{"$f":"'Sommaire du rôle'!N$83","v":761250103.71818185},7.4152070906435052E-2,null,{"$f":"'Scénario-taux variés'!F200","v":5195900.5163200442},5.4910961917599858E-2]
["Sous-catégorie résidentielle 9","sr9",{"$f":"'Sommaire du rôle'!O$83","v":761250103.71818185},7.4152070906435052E-2,null,{"$f":"'Scénario-taux variés'!F201","v":5195900.5163200442},5.4910961917599858E-2]
["Sous-catégorie résidentielle 10","sr10",{"$f":"'Sommaire du rôle'!P$83","v":761250103.71818185},7.4152070906435052E-2,null,{"$f":"'Scénario-taux variés'!F202","v":5195900.5163200442},5.4910961917599858E-2]
["Non résidentielle ou sous-catégorie de référence",null,{"$f":"IF('Sommaire du rôle'!F46>0,'Sommaire du rôle'!F77,'Sommaire du rôle'!F71)","v":120420639.09999999},1.1729968541911875E-2,null,{"$f":"'Scénario-taux variés'!F203","v":2959684.9094107514},3.1278340460577501E-2]
["Sous-catégorie non résidentielle 1",{"$f":"B18","v":"snr1"},{"$f":"'Sommaire du rôle'!G$77","v":112404699.09999999},1.0949149533338344E-2,null,{"$f":"'Scénario-taux variés'!F204","v":2762670.0386206997},2.9196261322769961E-2]
["Sous-catégorie non résidentielle 2","snr2",{"$f":"'Sommaire du rôle'!H$77","v":112404699.09999999},1.0949149533338344E-2,null,{"$f":"'Scénario-taux variés'!F205","v":2762670.0386206997},2.9196261322769961E-2]
["Sous-catégorie non résidentielle 3","snr3",{"$f":"'Sommaire du rôle'!I$77","v":112404699.09999999},1.0949149533338344E-2,null,{"$f":"'Scénario-taux variés'!F206","v":2762670.0386206997},2.9196261322769961E-2]
["Sous-catégorie non résidentielle 4","snr4",{"$f":"'Sommaire du rôle'!J$77","v":112404699.09999999},1.0949149533338344E-2,null,{"$f":"'Scénario-taux variés'!F207","v":2762670.0386206997},2.9196261322769961E-2]
["Sous-catégorie non résidentielle 5","snr5",{"$f":"'Sommaire du rôle'!K$77","v":112404699.09999999},1.0949149533338344E-2,null,{"$f":"'Scénario-taux variés'!F208","v":2762670.0386206997},2.9196261322769961E-2]
["Sous-catégorie non résidentielle 6","snr6",{"$f":"'Sommaire du rôle'!L$77","v":112404699.09999999},1.0949149533338344E-2,null,{"$f":"'Scénario-taux variés'!F209","v":2762670.0386206997},2.9196261322769961E-2]
["Sous-catégorie non résidentielle 7","snr7",{"$f":"'Sommaire du rôle'!M$77","v":112404699.09999999},1.0949149533338344E-2,null,{"$f":"'Scénario-taux variés'!F210","v":2762670.0386206997},2.9196261322769961E-2]
["Sous-catégorie non résidentielle 8","snr8",{"$f":"'Sommaire du rôle'!N$77","v":112404699.09999999},1.0949149533338344E-2,null,{"$f":"'Scénario-taux variés'!F211","v":2762670.0386206997},2.9196261322769961E-2]
["Sous-catégorie non résidentielle 9","snr9",{"$f":"'Sommaire du rôle'!O$77","v":112404699.09999999},1.0949149533338344E-2,null,{"$f":"'Scénario-taux variés'!F212","v":2762670.0386206997},2.9196261322769961E-2]
["Sous-catégorie non résidentielle 10","snr10",{"$f":"'Sommaire du rôle'!P$77","v":112404699.09999999},1.0949149533338344E-2,null,{"$f":"'Scénario-taux variés'!F213","v":2762670.0386206997},2.9196261322769961E-2]
["Industrielle",null,{"$f":"'Sommaire du rôle'!H71","v":239376640},2.3317269181214337E-2,null,{"$f":"'Scénario-taux variés'!F214","v":6128512.6104669869},6.4766929526053105E-2]
["Terrains vagues desservis",null,{"$f":"'Sommaire du rôle'!L71","v":76716400},7.4728133430802248E-3,null,{"$f":"'Scénario-taux variés'!F215","v":1571272.5346287074},1.6605415373170916E-2]
["Forestier",null,{"$f":"'Sommaire du rôle'!N6","v":50000000},4.8704145026879685E-3,null,{"$f":"'Scénario-taux variés'!F216","v":256019.66050099905},2.7056495373171375E-3]
["Agricole",null,{"$f":"'Sommaire du rôle'!L6","v":270604300},2.6359102144194516E-2,null,{"$f":"'Scénario-taux variés'!F217","v":1385600.4203222098},1.4643207981820557E-2]
["(TTVD − TB)",null,null,null,null,{"$f":"'Scénario-taux variés'!F218","v":80312.855459842409},8.4875684855731154E-4]
["  Assiette imposable "]
[{"$f":"'Sommaire du rôle'!L22","v":5228300}]
["Total des assiettes imposable",null,{"$f":"SUM(C55:C81)","v":10266066671.000002},{"$f":"SUM(D55:D81)","v":1},null,{"$f":"IF('Scénario-taux variés'!K40>0,\"ERREUR\",SUM(F55:F81))","v":94624102.999999955},{"$f":"F84/F$84","v":1}]
[]
[]
[]
[]
[]
[]
[]
[]
[]
[]
[]
[]
[]
[]
[]
[]
[]
["Recettes des assiettes compensables"]
[null,null,"Assiettes ",null,null,"Recettes"]
["Catégorie",null,"Montant ","Part ",null,"Montant ","Part "]
["Résiduelle ou sous-catégorie résiduelle",null,{"$f":"IF('Sommaire du rôle'!F66>0,'Sommaire du rôle'!F84,'Sommaire du rôle'!O72)","v":5708197},{"$f":"C105/C$134","v":1.6292436865418213E-2},null,{"$f":"IF(F55=\"ERREUR\",\"ERREUR\",IF(C105>0,C6/100*C105,0))","v":29228.21316025643},{"$f":"F105/F$134","v":3.9079977302152345E-3}]
["Sous-catégorie résidentielle 1",{"$f":"B7","v":"sr1"},{"$f":"'Sommaire du rôle'!G84","v":5708197},{"$f":"C106/C$134","v":1.6292436865418213E-2},null,29228.21316025643,{"$f":"F106/F$134","v":3.9079977302152345E-3}]
["Sous-catégorie résidentielle 2","sr2",{"$f":"'Sommaire du rôle'!H84","v":5708197},1.6292436865418213E-2,null,38961.208142621814,5.2093609743769061E-3]
["Sous-catégorie résidentielle 3","sr3",{"$f":"'Sommaire du rôle'!I84","v":5708197},1.6292436865418213E-2,null,38961.208142621814,5.2093609743769061E-3]
["Sous-catégorie résidentielle 4","sr4",{"$f":"'Sommaire du rôle'!J84","v":5708197},1.6292436865418213E-2,null,38961.208142621814,5.2093609743769061E-3]
["Sous-catégorie résidentielle 5","sr5",{"$f":"'Sommaire du rôle'!K84","v":5708197},1.6292436865418213E-2,null,38961.208142621814,5.2093609743769061E-3]
["Sous-catégorie résidentielle 6","sr6",{"$f":"'Sommaire du rôle'!L84","v":5708197},1.6292436865418213E-2,null,38961.208142621814,5.2093609743769061E-3]
["Sous-catégorie résidentielle 7","sr7",{"$f":"'Sommaire du rôle'!M84","v":5708197},1.6292436865418213E-2,null,38961.208142621814,5.2093609743769061E-3]
["Sous-catégorie résidentielle 8","sr8",{"$f":"'Sommaire du rôle'!N84","v":5708197},1.6292436865418213E-2,null,38961.208142621814,5.2093609743769061E-3]
["Sous-catégorie résidentielle 9","sr9",{"$f":"'Sommaire du rôle'!O84","v":5708197},1.6292436865418213E-2,null,38961.208142621814,5.2093609743769061E-3]
["Sous-catégorie résidentielle 10","sr10",{"$f":"'Sommaire du rôle'!P84","v":5708197},1.6292436865418213E-2,null,38961.208142621814,5.2093609743769061E-3]
["Non résidentielle ou sous-catégorie de référence",null,{"$f":"IF('Sommaire du rôle'!F46>0,'Sommaire du rôle'!F78,'Sommaire du rôle'!F72)","v":25925903},{"$f":"C116/C$134","v":7.3998171017303119E-2},null,637203.92488721595,{"$f":"F116/F$134","v":8.5198211689846287E-2}]
["Sous-catégorie non résidentielle 1",{"$f":"B18","v":"snr1"},{"$f":"'Sommaire du rôle'!G78","v":25925903},{"$f":"C117/C$134","v":7.3998171017303119E-2},null,637203.92488721595,{"$f":"F117/F$134","v":8.5198211689846287E-2}]
["Sous-catégorie non résidentielle 2","snr2",{"$f":"'Sommaire du rôle'!H78","v":25925903},7.3998171017303119E-2,null,637203.92488721595,8.5198211689846287E-2]
["Sous-catégorie non résidentielle 3","snr3",{"$f":"'Sommaire du rôle'!I78","v":25925903},7.3998171017303119E-2,null,637203.92488721595,8.5198211689846287E-2]
["Sous-catégorie non résidentielle 4","snr4",{"$f":"'Sommaire du rôle'!J78","v":25925903},7.3998171017303119E-2,null,637203.92488721595,8.5198211689846287E-2]
["Sous-catégorie non résidentielle 5","snr5",{"$f":"'Sommaire du rôle'!K78","v":25925903},7.3998171017303119E-2,null,637203.92488721595,8.5198211689846287E-2]
["Sous-catégorie non résidentielle 6","snr6",{"$f":"'Sommaire du rôle'!L78","v":25925903},7.3998171017303119E-2,null,637203.92488721595,8.5198211689846287E-2]
["Sous-catégorie non résidentielle 7","snr7",{"$f":"'Sommaire du rôle'!M78","v":25925903},7.3998171017303119E-2,null,637203.92488721595,8.5198211689846287E-2]
["Sous-catégorie non résidentielle 8","snr8",{"$f":"'Sommaire du rôle'!N78","v":25925903},7.3998171017303119E-2,null,637203.92488721595,8.5198211689846287E-2]
["Sous-catégorie non résidentielle 9","snr9",{"$f":"'Sommaire du rôle'!O78","v":25925903},7.3998171017303119E-2,null,637203.92488721595,8.5198211689846287E-2]
["Sous-catégorie non résidentielle 10","snr10",{"$f":"'Sommaire du rôle'!P78","v":25925903},7.3998171017303119E-2,null,637203.92488721595,8.5198211689846287E-2]
["Industrielle",null,{"$f":"'Sommaire du rôle'!H72","v":2325200},{"$f":"C127/C$134","v":6.6366269768668509E-3},null,59529.691459692294,{"$f":"F127/F$134","v":7.9594978259303773E-3}]
["Terrains vagues desservis",null,{"$f":"'Sommaire du rôle'!L72","v":58400},{"$f":"C128/C$134","v":1.6668631319844492E-4},null,1196.1238538606676,{"$f":"F128/F$134","v":1.599293559381848E-4}]
["Forestier",null,{"$f":"'Sommaire du rôle'!L73","v":0},{"$f":"C129/C$134","v":0},null,0,{"$f":"F129/F$134","v":0}]
["Agricole",null,{"$f":"'Sommaire du rôle'!L74","v":0},{"$f":"C130/C$134","v":0},null,0,{"$f":"F130/F$134","v":0}]
["(TTVD − TB)",null,null,null,null,{"$f":"IF(A133>0,(C32)/100*A133,0)","v":0},{"$f":"F131/F$134","v":0}]
["Assiette compensable"]
[{"$f":"'Sommaire du rôle'!N22","v":0}]
["Total",null,{"$f":"SUM(C105:C131)","v":350358700},{"$f":"SUM(D105:D131)","v":0.99999999999999989},null,{"$f":"IF(F84=\"ERREUR\",\"ERREUR\",SUM(F105:F131))","v":7479076.2886770349},{"$f":"IF(G84=\"ERREUR\",\"ERREUR\",SUM(G105:G131))","v":1.0000000000000007}]
[]
["Recettes des assiettes (imposables + compensables)"]
[null,null,"Assiettes ",null,null,"Recettes"]
["Catégorie",null,"Montant ","Part ",null,"Montant ","Part "]
["Résiduelle ou sous-catégorie résiduelle",null,{"$f":"C55+C105","v":778108860.71818185},{"$f":"C139/$C$168","v":7.3292924268433757E-2},null,{"$f":"F55+F105","v":3984223.3270777618},{"$f":"F139/$F$168","v":3.9021540316713732E-2}]
["Sous-catégorie résidentielle 1",{"$f":"B7","v":"sr1"},{"$f":"C56+C106","v":766958300.71818185},{"$f":"C140/$C$168","v":7.2242612170874146E-2},null,{"$f":"F56+F106","v":3927128.0753658409},{"$f":"F140/$F$168","v":3.8462348603882784E-2}]
["Sous-catégorie résidentielle 2","sr2",{"$f":"C57+C107","v":766958300.71818185},7.2242612170874146E-2,null,5234861.7244626656,5.1270310688975751E-2]
["Sous-catégorie résidentielle 3","sr3",766958300.71818185,7.2242612170874146E-2,null,5234861.7244626656,5.1270310688975751E-2]
["Sous-catégorie résidentielle 4","sr4",766958300.71818185,7.2242612170874146E-2,null,5234861.7244626656,5.1270310688975751E-2]
["Sous-catégorie résidentielle 5","sr5",766958300.71818185,7.2242612170874146E-2,null,5234861.7244626656,5.1270310688975751E-2]
["Sous-catégorie résidentielle 6","sr6",766958300.71818185,7.2242612170874146E-2,null,5234861.7244626656,5.1270310688975751E-2]
["Sous-catégorie résidentielle 7","sr7",766958300.71818185,7.2242612170874146E-2,null,5234861.7244626656,5.1270310688975751E-2]
["Sous-catégorie résidentielle 8","sr8",766958300.71818185,7.2242612170874146E-2,null,5234861.7244626656,5.1270310688975751E-2]
["Sous-catégorie résidentielle 9","sr9",766958300.71818185,7.2242612170874146E-2,null,5234861.7244626656,5.1270310688975751E-2]
["Sous-catégorie résidentielle 10","sr10",766958300.71818185,7.2242612170874146E-2,null,5234861.7244626656,5.1270310688975751E-2]
["Non résidentielle ou sous-catégorie de référence",null,{"$f":"C66+C116","v":146346542.09999999},{"$f":"C150/$C$168","v":1.3784916955170482E-2},null,{"$f":"F66+F116","v":3596888.8342979671},{"$f":"F150/$F$168","v":3.5227980748067191E-2}]
["Sous-catégorie non résidentielle 1",{"$f":"B18","v":"snr1"},{"$f":"C67+C117","v":138330602.09999999},{"$f":"C151/$C$168","v":1.3029866199395711E-2},null,{"$f":"F67+F117","v":3399873.9635079158},{"$f":"F151/$F$168","v":3.3298414282433145E-2}]
["Sous-catégorie non résidentielle 2",{"$f":"B19","v":"snr2"},138330602.09999999,1.3029866199395711E-2,null,3399873.9635079158,3.3298414282433145E-2]
["Sous-catégorie non résidentielle 3","snr3",138330602.09999999,1.3029866199395711E-2,null,3399873.9635079158,3.3298414282433145E-2]
["Sous-catégorie non résidentielle 4","snr4",138330602.09999999,1.3029866199395711E-2,null,3399873.9635079158,3.3298414282433145E-2]
["Sous-catégorie non résidentielle 5","snr5",138330602.09999999,1.3029866199395711E-2,null,3399873.9635079158,3.3298414282433145E-2]
["Sous-catégorie non résidentielle 6","snr6",138330602.09999999,1.3029866199395711E-2,null,3399873.9635079158,3.3298414282433145E-2]
["Sous-catégorie non résidentielle 7","snr7",138330602.09999999,1.3029866199395711E-2,null,3399873.9635079158,3.3298414282433145E-2]
["Sous-catégorie non résidentielle 8","snr8",138330602.09999999,1.3029866199395711E-2,null,3399873.9635079158,3.3298414282433145E-2]
["Sous-catégorie non résidentielle 9","snr9",138330602.09999999,1.3029866199395711E-2,null,3399873.9635079158,3.3298414282433145E-2]
["Sous-catégorie non résidentielle 10","snr10",138330602.09999999,1.3029866199395711E-2,null,3399873.9635079158,3.3298414282433145E-2]
["Industrielle",null,{"$f":"C77+C127","v":241701840},{"$f":"C161/$C$168","v":2.2766781807767106E-2},null,{"$f":"F77+F127","v":6188042.301926679},{"$f":"F161/$F$168","v":6.060577491354293E-2}]
["Terrains vagues desservis",null,{"$f":"C78+C128","v":76774800},{"$f":"C162/$C$168","v":7.2316996839368623E-3},null,{"$f":"F78+F128","v":1572468.6584825681},{"$f":"F162/$F$168","v":1.540078055783862E-2}]
["Forestier",null,{"$f":"C79+C129","v":50000000},{"$f":"C163/$C$168","v":4.7096831798564519E-3},null,{"$f":"F79+F129","v":256019.66050099905},{"$f":"F163/$F$168","v":2.5074602209707187E-3}]
["Agricole",null,{"$f":"C80+C130","v":270604300},{"$f":"C164/$C$168","v":2.5489210402136586E-2},null,{"$f":"F80+F130","v":1385600.4203222098},{"$f":"F164/$F$168","v":1.3570590357472533E-2}]
["(TTVD − TB)",null,null,null,null,{"$f":"F81+F131","v":80312.855459842409},{"$f":"F165/$F$168","v":7.8658525639807261E-4}]
["Assiette "]
[{"$f":"A83+A133","v":5228300}]
["Total (imposable + compensable)",null,{"$f":"SUM(C139:C165)","v":10616425371.000002},{"$f":"SUM(D139:D165)","v":0.99999999999999989},null,{"$f":"SUM(F139:F165)","v":102103179.28867704},{"$f":"F168/$F$168","v":1}]

{"sheet":"Balises taux_max_balises","index":8,"n_rows":36,"n_cols":10,"rows_kept":36,"cut":false,"hidden":true,"merged":[[13,1,13,2],[13,4,13,5],[29,1,29,5],[3,1,3,2],[3,4,3,5],[9,1,9,2],[9,4,9,5],[12,1,12,2],[12,4,12,5]]}
["Population de la municipalité",{"$f":"'Scénario-taux variés'!E8","v":1000000},"habitants"]
[]
["COEFFICIENT À UTILISER"]
[null,"Coefficient du non résidentiel",null,null,"Coefficient de l'industriel"]
["Catégorie selon population","Coefficient sur taux de base ","Coefficient à retenir",null,"Coefficient sur taux de base ","Coefficient à retenir"]
["Moins de 5 000 habitants",4.0999999999999996,{"$f":"IF($B$1<5000,B6,\"-\")","v":"-"},null,4.5,{"$f":"IF($B$1<5000,E6,\"-\")","v":"-"}]
["De 5 000 à 99 999 habitants",4.4000000000000004,{"$f":"IF(AND($B$1>=5000,$B$1<=99999),B7,\"-\")","v":"-"},null,5,{"$f":"IF(AND($B$1>=5000,$B$1<=99999),E7,\"-\")","v":"-"}]
["De 100 000 à 199 999 habitants",4.45,{"$f":"IF(AND($B$1>=100000,$B$1<=199999),B8,\"-\")","v":"-"},null,5,{"$f":"IF(AND($B$1>=100000,$B$1<=199999),E8,\"-\")","v":"-"}]
["200 000 habitants  et plus",4.8,{"$f":"IF($B$1>=200000,B9,\"-\")","v":4.8},null,5,{"$f":"IF($B$1>=200000,E9,\"-\")","v":5}]
["Coefficient correspondant à la taille de la municipalité",{"$f":"SUM(C6:C9)","v":4.8},null,null,{"$f":"SUM(F6:F9)","v":5}]
[]
["TAUX SUR 100 $ SELON LE TYPE D'IMMEUBLES"]
[null,"Minimum",null,null,"Maximum",null,null," Taux choisi","Validation du taux","Explication"]
["Taux de base (TB)",null,null,null,null,null,null,{"$f":"Taux_max_balises!C141","v":0.50511049700550315}]
[]
["Taux sous-catégorie résidentielle","TB X 66,6%",{"$f":"0.666*H14","v":0.33640359100566514},null,"TB X 133,3%",{"$f":"H14*1.333","v":0.67331229250833569}]
[]
["Taux non résidentiel (TINR)","TB",{"$f":"IF('Sommaire du rôle'!F23>0,H14,\"-\")","v":0.50511049700550315},null,"TB X Coefficient du non résidentiel",{"$f":"IF('Sommaire du rôle'!F23>0,H14*B10,\"-\")","v":2.4245303856264151},null,{"$f":"Taux_max_balises!C152","v":2.4245303856264151},{"$f":"IF(AND(C18<=H18,F18>=H18),\"-\",\"INVALIDE\")","v":"-"},{"$f":"IF(I18=\"INVALIDE\",IF(H18<C18,\"Taux inférieur au minimum\",\"Taux supérieur au maximum\"),\"-\")","v":"-"}]
[]
["Taux sous-catégorie non résidentielle","TB",{"$f":"H14","v":0.50511049700550315},null,"TB X Coefficient non résidentiel",{"$f":"H14*B10","v":2.4245303856264151}]
[null,"TINR X 66,6 %",{"$f":"H18*0.666","v":1.6147372368271926},null,"TINR X 133,3 %",{"$f":"H18*1.333","v":3.2318990040400113}]
[null,"Plus grand entre les deux balises ",{"$f":"MAX(C20:C21)","v":1.6147372368271926},null,"Plus petit entre les deux balises",{"$f":"IF('Sommaire du rôle'!F16>0,MIN(F20:F21),\"-\")","v":2.4245303856264151}]
[]
[]
[]
["Taux industriel (TIND)"]
[null,"TB",{"$f":"IF('Sommaire du rôle'!I23>0,H14,\"-\")","v":0.50511049700550315},null,"TB X Coefficient de l'industriel",{"$f":"IF('Sommaire du rôle'!I23>0,H14*E10,\"-\")","v":2.5255524850275157}]
[null,"TINR X 66,6 %",{"$f":"IF('Sommaire du rôle'!I23>0,H18*0.666,\"-\")","v":1.6147372368271926},null,"TINR X 133,3 %",{"$f":"IF('Sommaire du rôle'!I23>0,H18*1.333,\"-\")","v":3.2318990040400113}]
[null,"Plus grand entre les deux taux",{"$f":"IF('Sommaire du rôle'!I23>0,MAX(C27:C28),\"-\")","v":1.6147372368271926},null,"Plus petit entre les deux taux",{"$f":"IF('Sommaire du rôle'!I23>0,MIN(F27:F28),\"-\")","v":2.5255524850275157},null,{"$f":"Taux_max_balises!C163","v":2.5255524850275157},{"$f":"IF(AND(C29<=H29,F29>=H29),\"-\",\"INVALIDE\")","v":"-"},{"$f":"IF(I29=\"INVALIDE\",IF(H29<C29,\"Taux inférieur au minimum\",\"Taux supérieur au maximum\"),\"-\")","v":"-"}]
[null,{"$f":"IF(C29>F29,\"AVERTISSEMENT:TINR génère une incohérence dans les balises du TIND\",\"\")","v":""}]
[]
["Taux sur terrains vagues desservis (TVD)","TB",{"$f":"IF(('Sommaire du rôle'!F22+'Sommaire du rôle'!G22+'Sommaire du rôle'!L23+'Sommaire du rôle'!N23>0),H14,\"-\")","v":0.50511049700550315},null,"TB X 4",{"$f":"IF(('Sommaire du rôle'!F22+'Sommaire du rôle'!G22+'Sommaire du rôle'!L23+'Sommaire du rôle'!N23>0),H14*4,\"-\")","v":2.0204419880220126},null,{"$f":"Taux_max_balises!C164","v":2.0204419880220126},{"$f":"IF(AND(C32<=H32,F32>=H32),\"-\",\"INVALIDE\")","v":"-"},{"$f":"IF(I32=\"INVALIDE\",IF(H32<C32,\"Taux inférieur au minimum\",\"Taux supérieur au maximum\"),\"-\")","v":"-"}]
[]
["Taux sur immeuble forestier (TFORES)","TB X 66,6%",{"$f":"IF('Sommaire du rôle'!N6>0,H14*0.666,\"-\")","v":0.33640359100566514},null,"TB",{"$f":"IF('Sommaire du rôle'!N6>0,H14,\"-\")","v":0.50511049700550315},null,{"$f":"Taux_max_balises!C165","v":0.50511049700550315},{"$f":"IF(AND(C34<=H34,F34>=H34),\"-\",\"INVALIDE\")","v":"-"},{"$f":"IF(I34=\"INVALIDE\",IF(H34<C34,\"Taux inférieur au minimum\",\"Taux supérieur au maximum\"),\"-\")","v":"-"}]
[]
["Taux sur immeuble agricole (TAGRI)","TB X 66,6%",{"$f":"IF('Sommaire du rôle'!L6>0,H14*0.666,\"-\")","v":0.33640359100566514},null,"TB",{"$f":"IF('Sommaire du rôle'!L6>0,H14,\"-\")","v":0.50511049700550315},null,{"$f":"Taux_max_balises!C166","v":0.50511049700550315},{"$f":"IF(AND(C36<=H36,F36>=H36),\"-\",\"INVALIDE\")","v":"-"},{"$f":"IF(I36=\"INVALIDE\",IF(H36<C36,\"Taux inférieur au minimum\",\"Taux supérieur au maximum\"),\"-\")","v":"-"}]