{"text_format":"1","workbook":"xlsx","n_sheets":9,"sheets":["Instructions","Sommaire du rôle","Détermination assiette","Scénario-taux variés","Balises-Taux","Taux_max_balises","Comparaison des scénarios","Résultats du scénario","Balises taux_max_balises"],"not_rendered":{"charts":10,"images":1,"macros":1,"external_links":4,"defined_names":33,"comments":7,"pivot_tables":0},"unopened":[],"bounds":{"document_bytes":16777216,"sheet_cells":100000,"rows_first":2000,"rows_last":500,"rows_between":2000,"halvings":0,"cell_chars":16384,"cell_head_chars":4096},"cells_cut":0,"cells_raw":0,"read":"whole","date_system":"1900"}

{"sheet":"Instructions","index":0,"n_rows":33,"n_cols":4,"rows_kept":33,"cut":false,"hidden":false,"merged":[[32,0,32,1],[16,3,16,4],[0,0,0,3],[30,0,30,3],[31,0,31,3],[1,0,1,3]]}
["CALCUL DES TAUX VARIÉS (TAXE FONCIÈRE GÉNÉRALE) — ÉTAPES À SUIVRE"]
["VERSION DU 2024-05-08"]
["Étape","Onglet","Instructions /Description"]
[1,"Sommaire du rôle","•","Cliquer sur le bouton « Réinitialisation » (s'il y a lieu);"]
[null,null,"•","Inscrire les assiettes dans les cases appropriées."]
[]
[2,"Scénario  — Taux variés","•","Cliquer sur le bouton « Réinitialisation » (s'il y a lieu);"]
[null,null,"•","Inscrire le nom de la municipalité, l'année, la population et le montant total de la taxe foncière générale prévu dans le budget de la municipalité."]
[null,null,"•","Inscrire les multiples du taux de base retenus afin de calculer les taux variés;"]
[null,null,"•","Il est à noter : le bouton « Scénario taux unique »  calcule par défaut un taux unique pour l'ensemble des assiettes, alors que le bouton « Scénario avec le maximum des balises » calcule des taux variés selon le maximum des balises prévues dans la Loi sur la fiscalité municipale."]
[null,null,"•","L'utilisateur doit s'assurer que les multiples du taux de base qu'il a retenus respectent les balises prévues dans la Loi. Dans l'éventualité où l'un des multiples retenus ne respecte pas ces balises, les recettes de taxes ne seront pas calculées. Pour plus de précisions sur les balises, référez-vous à l'onglet :"]
[null,null,null,"Balises-Taux"]
[]
[]
[3,"Comparaison des scénarios","•","Pour comparer un « scénario avec taux variés » avec un « scénario avec taux unique » et un « scénario avec les taux variés établis selon le maximum des balises autorisé par la Loi », référez-vous à cet onglet."]
{"$rows_left_out":19}
{"sheet":"Sommaire du rôle","index":1,"n_rows":84,"n_cols":27,"rows_kept":84,"cut":false,"hidden":false,"merged":[[80,15,81,15],[80,10,81,10],[80,11,81,11],[80,12,81,12],[80,13,81,13],[80,14,81,14],[80,5,81,5],[80,6,81,6],[80,7,81,7],[80,8,81,8],[80,9,81,9],[74,10,75,10],[74,11,75,11],[74,12,75,12],[74,13,75,13],[74,14,75,14],[74,5,75,5],[74,6,75,6],[74,7,75,7],[74,8,75,8],[74,9,75,9],[74,15,75,15],[71,14,71,15],[26,7,26,8],[26,9,26,10],[26,11,26,12],[26,13,26,14],[26,15,26,16],[65,23,65,24],[65,25,65,26],[68,14,68,15],[69,14,69,15],[70,14,70,15],[65,13,65,14],[65,15,65,16],[65,17,65,18],[65,19,65,20],[65,21,65,22],[27,7,27,8],[27,9,27,10],[27,11,27,12],[27,13,27,14],[27,17,27,18],[27,19,27,20],[27,21,27,22],[48,23,48,24],[48,25,48,26],[50,1,50,4],[50,5,50,6],[50,7,50,8],[50,9,50,10],[50,11,50,12],[50,13,50,14],[50,15,50,16],[50,17,50,18],[50,19,50,20],[50,21,50,22],[50,23,50,24],[50,25,50,26],[48,7,48,8],[48,9,48,10],[48,11,48,12],[48,13,48,14],[48,15,48,16],[49,23,49,24],[49,25,49,26],[25,15,25,16],[25,17,25,18],[25,19,25,20],[25,21,25,22],[51,1,51,4],[65,5,65,6],[65,7,65,8],[65,9,65,10],[65,11,65,12],[49,7,49,8],[49,9,49,10],[49,11,49,12],[49,13,49,14],[49,15,49,16],[49,17,49,18],[49,19,49,20],[49,21,49,22],[16,14,16,16],[21,11,21,12],[5,11,5,12],[25,23,25,24],[27,23,27,24],[25,25,25,26],[27,25,27,26],[5,13,5,14],[45,5,45,6],[45,7,45,8],[45,9,45,10],[45,11,45,12],[45,13,45,14],[45,15,45,16],[45,17,45,18],[45,19,45,20],[45,21,45,22],[45,23,45,24],[45,25,45,26],[26,17,26,18],[25,7,25,8],[25,9,25,10],[25,11,25,12],[25,13,25,14],[21,15,21,16],[26,19,26,20],[26,21,26,22],[19,11,19,12],[68,11,69,13],[70,11,70,13],[1,1,1,16],[3,7,3,8],[3,5,3,6],[3,9,3,10],[3,11,3,12],[3,13,3,14],[3,1,3,4],[2,15,2,16],[4,5,4,6],[4,7,4,8],[4,9,4,10],[2,5,2,6],[2,7,2,8],[2,9,2,10],[4,15,4,16],[3,15,3,16],[18,11,18,13],[16,11,17,13],[71,11,71,13],[6,11,15,11],[22,11,22,12],[25,1,26,4],[27,1,27,4],[28,1,28,4],[27,5,27,6],[24,1,24,26],[26,23,26,24],[26,25,26,26],[68,5,69,6],[68,7,69,10],[70,5,70,6],[71,5,71,6],[21,8,21,10],[70,7,70,10],[71,7,71,10],[22,15,22,16],[27,15,27,16],[47,1,47,26],[48,1,49,4],[48,17,48,18],[48,19,48,20],[48,21,48,22]]}
[]
[null,"  ASSIETTES D'APPLICATION DES TAUX DE LA TAXE FONCIÈRE GÉNÉRALE 9"]
[null,"TAUX APPLICABLES",null,null,null,"TAUX NON RÉSIDENTIEL",null,"TAUX INDUSTRIEL (CLASSE 2)",null,"TAUX IND. (SAUF CL.1 ET 2)",null,"TAUX AGRICOLE",null,"TAUX FORESTIER",null,"TAUX CATÉGORIE RÉSIDUELLE"]
[null,"NOMBRE DE SECTEURS",null,null,null,null,null,null,null,null,null,null,null,null,null,null,null,{"$f":"IF(OR(F4>1,H4>1,J4>1,L4>1,N4>1,P4>1),\"UTILISER LE SIMULATEUR POUR LA TAXATION DE SECTEUR\",\"-\")","v":"-"}]
[null,"CLASSE NON RÉSIDENTIELLE ET",null,null,null,"VAL. NR À 100 % ET IND. CL. 2 À 50 %",null,"VALEUR À 50 %",null,"VALEUR À 100 %",null,"VALEURS À 100 % IMPOSABLES",null,"VALEURS À 100 % IMPOSABLES",null,"VALEUR À 100 %"]
[null,"POURCENTAGE DE TAXATION",null,null,null,"  IMPOSABLES","COMPENSABLES","  IMPOSABLES","COMPENSABLES","  IMPOSABLES","COMPENSABLES",270604300,null,50000000,null,"  IMPOSABLES","COMPENSABLES"]
[null," 1A",":     0,1 %",null,901,76534150,0,null,null,null,null,null,null,null,"99,9 % ",76534150,0]
[null," 1B",":     0,5 %",null,902,34712370,0,null,null,null,null,null,null,null,"99,5 % ",34712370,0]
[null," 1C",":     1 %",null,903,4894450,0,null,null,null,null,null,null,null,"99 % ",4894450,0]
[null," 2",":     3 %",null,904,23616670,0,null,null,605900,null,null,null,null,"97 % ",23616670,0]
[null," 3",":     6 %",null,905,44153450,0,null,null,181400,null,null,null,null,"94 % ",44153450,0]
[null," 4",":     12 %",null,906,60256460,0,null,null,215700,null,null,null,null,"88 % ",60256460,0]
[null," 5",":     22 %",null,907,38643990,0,null,null,null,null,null,null,null,"78 % ",38643990,0]
[null," 6",":     40 %",null,908,38532890,0,290100,null,2421200,null,null,null,null,"60 % ",38532890,0]
[null," 7",":     60 %",null,909,39569365,72376370,350350,null,354000,null,null,null,null,"40 % ",39569365,72376370]
{"$rows_left_out":70}
{"sheet":"Détermination assiette","index":2,"n_rows":160,"n_cols":109,"rows_kept":160,"cut":false,"hidden":true,"merged":[[143,89,144,89],[143,91,143,92],[143,99,144,99],[143,100,144,100],[143,102,143,103],[143,69,143,70],[143,77,144,77],[143,78,144,78],[143,80,143,81],[143,88,144,88],[143,55,144,55],[143,56,144,56],[143,58,143,59],[143,66,144,66],[143,67,144,67],[143,34,144,34],[143,36,143,37],[143,44,144,44],[143,45,144,45],[143,47,143,48],[143,14,143,15],[143,22,144,22],[143,23,144,23],[143,25,143,26],[143,33,144,33],[143,0,144,0],[143,1,144,1],[143,3,143,4],[143,11,144,11],[143,12,144,12],[102,100,103,100],[102,102,102,103],[124,0,125,0],[124,1,125,1],[124,3,124,4],[102,80,102,81],[102,88,103,88],[102,89,103,89],[102,91,102,92],[102,99,103,99],[102,66,103,66],[102,67,103,67],[102,69,102,70],[102,77,103,77],[102,78,103,78],[102,45,103,45],[102,47,102,48],[102,55,103,55],[102,56,103,56],[102,58,102,59],[102,25,102,26],[102,33,103,33],[102,34,103,34],[102,36,102,37],[102,44,103,44],[102,11,103,11],[102,12,103,12],[102,14,102,15],[102,22,103,22],[102,23,103,23],[80,0,81,0],[80,1,81,1],[80,3,80,4],[102,0,103,0],[102,1,103,1],[102,3,102,4],[61,0,62,0],[61,1,62,1],[61,3,61,4],[3,3,3,4],[3,0,4,0],[3,1,4,1],[25,0,26,0],[25,1,26,1],[25,3,25,4],[43,0,44,0],[43,1,44,1],[43,3,43,4]]}
["DÉTERMINATION DES ASSIETTES "]
[]
["ASSIETTE AU TAUX NON RÉSIDENTIEL"]
["Classe non résidentielle","Pourcentage de taxation",null,"VAL. NR À 100 % ET IND. CL. 2 À 50 %"]
[null,null,null,"  Imposables","Compensables",null,"Imposables pondérées","Compensables pondérées",null,"Total"]
[null,"(1)",null,"(2)","(3)",null,"(4) = (1) X (2)","(5) = (1 ) X  (3)",null,"(6) = (4) + (5)"]
[" 1A",1E-3,null,{"$f":"'Sommaire du rôle'!F7","v":76534150},{"$f":"'Sommaire du rôle'!G7","v":0},null,{"$f":"B7*D7","v":76534.150000000009},{"$f":"B7*E7","v":0},null,{"$f":"G7+H7","v":76534.150000000009}]
[" 1B",5.0000000000000001E-3,null,{"$f":"'Sommaire du rôle'!F8","v":34712370},{"$f":"'Sommaire du rôle'!G8","v":0},null,{"$f":"B8*D8","v":173561.85},{"$f":"B8*E8","v":0},null,{"$f":"G8+H8","v":173561.85}]
[" 1C",0.01,null,{"$f":"'Sommaire du rôle'!F9","v":4894450},{"$f":"'Sommaire du rôle'!G9","v":0},null,48944.5,0,null,48944.5]
[2,0.03,null,{"$f":"'Sommaire du rôle'!F10","v":23616670},{"$f":"'Sommaire du rôle'!G10","v":0},null,708500.1,0,null,708500.1]
[3,0.06,null,{"$f":"'Sommaire du rôle'!F11","v":44153450},{"$f":"'Sommaire du rôle'!G11","v":0},null,2649207,0,null,2649207]
[4,0.12,null,{"$f":"'Sommaire du rôle'!F12","v":60256460},{"$f":"'Sommaire du rôle'!G12","v":0},null,7230775.2000000002,0,null,7230775.2000000002]
[5,0.22,null,{"$f":"'Sommaire du rôle'!F13","v":38643990},{"$f":"'Sommaire du rôle'!G13","v":0},null,8501677.8000000007,0,null,8501677.8000000007]
[6,0.4,null,{"$f":"'Sommaire du rôle'!F14","v":38532890},{"$f":"'Sommaire du rôle'!G14","v":0},null,15413156,0,null,15413156]
[7,0.6,null,{"$f":"'Sommaire du rôle'!F15","v":39569365},{"$f":"'Sommaire du rôle'!G15","v":72376370},null,23741619,43425822,null,67167441]
{"$rows_left_out":146}
{"sheet":"Scénario-taux variés","index":3,"n_rows":221,"n_cols":12,"rows_kept":221,"cut":false,"hidden":false,"merged":[[7,0,7,2],[12,4,12,5],[138,4,138,5],[12,6,13,7],[24,0,24,3],[36,0,36,2],[37,0,37,2],[38,0,38,3],[14,2,14,3],[15,2,15,3],[16,2,16,3],[17,2,17,3],[18,2,18,3],[19,2,19,3],[20,2,20,3],[21,2,21,3],[22,2,22,3],[23,2,23,3],[25,2,25,3],[26,2,26,3],[27,2,27,3],[33,2,33,3],[34,2,34,3],[28,2,28,3],[29,2,29,3],[30,2,30,3],[31,2,31,3],[32,2,32,3]]}
[]
[]
["CHOIX DES COEFFICIENTS SELON LES BALISES ET CALCUL DU TAUX DE BASE"]
["Il faut remplir les cases ombragées (motif à points) pour faire fonctionner le simulateur."]
["Note : Les assiettes de taxation du modèle n'incluent que les valeurs imposables."]
[]
["Nom de la municipalité =",null,null,null,null,"Année:"]
["Population de la municipalité ou de l'agglomération, s'il y a lieu =",null,null,null,1000000,"habitants",null,{"$f":"IF(E8=0,\"Inscrivez  la population\",\"-\")","v":"-"}]
["Recettes de la taxe foncière générale =",null,null,null,94624103,"(prévues au budget)",null,{"$f":"IF(E9=0,\"Inscrivez des recettes\",\"-\")","v":"-"}]
["Nom du scénario =",null,null,null,"Scénario 1"]
[]
["MULTIPLES DU TAUX DE BASE "]
[null,null,null,null,"Balises des coefficients par rapport au taux de base (TB)",null,"Choisir un coefficient par rapport au taux de base",null,"Validation","Explication"]
[null,null,null,null,"Minimum ","Maximum"]
["Taux sous-catégorie résidentielle 1 (TSCR 1)",null,{"$f":"IF('Sommaire du rôle'!$H$50>0,'Sommaire du rôle'!$H$50,\"-\")","v":"sr1"},null,0.66600000000000004,1.333,1,"X TB",{"$f":"IF(G15>0,IF(AND(E15<=G15,F15>=G15),\"-\",\"INVALIDE\"),\"-\")","v":"-"},{"$f":"IF(I15=\"INVALIDE\",IF(G15<E15,\"Le coefficient est inférieur au minimum.\",\"Le coefficient est supérieur au maximum.\"),\"-\")","v":"-"},{"$f":"IF(I15=\"INVALIDE\",1,0)","v":0}]
{"$rows_left_out":207}
{"sheet":"Balises-Taux","index":4,"n_rows":34,"n_cols":10,"rows_kept":34,"cut":false,"hidden":false,"merged":[[2,0,2,5],[13,1,13,2],[13,4,13,5],[3,1,3,2],[3,4,3,5],[9,1,9,2],[9,4,9,5],[12,1,12,2],[12,4,12,5]]}
["Nom du scénario",{"$f":"'Scénario-taux variés'!E10","v":"Scénario 1"}]
["Population de la municipalité",{"$f":"'Scénario-taux variés'!E8","v":1000000},"habitants"]
["DÉTERMINATION DES COEFFICIENTS DU TAUX DE BASE POUR LES IMMEUBLES NON RÉSIDENTIELS ET INDUSTRIELS"]
[null,"Coefficient non résidentiel",null,null,"Coefficient industriel"]
["Population de la municipalité","Coefficient du taux de base ","Coefficient à retenir",null,"Coefficient du taux de base ","Coefficient à retenir"]
["Moins de 5 000 habitants",4.0999999999999996,{"$f":"IF($B$2<5000,B6,\"-\")","v":"-"},null,4.5,{"$f":"IF($B$2<5000,E6,\"-\")","v":"-"}]
["De 5 000 à 99 999 habitants",4.4000000000000004,{"$f":"IF(AND($B$2>=5000,$B$2<=99999),B7,\"-\")","v":"-"},null,5,{"$f":"IF(AND($B$2>=5000,$B$2<=99999),E7,\"-\")","v":"-"}]
["De 100 000 à 199 999 habitants",4.45,{"$f":"IF(AND($B$2>=100000,$B$2<=199999),B8,\"-\")","v":"-"},null,5,{"$f":"IF(AND($B$2>=100000,$B$2<=199999),E8,\"-\")","v":"-"}]
["200 000 habitants et plus",4.8,{"$f":"IF($B$2>=200000,B9,\"-\")","v":4.8},null,5,{"$f":"IF($B$2>=200000,E9,\"-\")","v":5}]
["Coefficient correspondant à la taille de la municipalité",{"$f":"SUM(C6:C9)","v":4.8},null,null,{"$f":"SUM(F6:F9)","v":5}]
[]
["TAUX EN $ PAR 100 $ D'ÉVALUATION SELON LA CATÉGORIE D'IMMEUBLES"]
[null,"Minimum",null,null,"Maximum",null,null," Taux choisi","Validation du taux","Explication"]
["Taux de base (TB)",null,null,null,null,null,null,{"$f":"'Scénario-taux variés'!C141","v":0.51203932100199812},{"$f":"'Scénario-taux variés'!G141","v":"-"},{"$f":"'Scénario-taux variés'!H141","v":"-"}]
["Taux sous-catégorie résidentielle","TB X 66,6%",{"$f":"0.666*H14","v":0.34101818778733078},null,"TB X 133,3%",{"$f":"H14*1.333","v":0.68254841489566342}]
{"$rows_left_out":20}
{"sheet":"Taux_max_balises","index":5,"n_rows":221,"n_cols":8,"rows_kept":221,"cut":false,"hidden":true,"merged":[[38,0,38,3],[138,4,138,5],[7,0,7,2],[12,4,12,5],[12,6,13,7],[24,0,24,3],[36,0,36,2],[37,0,37,2]]}
[]
[]
["CHOIX DES COEFFICIENTS SELON LES BALISES ET CALCUL DU TAUX DE BASE"]
["Il faut remplir les cases ombragées (motif à points) pour faire fonctionner le simulateur."]
["Note : Les assiettes de taxation du modèle n'incluent que les valeurs imposables."]
[]
["Nom de la municipalité =",null,null,null,null,"Année:",2024]
["Population de la municipalité ou de l'agglomération, s'il y a lieu =",null,null,null,100000,"habitants"]
["Recettes de la taxe foncière générale =",null,null,null,94624103,"(prévues au budget)"]
["Nom du scénario ="]
[]
["MULTIPLES DU TAUX DE BASE "]
[null,null,null,null,"Balises des coefficients par rapport au taux de base (TB)",null,"Choisir un coefficient par rapport au taux de base"]
[null,null,null,null,"Minimum ","Maximum"]
["Taux sous-catégorie résidentielle 1 (TSCR 1)",null,null,null,{"$f":"'Scénario-taux variés'!E15","v":0.66600000000000004},{"$f":"'Scénario-taux variés'!F15","v":1.333},{"$f":"F15","v":1.333},"X TB"]
{"$rows_left_out":207}
{"sheet":"Comparaison des scénarios","index":6,"n_rows":87,"n_cols":5,"rows_kept":87,"cut":false,"hidden":false,"merged":[[0,0,0,6],[2,1,2,3]]}
["COMPARAISON DES DIFFÉRENTS SCÉNARIOS ($/100 $ d'évaluation)"]
[]
[]
["Catégorie",null,"Taux unique",{"$f":"'Scénario-taux variés'!E10","v":"Scénario 1"},"Scénario avec le maximum des balises "]
["TB \n(sous-catégorie résiduelle)",null,{"$f":"'Scénario-taux variés'!G169","v":0.92171720711007976},{"$f":"'Scénario-taux variés'!C141","v":0.51203932100199812},{"$f":"Taux_max_balises!C141","v":0.50511049700550315}]
["TSCR1",{"$f":"'Scénario-taux variés'!C15","v":"sr1"},{"$f":"$C$5","v":0.92171720711007976},{"$f":"'Scénario-taux variés'!C142","v":0.51203932100199812},{"$f":"Taux_max_balises!C142","v":0.67331229250833569}]
["TSCR2",{"$f":"'Scénario-taux variés'!C16","v":"sr2"},0.92171720711007976,{"$f":"'Scénario-taux variés'!C143","v":0.68254841489566342},{"$f":"Taux_max_balises!C143","v":0.67331229250833569}]
["TSCR3",{"$f":"'Scénario-taux variés'!C17","v":"sr3"},0.92171720711007976,{"$f":"'Scénario-taux variés'!C144","v":0.68254841489566342},{"$f":"Taux_max_balises!C144","v":0.67331229250833569}]
["TSCR4",{"$f":"'Scénario-taux variés'!C18","v":"sr4"},0.92171720711007976,{"$f":"'Scénario-taux variés'!C145","v":0.68254841489566342},{"$f":"Taux_max_balises!C145","v":0.67331229250833569}]
["TSCR5",{"$f":"'Scénario-taux variés'!C19","v":"sr5"},0.92171720711007976,{"$f":"'Scénario-taux variés'!C146","v":0.68254841489566342},{"$f":"Taux_max_balises!C146","v":0.67331229250833569}]
["TSCR6",{"$f":"'Scénario-taux variés'!C20","v":"sr6"},0.92171720711007976,{"$f":"'Scénario-taux variés'!C147","v":0.68254841489566342},{"$f":"Taux_max_balises!C147","v":0.67331229250833569}]
["TSCR7",{"$f":"'Scénario-taux variés'!C21","v":"sr7"},0.92171720711007976,{"$f":"'Scénario-taux variés'!C148","v":0.68254841489566342},{"$f":"Taux_max_balises!C148","v":0.67331229250833569}]
["TSCR8",{"$f":"'Scénario-taux variés'!C22","v":"sr8"},0.92171720711007976,{"$f":"'Scénario-taux variés'!C149","v":0.68254841489566342},{"$f":"Taux_max_balises!C149","v":0.67331229250833569}]
["TSCR9",{"$f":"'Scénario-taux variés'!C23","v":"sr9"},0.92171720711007976,{"$f":"'Scénario-taux variés'!C150","v":0.68254841489566342},{"$f":"Taux_max_balises!C150","v":0.67331229250833569}]
["TSCR10",{"$f":"'Scénario-taux variés'!C24","v":"sr10"},0.92171720711007976,{"$f":"'Scénario-taux variés'!C151","v":0.68254841489566342},{"$f":"Taux_max_balises!C151","v":0.67331229250833569}]
{"$rows_left_out":73}
{"sheet":"Résultats du scénario","index":7,"n_rows":168,"n_cols":11,"rows_kept":168,"cut":false,"hidden":false,"merged":[]}
[null,"Municipalité de ",{"$f":"'Scénario-taux variés'!E7","v":0}]
[null,"Année :",{"$f":"'Scénario-taux variés'!G7","v":0}]
[null,"Nom du scénario :",{"$f":"'Scénario-taux variés'!E10","v":"Scénario 1"}]
[]
["Taux de la taxe foncière générale"]
["TB",null,{"$f":"'Scénario-taux variés'!C141","v":0.51203932100199812},"/ 100 $"]
["TSCR 1",{"$f":"'Scénario-taux variés'!C15","v":"sr1"},{"$f":"'Scénario-taux variés'!C142","v":0.51203932100199812},"/ 100 $"]
["TSCR 2",{"$f":"'Scénario-taux variés'!C16","v":"sr2"},{"$f":"'Scénario-taux variés'!C143","v":0.68254841489566342},"/ 100 $"]
["TSCR 3",{"$f":"'Scénario-taux variés'!C17","v":"sr3"},{"$f":"'Scénario-taux variés'!C144","v":0.68254841489566342},"/ 100 $"]
["TSCR 4",{"$f":"'Scénario-taux variés'!C18","v":"sr4"},{"$f":"'Scénario-taux variés'!C145","v":0.68254841489566342},"/ 100 $"]
["TSCR 5",{"$f":"'Scénario-taux variés'!C19","v":"sr5"},{"$f":"'Scénario-taux variés'!C146","v":0.68254841489566342},"/ 100 $"]
["TSCR 6",{"$f":"'Scénario-taux variés'!C20","v":"sr6"},{"$f":"'Scénario-taux variés'!C147","v":0.68254841489566342},"/ 100 $"]
["TSCR 7",{"$f":"'Scénario-taux variés'!C21","v":"sr7"},{"$f":"'Scénario-taux variés'!C148","v":0.68254841489566342},"/ 100 $"]
["TSCR 8",{"$f":"'Scénario-taux variés'!C22","v":"sr8"},{"$f":"'Scénario-taux variés'!C149","v":0.68254841489566342},"/ 100 $"]
["TSCR 9",{"$f":"'Scénario-taux variés'!C23","v":"sr9"},{"$f":"'Scénario-taux variés'!C150","v":0.68254841489566342},"/ 100 $"]
{"$rows_left_out":154}
{"sheet":"Balises taux_max_balises","index":8,"n_rows":36,"n_cols":10,"rows_kept":36,"cut":false,"hidden":true,"merged":[[13,1,13,2],[13,4,13,5],[29,1,29,5],[3,1,3,2],[3,4,3,5],[9,1,9,2],[9,4,9,5],[12,1,12,2],[12,4,12,5]]}
["Population de la municipalité",{"$f":"'Scénario-taux variés'!E8","v":1000000},"habitants"]
[]
["COEFFICIENT À UTILISER"]
[null,"Coefficient du non résidentiel",null,null,"Coefficient de l'industriel"]
["Catégorie selon population","Coefficient sur taux de base ","Coefficient à retenir",null,"Coefficient sur taux de base ","Coefficient à retenir"]
["Moins de 5 000 habitants",4.0999999999999996,{"$f":"IF($B$1<5000,B6,\"-\")","v":"-"},null,4.5,{"$f":"IF($B$1<5000,E6,\"-\")","v":"-"}]
["De 5 000 à 99 999 habitants",4.4000000000000004,{"$f":"IF(AND($B$1>=5000,$B$1<=99999),B7,\"-\")","v":"-"},null,5,{"$f":"IF(AND($B$1>=5000,$B$1<=99999),E7,\"-\")","v":"-"}]
["De 100 000 à 199 999 habitants",4.45,{"$f":"IF(AND($B$1>=100000,$B$1<=199999),B8,\"-\")","v":"-"},null,5,{"$f":"IF(AND($B$1>=100000,$B$1<=199999),E8,\"-\")","v":"-"}]
["200 000 habitants  et plus",4.8,{"$f":"IF($B$1>=200000,B9,\"-\")","v":4.8},null,5,{"$f":"IF($B$1>=200000,E9,\"-\")","v":5}]
["Coefficient correspondant à la taille de la municipalité",{"$f":"SUM(C6:C9)","v":4.8},null,null,{"$f":"SUM(F6:F9)","v":5}]
[]
["TAUX SUR 100 $ SELON LE TYPE D'IMMEUBLES"]
[null,"Minimum",null,null,"Maximum",null,null," Taux choisi","Validation du taux","Explication"]
["Taux de base (TB)",null,null,null,null,null,null,{"$f":"Taux_max_balises!C141","v":0.50511049700550315}]
[]
{"$rows_left_out":21}