{"text_format":"1","workbook":"xlsx","n_sheets":15,"sheets":["Instructions","Sommaire du rôle_sec_1","Détermination_sec_1 ","Sommaire du rôle_sec_2","Détermination_sec_2","Sommaire du rôle_sec_3","Détermination_sec_3 ","Sommaire du rôle_sec_4","Sommaire du rôle_sec_5","Détermination_sec_4","Détermination_sec_5","Scénario-taux variés","Calculs taux de base","Balises-Taux","Résultats du scénario"],"not_rendered":{"charts":2,"images":1,"macros":1,"external_links":4,"defined_names":53,"comments":17,"pivot_tables":0},"unopened":[],"bounds":{"document_bytes":16777216,"sheet_cells":100000,"rows_first":2000,"rows_last":500,"rows_between":2000,"halvings":0,"cell_chars":16384,"cell_head_chars":4096},"cells_cut":0,"cells_raw":0,"read":"whole","date_system":"1900"}

{"sheet":"Instructions","index":0,"n_rows":45,"n_cols":4,"rows_kept":45,"cut":false,"hidden":false,"merged":[[42,0,42,1],[33,3,33,4],[17,0,17,3],[40,0,40,3],[41,0,41,3],[15,0,15,3],[3,0,3,1],[5,0,5,1],[6,0,7,1],[8,0,8,1],[9,0,9,1],[0,0,0,3],[10,0,10,1],[12,0,12,3],[13,0,13,3],[14,0,14,3],[1,0,1,3]]}
["TAXATION PAR SECTEUR"]
["VERSION DU 2025-05-08"]
[]
["Terme",null,null,"Définition"]
[]
["Taux sectoriel uniformisé\n(Taux unique appliqué à l'ensemble des immeubles du secteur)",null,"•","Le taux sectoriel uniformisé correspond à la moyenne des taux sectoriels de la taxe foncière générale pondérés selon la proportion que représente la somme des valeurs imposables des immeubles situés dans le secteur auquel s’applique le taux sectoriel par rapport à la somme des valeurs imposables des immeubles situés dans l’ensemble du territoire de la municipalité. \n\n"]
["Taux sectoriel \n(Taux unique appliqué à l'ensemble des immeubles du secteur)\n",null,"•","Taux appliqué à l'ensemble des immeubles d'un secteur."]
[null,null,"•","Les taux sectoriels doivent être entre 66,6 % et 133,3 % du taux sectoriel uniformisé."]
["Taux de base uniformisé\n(Régime d'impôt à taux variés)",null,"•","Lors de l'utilisation du régime d'impôt à taux variés, le taux de base uniformisé correspond à la moyenne des taux de base sectoriels pondérés selon la proportion que représente la somme des valeurs imposables des immeubles situés dans le secteur auquel s’applique le taux de base sectoriel par rapport à la somme des valeurs imposables des immeubles situés dans l’ensemble du territoire de la municipalité."]
["Taux de base sectoriel\n(Régime d'impôt à taux variés)",null,"•","Le taux de base sectoriel est le taux appliqué à la catégorie ou à la sous-catégorie résiduelle du secteur dans le cas où il y a des sous-catégories d'immeubles résidentiels."]
[" Valeur imposable pour les secteurs",null,"•","Outre leur sens ordinaire, les valeurs imposables des secteurs incluent les valeurs non imposables dans le cas où :\na)  les taxes foncières doivent être payées à l’égard d’un immeuble conformément au premier alinéa de l’article 208;\nb)  une somme correspondant au montant des taxes foncières municipales qui seraient payables à l’égard d’un immeuble, si celui-ci était imposable, doit être versée soit par le gouvernement conformément au deuxième alinéa de l’article 210 ou au premier alinéa des articles 254 et 255, soit par la Couronne du chef du Canada ou l’un de ses mandataires."]
[]
["** AVERTISSEMENT **"]
["Toutes les parties du territoire de la municipalité doivent être comprises dans un secteur."]
["Le fichier calcule des taux sectoriels uniformisés ou des taux de base uniformisés uniquement lorsqu'il y a une assiette de valeur imposable et un taux.\n\n"]
["Chaque secteur doit avoir un taux sectoriel ou un taux de base sectoriel afin d'avoir un taux uniformisé valable."]
[]
["CALCUL DES TAUX VARIÉS (TAXE FONCIÈRE GÉNÉRALE) — ÉTAPES À SUIVRE"]
[]
["Étape","Onglet","Instructions/Description"]
[1,"Sommaire du rôle_sec 1","•","Cliquer sur le bouton « Réinitialisation » (s'il y a lieu)."]
[null,"Sommaire du rôle_sec 2","•","Inscrire les assiettes dans les cases appropriées pour chacun des secteurs."]
[null,"Sommaire du rôle_sec 3","•","Le fichier peut avoir 5 secteurs."]
[null,"Sommaire du rôle_sec 4"]
[null,"Sommaire du rôle_sec 5"]
[]
[2,"Scénario  — Taux variés","•","Cliquer sur le bouton « Réinitialisation » (s'il y a lieu)."]
[null,null,"•","Inscrire le nom de la municipalité, l'année, la population et le montant total de la taxe foncière générale prévu dans le budget de la municipalité."]
[null,null,"•","Inscrire les multiples du taux de base retenus afin de calculer les taux variés."]
[null,null,"•","Il est à noter : le bouton « Scénario taux unique par secteur » calcule par défaut un taux unique pour l'ensemble des assiettes de chacun des secteurs. Il suffit de définir le taux de base sectoriel et celui sera reporté aux autres catégories d'immeubles."]
[null,null,"•","L'utilisateur doit s'assurer que les multiples du taux de base qu'il a retenus respectent les balises prévues dans la Loi. Dans l'éventualité où l'un des multiples retenus ne respecte pas ces balises, un message d'erreur va apparaître. Pour plus de précisions sur les balises, référez-vous à l'onglet :"]
[null,null,null,"Balises-Taux"]
[]
[3,"Résultats du scénario","•","Une fois le scénario choisi, les taux variés de la taxe foncière générale calculés pour chacune des assiettes foncières d'imposition à l'aide du simulateur apparaissent dans cet onglet."]
[]
["Le fichier contient certains onglets qui sont masqués et qui servent à faire des calculs. Ceux-ci peuvent être affichés au besoin. "]
[]
[]
[]
["NOTES"]
["Les calculs des montants et des taux provenant du simulateur ne sont pas arrondis. Des montants arrondis et des taux arrondis pourraient demander un rajustement."]
["Les calculs effectués par le simulateur ne constituent pas un avis juridique ni un avis officiel du MAMH et ils ne remplacent pas la lecture de la Loi."]
["Il est possible de modifier les graphiques. "]
[]
["Pour tout problème lié au simulateur, veuillez écrire à :",null,null,"info.dgftc@gouv.qc.ca"]

{"sheet":"Sommaire du rôle_sec_1","index":1,"n_rows":84,"n_cols":27,"rows_kept":84,"cut":false,"hidden":false,"merged":[[80,5,81,5],[80,6,81,6],[80,7,81,7],[80,8,81,8],[74,12,75,12],[74,13,75,13],[71,5,71,6],[71,7,71,10],[71,11,71,13],[80,9,81,9],[80,10,81,10],[80,11,81,11],[80,12,81,12],[80,13,81,13],[71,14,71,15],[74,5,75,5],[74,6,75,6],[74,7,75,7],[74,8,75,8],[74,9,75,9],[74,10,75,10],[74,14,75,14],[74,15,75,15],[70,5,70,6],[70,7,70,10],[70,11,70,13],[70,14,70,15],[51,1,51,4],[65,5,65,6],[65,7,65,8],[65,9,65,10],[65,11,65,12],[65,13,65,14],[68,5,69,6],[68,7,69,10],[68,11,69,13],[68,14,68,15],[69,14,69,15],[65,15,65,16],[80,14,81,14],[80,15,81,15],[74,11,75,11],[65,21,65,22],[65,23,65,24],[65,25,65,26],[50,19,50,20],[50,21,50,22],[27,23,27,24],[27,25,27,26],[47,1,47,26],[48,1,49,4],[48,7,48,8],[49,23,49,24],[49,25,49,26],[50,1,50,4],[50,5,50,6],[50,7,50,8],[50,9,50,10],[50,11,50,12],[50,13,50,14],[50,15,50,16],[50,17,50,18],[50,23,50,24],[50,25,50,26],[65,17,65,18],[65,19,65,20],[45,11,45,12],[45,13,45,14],[45,15,45,16],[45,17,45,18],[45,19,45,20],[48,23,48,24],[48,25,48,26],[49,21,49,22],[48,21,48,22],[45,21,45,22],[45,23,45,24],[45,25,45,26],[49,7,49,8],[49,9,49,10],[49,11,49,12],[49,13,49,14],[49,15,49,16],[49,17,49,18],[49,19,49,20],[48,9,48,10],[48,11,48,12],[48,13,48,14],[48,15,48,16],[48,17,48,18],[48,19,48,20],[27,19,27,20],[27,21,27,22],[24,1,24,26],[25,1,26,4],[25,7,25,8],[25,9,25,10],[25,11,25,12],[26,23,26,24],[26,25,26,26],[27,1,27,4],[27,5,27,6],[27,7,27,8],[27,9,27,10],[27,11,27,12],[27,13,27,14],[27,15,27,16],[27,17,27,18],[25,25,25,26],[26,17,26,18],[26,19,26,20],[26,21,26,22],[25,17,25,18],[25,19,25,20],[25,21,25,22],[28,1,28,4],[45,5,45,6],[45,7,45,8],[45,9,45,10],[18,11,18,13],[19,11,19,12],[21,8,21,10],[21,11,21,12],[21,15,21,16],[22,11,22,12],[22,15,22,16],[26,7,26,8],[26,9,26,10],[26,11,26,12],[26,13,26,14],[26,15,26,16],[25,13,25,14],[25,15,25,16],[25,23,25,24],[4,5,4,6],[4,7,4,8],[4,9,4,10],[4,15,4,16],[5,11,5,12],[5,13,5,14],[6,11,15,11],[16,11,17,13],[16,14,16,16],[1,1,1,16],[2,5,2,6],[2,7,2,8],[2,9,2,10],[2,15,2,16],[3,1,3,4],[3,5,3,6],[3,7,3,8],[3,9,3,10],[3,11,3,12],[3,13,3,14],[3,15,3,16]]}
[]
[null,"  ASSIETTES D'APPLICATION DES TAUX DE LA TAXE FONCIÈRE GÉNÉRALE 9"]
[null,"TAUX APPLICABLES",null,null,null,"TAUX NON RÉSIDENTIEL",null,"TAUX INDUSTRIEL (CLASSE 2)",null,"TAUX IND. (SAUF CL.1 ET 2)",null,"TAUX AGRICOLE",null,"TAUX FORESTIER",null,"TAUX CATÉGORIE RÉSIDUELLE"]
[null,"NOMBRE DE SECTEURS",null,null,null,null,null,null,null,null,null,null,null,null,null,null,null,null,{"$f":"IF(OR(F4>0,H4>0,J4>0,L4>0,N4>0,P4>0),\"UTILISER LE SIMULATEUR POUR LA TAXATION DE SECTEUR\",\"-\")","v":"-"}]
[null,"CLASSE NON RÉSIDENTIELLE ET",null,null,null,"VAL. NR À 100 % ET IND. CL. 2 À 50 %",null,"VALEUR À 50 %",null,"VALEUR À 100 %",null,"VALEURS À 100 % IMPOSABLES",null,"VALEURS À 100 % IMPOSABLES",null,"VALEUR À 100 %"]
[null,"POURCENTAGE DE TAXATION",null,null,null,"  IMPOSABLES","COMPENSABLES","  IMPOSABLES","COMPENSABLES","  IMPOSABLES","COMPENSABLES",270604300,null,50000000,null,"  IMPOSABLES","COMPENSABLES"]
[null," 1A",":     0,1 %",null,901,76534150,0,null,null,null,null,null,null,null,"99,9 % ",76534150,0]
[null," 1B",":     0,5 %",null,902,34712370,0,null,null,null,null,null,null,null,"99,5 % ",34712370,0]
[null," 1C",":     1 %",null,903,4894450,0,null,null,null,null,null,null,null,"99 % ",4894450,0]
[null," 2",":     3 %",null,904,23616670,0,null,null,605900,null,null,null,null,"97 % ",23616670,0]
[null," 3",":     6 %",null,905,44153450,0,null,null,181400,null,null,null,null,"94 % ",44153450,0]
[null," 4",":     12 %",null,906,60256460,0,null,null,215700,null,null,null,null,"88 % ",60256460,0]
[null," 5",":     22 %",null,907,38643990,0,null,null,null,null,null,null,null,"78 % ",38643990,0]
[null," 6",":     40 %",null,908,38532890,0,290100,null,2421200,null,null,null,null,"60 % ",38532890,0]
[null," 7",":     60 %",null,909,39569365,72376370,350350,null,354000,null,null,null,null,"40 % ",39569365,72376370]
[null," 8",":     85 %",null,910,22323070,211592260,null,null,1875900,null,null,null,null,"15 % ",22323070,211592260]
[null," 9",":     100 %",null,911,3177900,0,null,null,null,null,"TAUX TERRAINS VAGUES \nDESSERVIS"]
[null," 10",":     100 %",null,912,1155755205,61905690,10515650,null,225704400,2325200,null,null,null,null,8068032861,2100780]
[null," 11",":  Cours de triage 100 %",null,913,null,null,null,null,null,null,"VALEURS À 100 %"]
[null," 12",":  CHSLD 20 %",null,914,13938200,null,null,null,null,null,"  IMPOSABLES",null,"COMPENSABLES","80 % ",{"$f":"F20","v":13938200}]
[null," 13",":  Cours de triage 40 %",null,915,null,"CFIL (chemin de fer d'intérêt local)",null,null,null,null,null,null,null,"60 % ",{"$f":"F21","v":0}]
[null," APPLICATION DU TNR QUAND TTVD",null,null,916,5228300,null,null,"(TTVD − TAUX DE BASE) x ",null,null,{"$f":"F22","v":5228300},null,{"$f":"G22","v":0}]
[null," ASSIETTES D'APPLICATION ",null,null,917,{"$f":"F71+F72","v":1529652563.0999999},null,null,{"$f":"H71+H72","v":241701840},null,"(TTVD) x ",76716400,null,58400,null,{"$f":"O71+O72","v":8447691867.8999996}]
[]
[null,"ASSIETTES D'APPLICATION DES TAUX RELATIFS AUX SOUS-CATÉGORIES DES IMMEUBLES NON RÉSIDENTIELS (si applicables)"]
[null,"DÉNOMINATION DE LA SOUS-CATÉGORIE",null,null,null,"TAUX SOUS-CATÉGORIE DE RÉFÉRENCE",null,"TAUX SOUS-CATÉGORIE 1",null,"TAUX SOUS-CATÉGORIE 2",null,"TAUX SOUS-CATÉGORIE 3",null,"TAUX SOUS-CATÉGORIE 4",null,"TAUX SOUS-CATÉGORIE 5",null,"TAUX SOUS-CATÉGORIE 6",null,"TAUX SOUS-CATÉGORIE 7",null,"TAUX SOUS-CATÉGORIE 8",null,"TAUX SOUS-CATÉGORIE 9",null,"TAUX SOUS-CATÉGORIE 10"]
[null,null,null,null,null,null,null,"SNR 1",null,"SNR 2",null,"SNR 3",null,"SNR 4",null,"SNR 5",null,"SNR 6",null,"SNR 7",null,"SNR 8",null,"SNR 9",null,"SNR 10"]
[null,"NOMBRE DE SECTEURS"]
[null,"POURCENTAGE DE TAXATION",null,null,null,"  IMPOSABLES","COMPENSABLES","  IMPOSABLES","COMPENSABLES","  IMPOSABLES","COMPENSABLES","  IMPOSABLES","COMPENSABLES","  IMPOSABLES","COMPENSABLES","  IMPOSABLES","COMPENSABLES","  IMPOSABLES","COMPENSABLES","  IMPOSABLES","COMPENSABLES","  IMPOSABLES","COMPENSABLES","  IMPOSABLES","COMPENSABLES","  IMPOSABLES","COMPENSABLES"]
[null," 1A","     0,1 %",null,{"$f":"E22+1","v":917},6957650,null,6957650,null,6957650,null,6957650,null,6957650,null,6957650,null,6957650,null,6957650,null,6957650,null,6957650,null,6957650]
[null," 1B","     0,5 %",null,{"$f":"E30+1","v":918},3155670,null,3155670,null,3155670,null,3155670,null,3155670,null,3155670,null,3155670,null,3155670,null,3155670,null,3155670,null,3155670]
[null," 1C","     1 %",null,919,444950,null,444950,null,444950,null,444950,null,444950,null,444950,null,444950,null,444950,null,444950,null,444950,null,444950]
[null," 2","     3 %",null,920,2146970,null,2146970,null,2146970,null,2146970,null,2146970,null,2146970,null,2146970,null,2146970,null,2146970,null,2146970,null,2146970]
[null," 3","     6 %",null,921,4013950,null,4013950,null,4013950,null,4013950,null,4013950,null,4013950,null,4013950,null,4013950,null,4013950,null,4013950,null,4013950]
[null," 4","     12 %",null,922,5477860,null,5477860,null,5477860,null,5477860,null,5477860,null,5477860,null,5477860,null,5477860,null,5477860,null,5477860,null,5477860]
[null," 5","     22 %",null,923,3513090,null,3513090,null,3513090,null,3513090,null,3513090,null,3513090,null,3513090,null,3513090,null,3513090,null,3513090,null,3513090]
[null," 6","     40 %",null,924,3502990,null,3502990,null,3502990,null,3502990,null,3502990,null,3502990,null,3502990,null,3502990,null,3502990,null,3502990,null,3502990]
[null," 7","     60 %",null,925,3597215,6579670,3597215,6579670,3597215,6579670,3597215,6579670,3597215,6579670,3597215,6579670,3597215,6579670,3597215,6579670,3597215,6579670,3597215,6579670,3597215,6579670]
[null," 8","     85 %",null,926,2029370,19235660,2029370,19235660,2029370,19235660,2029370,19235660,2029370,19235660,2029370,19235660,2029370,19235660,2029370,19235660,2029370,19235660,2029370,19235660,2029370,19235660]
[null," 9","     100 %",null,927,288900,null,288900,null,288900,null,288900,null,288900,null,288900,null,288900,null,288900,null,288900,null,288900,null,288900]
[null," 10","     100 %",null,928,105068655,5627790,105068655,5627790,105068655,5627790,105068655,5627790,105068655,5627790,105068655,5627790,105068655,5627790,105068655,5627790,105068655,5627790,105068655,5627790,105068655,5627790]
[null," 11","  Cours de triage 100 %",null,929]
[null," 12","  CHSLD 20 %",null,930,13938200]
[null," 13","  Cours de triage 40 %",null,931,null,"CFIL"]
[null," APPLICATION DU TNR QUAND TTVD",null,null,932,5228300]
[null," ASSIETTES D'APPLICATION ",null,null,933,{"$f":"F77+F78","v":146346542.09999999},null,{"$f":"G77+G78","v":138330602.09999999},null,{"$f":"H77+H78","v":138330602.09999999},null,{"$f":"I77+I78","v":138330602.09999999},null,{"$f":"J77+J78","v":138330602.09999999},null,{"$f":"K77+K78","v":138330602.09999999},null,{"$f":"L77+L78","v":138330602.09999999},null,{"$f":"M77+M78","v":138330602.09999999},null,{"$f":"N77+N78","v":138330602.09999999},null,{"$f":"O77+O78","v":138330602.09999999},null,{"$f":"P77+P78","v":138330602.09999999}]
[]
[null,"ASSIETTES D'APPLICATION DES TAUX RELATIFS AUX SOUS-CATÉGORIES DES IMMEUBLES RÉSIDENTIELS (si applicables)"]
[null,"DÉNOMINATION DE LA SOUS-CATÉGORIE",null,null,null,"TAUX SOUS-CATÉGORIE RÉSIDUELLE",null,"TAUX SOUS-CATÉGORIE 1",null,"TAUX SOUS-CATÉGORIE 2",null,"TAUX SOUS-CATÉGORIE 3",null,"TAUX SOUS-CATÉGORIE 4",null,"TAUX SOUS-CATÉGORIE 5",null,"TAUX SOUS-CATÉGORIE 6",null,"TAUX SOUS-CATÉGORIE 7",null,"TAUX SOUS-CATÉGORIE 8",null,"TAUX SOUS-CATÉGORIE 9",null,"TAUX SOUS-CATÉGORIE 10"]
[null,null,null,null,null,null,null,"SR1",null,"SR2",null,"SR3",null,"SR4",null,"SR5",null,"SR6",null,"SR7",null,"SR8",null,"SR9",null,"SR10"]
[null,"NOMBRE DE SECTEURS"]
[null,"POURCENTAGE DE TAXATION",null,null,null,"  IMPOSABLES","COMPENSABLES","  IMPOSABLES","COMPENSABLES","  IMPOSABLES","COMPENSABLES","  IMPOSABLES","COMPENSABLES","  IMPOSABLES","COMPENSABLES","  IMPOSABLES","COMPENSABLES","  IMPOSABLES","COMPENSABLES","  IMPOSABLES","COMPENSABLES","  IMPOSABLES","COMPENSABLES","  IMPOSABLES","COMPENSABLES","  IMPOSABLES","COMPENSABLES"]
[null," 1A","99,9 % ",null,935,6957650,null,6957650,null,6957650,null,6957650,null,6957650,null,6957650,null,6957650,null,6957650,null,6957650,null,6957650,null,6957650]
[null," 1B","99,5 % ",null,{"$f":"E53+1","v":936},3155670,null,3155670,null,3155670,null,3155670,null,3155670,null,3155670,null,3155670,null,3155670,null,3155670,null,3155670,null,3155670]
[null," 1C","99 % ",null,937,444950,null,444950,null,444950,null,444950,null,444950,null,444950,null,444950,null,444950,null,444950,null,444950,null,444950]
[null," 2","97 % ",null,938,2146970,null,2146970,null,2146970,null,2146970,null,2146970,null,2146970,null,2146970,null,2146970,null,2146970,null,2146970,null,2146970]
[null," 3","94 % ",null,939,4013950,null,4013950,null,4013950,null,4013950,null,4013950,null,4013950,null,4013950,null,4013950,null,4013950,null,4013950,null,4013950]
[null," 4","88 % ",null,940,5477860,null,5477860,null,5477860,null,5477860,null,5477860,null,5477860,null,5477860,null,5477860,null,5477860,null,5477860,null,5477860]
[null," 5","78 % ",null,941,3513090,null,3513090,null,3513090,null,3513090,null,3513090,null,3513090,null,3513090,null,3513090,null,3513090,null,3513090,null,3513090]
[null," 6","60 % ",null,942,3502990,null,3502990,null,3502990,null,3502990,null,3502990,null,3502990,null,3502990,null,3502990,null,3502990,null,3502990,null,3502990]
[null," 7","40 % ",null,943,3597215,6579670,3597215,6579670,3597215,6579670,3597215,6579670,3597215,6579670,3597215,6579670,3597215,6579670,3597215,6579670,3597215,6579670,3597215,6579670,3597215,6579670]
[null," 8","15 % ",null,944,2029370,19235660,2029370,19235660,2029370,19235660,2029370,19235660,2029370,19235660,2029370,19235660,2029370,19235660,2029370,19235660,2029370,19235660,2029370,19235660,2029370,19235660]
[null," 9","100% immeubles sans partie non résidentielle",null,945,733457532.81818187,190980,733457532.81818187,190980,733457532.81818187,190980,733457532.81818187,190980,733457532.81818187,190980,733457532.81818187,190980,733457532.81818187,190980,733457532.81818187,190980,733457532.81818187,190980,733457532.81818187,190980,733457532.81818187,190980]
[null," 12","  CHSLD 80 %",null,946,13938200]
[null," 13","  Cours de triage 60 %",null,947]
[null," ASSIETTES D'APPLICATION ",null,null,948,{"$f":"F83+F84","v":778108860.71818185},null,{"$f":"G83+G84","v":766958300.71818185},null,{"$f":"H83+H84","v":766958300.71818185},null,{"$f":"I83+I84","v":766958300.71818185},null,{"$f":"J83+J84","v":766958300.71818185},null,{"$f":"K83+K84","v":766958300.71818185},null,{"$f":"L83+L84","v":766958300.71818185},null,{"$f":"M83+M84","v":766958300.71818185},null,{"$f":"N83+N84","v":766958300.71818185},null,{"$f":"O83+O84","v":766958300.71818185},null,{"$f":"P83+P84","v":766958300.71818185}]
[]
[]
[null,null,null,null,null,"TAUX NON RÉSIDENTIEL",null,"TAUX INDUSTRIEL ",null,null,null,"TAUX TERRAINS VAGUES \nDESSERVIS",null,null,"TAUX CATÉGORIE RÉSIDUELLE (TAUX DE BASE)"]
[]
[null,null,"Assiette imposable",null,null,{"$f":"'Détermination_sec_1 '!G23","v":1244467630.0999999},null,{"$f":"'Détermination_sec_1 '!G41+'Détermination_sec_1 '!G59","v":239376640},null,null,null,{"$f":"L23","v":76716400},null,null,{"$f":"'Détermination_sec_1 '!G78","v":8384901700.8999996}]
[null,null,"Assiette compensable",null,null,{"$f":"'Détermination_sec_1 '!H23","v":285184933},null,{"$f":"'Détermination_sec_1 '!H41+'Détermination_sec_1 '!H59","v":2325200},null,null,null,{"$f":"N23","v":58400},null,null,{"$f":"'Détermination_sec_1 '!H78","v":62790167}]
[]
[null,"Sous-catégorie des immeubles non résidentiels"]
[null,null,null,null,null,"TAUX SOUS-CATÉGORIE DE RÉFÉRENCE","Sous-catégorie 1","Sous-catégorie 2","Sous-catégorie 3","Sous-catégorie 4","Sous-catégorie 5","Sous-catégorie 6","Sous-catégorie 7","Sous-catégorie 8","Sous-catégorie 9","Sous-catégorie 10"]
[]
[null,null,"Assiette imposable",null,null,{"$f":"'Détermination_sec_1 '!G100","v":120420639.09999999},{"$f":"'Détermination_sec_1 '!G122","v":112404699.09999999},{"$f":"'Détermination_sec_1 '!R122","v":112404699.09999999},{"$f":"'Détermination_sec_1 '!AC122","v":112404699.09999999},{"$f":"'Détermination_sec_1 '!AN122","v":112404699.09999999},{"$f":"'Détermination_sec_1 '!AY122","v":112404699.09999999},{"$f":"'Détermination_sec_1 '!BJ122","v":112404699.09999999},{"$f":"'Détermination_sec_1 '!BU122","v":112404699.09999999},{"$f":"'Détermination_sec_1 '!CF122","v":112404699.09999999},{"$f":"'Détermination_sec_1 '!CQ122","v":112404699.09999999},{"$f":"'Détermination_sec_1 '!DB122","v":112404699.09999999}]
[null,null,"Assiette compensable",null,null,{"$f":"'Détermination_sec_1 '!H100","v":25925903},{"$f":"'Détermination_sec_1 '!H122","v":25925903},{"$f":"'Détermination_sec_1 '!S122","v":25925903},{"$f":"'Détermination_sec_1 '!AD122","v":25925903},{"$f":"'Détermination_sec_1 '!AO122","v":25925903},{"$f":"'Détermination_sec_1 '!AZ122","v":25925903},{"$f":"'Détermination_sec_1 '!BK122","v":25925903},{"$f":"'Détermination_sec_1 '!BV122","v":25925903},{"$f":"'Détermination_sec_1 '!CG122","v":25925903},{"$f":"'Détermination_sec_1 '!CR122","v":25925903},{"$f":"'Détermination_sec_1 '!DC122","v":25925903}]
[]
[null,"Sous-catégorie des immeubles résidentiels"]
[null,null,null,null,null,"TAUX SOUS-CATÉGORIE RÉSIDUELLE","Sous-catégorie 1","Sous-catégorie 2","Sous-catégorie 3","Sous-catégorie 4","Sous-catégorie 5","Sous-catégorie 6","Sous-catégorie 7","Sous-catégorie 8","Sous-catégorie 9","Sous-catégorie 10"]
[]
[null,null,"Assiette imposable",null,null,{"$f":"'Détermination_sec_1 '!G141","v":772400663.71818185},{"$f":"'Détermination_sec_1 '!G160","v":761250103.71818185},{"$f":"'Détermination_sec_1 '!R160","v":761250103.71818185},{"$f":"'Détermination_sec_1 '!AC160","v":761250103.71818185},{"$f":"'Détermination_sec_1 '!AN160","v":761250103.71818185},{"$f":"'Détermination_sec_1 '!AY160","v":761250103.71818185},{"$f":"'Détermination_sec_1 '!BJ160","v":761250103.71818185},{"$f":"'Détermination_sec_1 '!BU160","v":761250103.71818185},{"$f":"'Détermination_sec_1 '!CF160","v":761250103.71818185},{"$f":"'Détermination_sec_1 '!CQ160","v":761250103.71818185},{"$f":"'Détermination_sec_1 '!DB160","v":761250103.71818185}]
[null,null,"Assiette compensable",null,null,{"$f":"'Détermination_sec_1 '!H141","v":5708197},{"$f":"'Détermination_sec_1 '!H160","v":5708197},{"$f":"'Détermination_sec_1 '!S160","v":5708197},{"$f":"'Détermination_sec_1 '!AD160","v":5708197},{"$f":"'Détermination_sec_1 '!AO160","v":5708197},{"$f":"'Détermination_sec_1 '!AZ160","v":5708197},{"$f":"'Détermination_sec_1 '!BK160","v":5708197},{"$f":"'Détermination_sec_1 '!BV160","v":5708197},{"$f":"'Détermination_sec_1 '!CG160","v":5708197},{"$f":"'Détermination_sec_1 '!CR160","v":5708197},{"$f":"'Détermination_sec_1 '!DC160","v":5708197}]

{"sheet":"Détermination_sec_1 ","index":2,"n_rows":160,"n_cols":109,"rows_kept":160,"cut":false,"hidden":true,"merged":[[143,102,143,103],[143,66,144,66],[143,67,144,67],[143,69,143,70],[143,77,144,77],[143,78,144,78],[143,80,143,81],[143,88,144,88],[143,89,144,89],[143,91,143,92],[143,99,144,99],[143,100,144,100],[143,58,143,59],[143,22,144,22],[143,23,144,23],[143,25,143,26],[143,33,144,33],[143,34,144,34],[143,36,143,37],[143,44,144,44],[143,45,144,45],[143,47,143,48],[143,55,144,55],[143,56,144,56],[143,0,144,0],[143,1,144,1],[143,3,143,4],[143,11,144,11],[143,12,144,12],[143,14,143,15],[102,99,103,99],[102,100,103,100],[102,102,102,103],[124,0,125,0],[124,1,125,1],[124,3,124,4],[102,77,103,77],[102,78,103,78],[102,80,102,81],[102,88,103,88],[102,47,102,48],[102,89,103,89],[102,91,102,92],[102,55,103,55],[102,56,103,56],[102,58,102,59],[102,66,103,66],[102,67,103,67],[102,69,102,70],[102,33,103,33],[102,34,103,34],[102,36,102,37],[102,44,103,44],[102,45,103,45],[102,25,102,26],[80,0,81,0],[80,1,81,1],[80,3,80,4],[102,0,103,0],[102,1,103,1],[102,3,102,4],[102,11,103,11],[102,12,103,12],[102,14,102,15],[102,22,103,22],[102,23,103,23],[43,0,44,0],[43,1,44,1],[43,3,43,4],[61,0,62,0],[61,1,62,1],[61,3,61,4],[3,0,4,0],[3,1,4,1],[3,3,3,4],[25,0,26,0],[25,1,26,1],[25,3,25,4]]}
["DÉTERMINATION DES ASSIETTES "]
[]
["ASSIETTE AU TAUX NON RÉSIDENTIEL"]
["Classe non résidentielle","Pourcentage de taxation",null,"VAL. NR À 100 % ET IND. CL. 2 À 50 %"]
[null,null,null,"  Imposables","Compensables",null,"Imposables pondérées","Compensables pondérées",null,"Total"]
[null,"(1)",null,"(2)","(3)",null,"(4) = (1) X (2)","(5) = (1 ) X  (3)",null,"(6) = (4) + (5)"]
[" 1A",1E-3,null,{"$f":"'Sommaire du rôle_sec_1'!F7","v":76534150},{"$f":"'Sommaire du rôle_sec_1'!G7","v":0},null,{"$f":"B7*D7","v":76534.150000000009},{"$f":"B7*E7","v":0},null,{"$f":"G7+H7","v":76534.150000000009}]
[" 1B",5.0000000000000001E-3,null,{"$f":"'Sommaire du rôle_sec_1'!F8","v":34712370},{"$f":"'Sommaire du rôle_sec_1'!G8","v":0},null,173561.85,0,null,173561.85]
[" 1C",0.01,null,{"$f":"'Sommaire du rôle_sec_1'!F9","v":4894450},{"$f":"'Sommaire du rôle_sec_1'!G9","v":0},null,48944.5,0,null,48944.5]
[2,0.03,null,{"$f":"'Sommaire du rôle_sec_1'!F10","v":23616670},{"$f":"'Sommaire du rôle_sec_1'!G10","v":0},null,708500.1,0,null,708500.1]
[3,0.06,null,{"$f":"'Sommaire du rôle_sec_1'!F11","v":44153450},{"$f":"'Sommaire du rôle_sec_1'!G11","v":0},null,2649207,0,null,2649207]
[4,0.12,null,{"$f":"'Sommaire du rôle_sec_1'!F12","v":60256460},{"$f":"'Sommaire du rôle_sec_1'!G12","v":0},null,7230775.2000000002,0,null,7230775.2000000002]
[5,0.22,null,{"$f":"'Sommaire du rôle_sec_1'!F13","v":38643990},{"$f":"'Sommaire du rôle_sec_1'!G13","v":0},null,8501677.8000000007,0,null,8501677.8000000007]
[6,0.4,null,{"$f":"'Sommaire du rôle_sec_1'!F14","v":38532890},{"$f":"'Sommaire du rôle_sec_1'!G14","v":0},null,15413156,0,null,15413156]
[7,0.6,null,{"$f":"'Sommaire du rôle_sec_1'!F15","v":39569365},{"$f":"'Sommaire du rôle_sec_1'!G15","v":72376370},null,23741619,43425822,null,67167441]
[8,0.85,null,{"$f":"'Sommaire du rôle_sec_1'!F16","v":22323070},{"$f":"'Sommaire du rôle_sec_1'!G16","v":211592260},null,18974609.5,179853421,null,198828030.5]
[9,1,null,{"$f":"'Sommaire du rôle_sec_1'!F17","v":3177900},{"$f":"'Sommaire du rôle_sec_1'!G17","v":0},null,3177900,0,null,3177900]
[10,1,null,{"$f":"'Sommaire du rôle_sec_1'!F18","v":1155755205},{"$f":"'Sommaire du rôle_sec_1'!G18","v":61905690},null,1155755205,61905690,null,1217660895]
["11 Cours de triage","100%",null,{"$f":"'Sommaire du rôle_sec_1'!F19","v":0},{"$f":"'Sommaire du rôle_sec_1'!G19","v":0},null,0,0,null,0]
["12 CHSLD",0.2,null,{"$f":"'Sommaire du rôle_sec_1'!F20","v":13938200},null,null,2787640,null,null,2787640]
["13 Cours de triage 40 %","40%",null,{"$f":"'Sommaire du rôle_sec_1'!F21","v":0},null,null,0,null,null,0]
[" APPLICATION DU TNR QUAND TTVD",1,null,{"$f":"'Sommaire du rôle_sec_1'!F22","v":5228300},{"$f":"'Sommaire du rôle_sec_1'!G22","v":0},null,5228300,{"$f":"B22*E22","v":0},null,5228300]
["Total",null,null,null,null,null,{"$f":"SUM(G7:G22)","v":1244467630.0999999},{"$f":"SUM(H7:H22)","v":285184933},null,1529652563.0999999]
[]
["ASSIETTE AU TAUX INDUSTRIEL (CLASSE 2)"]
["Classe non résidentielle","Pourcentage de taxation",null,"VALEUR À 50 %"]
[null,null,null,"  Imposables","Compensables",null,"Imposables pondérées","Compensables pondérées",null,"Total"]
[null,"(1)",null,"(2)","(3)",null,"(4) = (1) X (2)","(5) = (1) X (3)",null,"(6) = (4) + (5)"]
[" 1A",1E-3,null,{"$f":"'Sommaire du rôle_sec_1'!H7","v":0},{"$f":"'Sommaire du rôle_sec_1'!I7","v":0},null,{"$f":"B29*D29","v":0},{"$f":"B29*E29","v":0},null,{"$f":"G29+H29","v":0}]
[" 1B",5.0000000000000001E-3,null,{"$f":"'Sommaire du rôle_sec_1'!H8","v":0},{"$f":"'Sommaire du rôle_sec_1'!I8","v":0},null,0,0,null,0]
[" 1C",0.01,null,{"$f":"'Sommaire du rôle_sec_1'!H9","v":0},{"$f":"'Sommaire du rôle_sec_1'!I9","v":0},null,0,0,null,0]
[2,0.03,null,{"$f":"'Sommaire du rôle_sec_1'!H10","v":0},{"$f":"'Sommaire du rôle_sec_1'!I10","v":0},null,0,0,null,0]
[3,0.06,null,{"$f":"'Sommaire du rôle_sec_1'!H11","v":0},{"$f":"'Sommaire du rôle_sec_1'!I11","v":0},null,0,0,null,0]
[4,0.12,null,{"$f":"'Sommaire du rôle_sec_1'!H12","v":0},{"$f":"'Sommaire du rôle_sec_1'!I12","v":0},null,0,0,null,0]
[5,0.22,null,{"$f":"'Sommaire du rôle_sec_1'!H13","v":0},{"$f":"'Sommaire du rôle_sec_1'!I13","v":0},null,0,0,null,0]
[6,0.4,null,{"$f":"'Sommaire du rôle_sec_1'!H14","v":290100},{"$f":"'Sommaire du rôle_sec_1'!I14","v":0},null,116040,0,null,116040]
[7,0.6,null,{"$f":"'Sommaire du rôle_sec_1'!H15","v":350350},{"$f":"'Sommaire du rôle_sec_1'!I15","v":0},null,210210,0,null,210210]
[8,0.85,null,{"$f":"'Sommaire du rôle_sec_1'!H16","v":0},{"$f":"'Sommaire du rôle_sec_1'!I16","v":0},null,0,0,null,0]
[9,1,null,{"$f":"'Sommaire du rôle_sec_1'!H17","v":0},{"$f":"'Sommaire du rôle_sec_1'!I17","v":0},null,0,0,null,0]
[10,1,null,{"$f":"'Sommaire du rôle_sec_1'!H18","v":10515650},{"$f":"'Sommaire du rôle_sec_1'!I18","v":0},null,10515650,0,null,10515650]
["Total",null,null,null,null,null,{"$f":"SUM(G29:G40)","v":10841900},{"$f":"SUM(H29:H40)","v":0},null,10841900]
[]
["ASSIETTE AU TAUX IND. (SAUF CL.1 ET 2)"]
["Classe non résidentielle","Pourcentage de taxation",null,"VALEUR À 100 %"]
[null,null,null,"  Imposables","Compensables",null,"Imposables pondérées","Compensables pondérées",null,"Total"]
[null,"(1)",null,"(2)","(3)",null,"(4) = (1) X (2)","(5) = (1) X (3)",null,"(6) = (4) + (5)"]
[" 1A",1E-3,null,{"$f":"'Sommaire du rôle_sec_1'!J7","v":0},{"$f":"'Sommaire du rôle_sec_1'!K7","v":0},null,{"$f":"B47*D47","v":0},{"$f":"B47*E47","v":0},null,{"$f":"G47+H47","v":0}]
[" 1B",5.0000000000000001E-3,null,{"$f":"'Sommaire du rôle_sec_1'!J8","v":0},{"$f":"'Sommaire du rôle_sec_1'!K8","v":0},null,0,0,null,0]
[" 1C",0.01,null,{"$f":"'Sommaire du rôle_sec_1'!J9","v":0},{"$f":"'Sommaire du rôle_sec_1'!K9","v":0},null,0,0,null,0]
[2,0.03,null,{"$f":"'Sommaire du rôle_sec_1'!J10","v":605900},{"$f":"'Sommaire du rôle_sec_1'!K10","v":0},null,18177,0,null,18177]
[3,0.06,null,{"$f":"'Sommaire du rôle_sec_1'!J11","v":181400},{"$f":"'Sommaire du rôle_sec_1'!K11","v":0},null,10884,0,null,10884]
[4,0.12,null,{"$f":"'Sommaire du rôle_sec_1'!J12","v":215700},{"$f":"'Sommaire du rôle_sec_1'!K12","v":0},null,25884,0,null,25884]
[5,0.22,null,{"$f":"'Sommaire du rôle_sec_1'!J13","v":0},{"$f":"'Sommaire du rôle_sec_1'!K13","v":0},null,0,0,null,0]
[6,0.4,null,{"$f":"'Sommaire du rôle_sec_1'!J14","v":2421200},{"$f":"'Sommaire du rôle_sec_1'!K14","v":0},null,968480,0,null,968480]
[7,0.6,null,{"$f":"'Sommaire du rôle_sec_1'!J15","v":354000},{"$f":"'Sommaire du rôle_sec_1'!K15","v":0},null,212400,0,null,212400]
[8,0.85,null,{"$f":"'Sommaire du rôle_sec_1'!J16","v":1875900},{"$f":"'Sommaire du rôle_sec_1'!K16","v":0},null,1594515,0,null,1594515]
[9,1,null,{"$f":"'Sommaire du rôle_sec_1'!J17","v":0},{"$f":"'Sommaire du rôle_sec_1'!K17","v":0},null,0,0,null,0]
[10,1,null,{"$f":"'Sommaire du rôle_sec_1'!J18","v":225704400},{"$f":"'Sommaire du rôle_sec_1'!K18","v":2325200},null,225704400,2325200,null,228029600]
["Total",null,null,null,null,null,{"$f":"SUM(G47:G58)","v":228534740},{"$f":"SUM(H47:H58)","v":2325200},null,230859940]
[]
["ASSIETTE AU TAUX DE BASE"]
["Classe non résidentielle","Pourcentage de taxation",null,"VALEUR À 100 %"]
[null,null,null,"  Imposables","Compensables",null,"Imposables pondérées","Compensables pondérées",null,"Total"]
[null,"(1)",null,"(2)","(3)",null,"(4) = (1) X (2)","(5) = (1) X (3)",null,"(6) = (4) + (5)"]
[" 1A",0.999,null,{"$f":"'Sommaire du rôle_sec_1'!P7","v":76534150},{"$f":"'Sommaire du rôle_sec_1'!Q7","v":0},null,{"$f":"D65*B65","v":76457615.849999994},{"$f":"B65*E65","v":0},null,{"$f":"G65+H65","v":76457615.849999994}]
[" 1B",0.995,null,{"$f":"'Sommaire du rôle_sec_1'!P8","v":34712370},{"$f":"'Sommaire du rôle_sec_1'!Q8","v":0},null,34538808.149999999,0,null,34538808.149999999]
[" 1C",0.99,null,{"$f":"'Sommaire du rôle_sec_1'!P9","v":4894450},{"$f":"'Sommaire du rôle_sec_1'!Q9","v":0},null,4845505.5,0,null,4845505.5]
[2,0.97,null,{"$f":"'Sommaire du rôle_sec_1'!P10","v":23616670},{"$f":"'Sommaire du rôle_sec_1'!Q10","v":0},null,22908169.899999999,0,null,22908169.899999999]
[3,0.94,null,{"$f":"'Sommaire du rôle_sec_1'!P11","v":44153450},{"$f":"'Sommaire du rôle_sec_1'!Q11","v":0},null,41504243,0,null,41504243]
[4,0.88,null,{"$f":"'Sommaire du rôle_sec_1'!P12","v":60256460},{"$f":"'Sommaire du rôle_sec_1'!Q12","v":0},null,53025684.799999997,0,null,53025684.799999997]
[5,0.78,null,{"$f":"'Sommaire du rôle_sec_1'!P13","v":38643990},{"$f":"'Sommaire du rôle_sec_1'!Q13","v":0},null,30142312.199999999,0,null,30142312.199999999]
[6,0.6,null,{"$f":"'Sommaire du rôle_sec_1'!P14","v":38532890},{"$f":"'Sommaire du rôle_sec_1'!Q14","v":0},null,23119734,0,null,23119734]
[7,0.4,null,{"$f":"'Sommaire du rôle_sec_1'!P15","v":39569365},{"$f":"'Sommaire du rôle_sec_1'!Q15","v":72376370},null,15827746,28950548,null,44778294]
[8,0.15000000000000002,null,{"$f":"'Sommaire du rôle_sec_1'!P16","v":22323070},{"$f":"'Sommaire du rôle_sec_1'!Q16","v":211592260},null,3348460.5000000005,31738839.000000004,null,35087299.500000007]
["IMMEUBLES SANS PARTIE NON RÉSIDENTIELLE",1,null,{"$f":"'Sommaire du rôle_sec_1'!P18","v":8068032861},{"$f":"'Sommaire du rôle_sec_1'!Q18","v":2100780},null,8068032861,2100780,null,8070133641]
["12  CHSLD",0.8,null,{"$f":"'Sommaire du rôle_sec_1'!P20","v":13938200},null,null,11150560]
["13 Cours de triage ",0.6,null,{"$f":"'Sommaire du rôle_sec_1'!P21","v":0},null,null,0]
["Total",null,null,null,null,null,{"$f":"SUM(G65:G77)","v":8384901700.8999996},{"$f":"SUM(H65:H75)","v":62790167},{"$f":"SUM(I65:I75)","v":0},{"$f":"G78+H78","v":8447691867.8999996}]
[]
["ASSIETTE AU TAUX NON RÉSIDENTIEL RÉFÉRENCE"]
["Classe non résidentielle","Pourcentage de taxation",null,"VAL. NR À 100 % ET IND. CL. 2 À 50 %"]
[null,null,null,"  Imposables","Compensables",null,"Imposables pondérées","Compensables pondérées",null,"Total"]
[null,"(1)",null,"(2)","(3)",null,"(4) = (1) X (2)","(5) = (1 ) X  (3)",null,"(6) = (4) + (5)"]
[" 1A",1E-3,null,{"$f":"'Sommaire du rôle_sec_1'!F30","v":6957650},{"$f":"'Sommaire du rôle_sec_1'!G30","v":0},null,{"$f":"B84*D84","v":6957.6500000000005},{"$f":"B84*E84","v":0},null,{"$f":"G84+H84","v":6957.6500000000005}]
[" 1B",5.0000000000000001E-3,null,{"$f":"'Sommaire du rôle_sec_1'!F31","v":3155670},{"$f":"'Sommaire du rôle_sec_1'!G31","v":0},null,15778.35,0,null,15778.35]
[" 1C",0.01,null,{"$f":"'Sommaire du rôle_sec_1'!F32","v":444950},{"$f":"'Sommaire du rôle_sec_1'!G32","v":0},null,4449.5,0,null,4449.5]
[2,0.03,null,{"$f":"'Sommaire du rôle_sec_1'!F33","v":2146970},{"$f":"'Sommaire du rôle_sec_1'!G33","v":0},null,64409.1,0,null,64409.1]
[3,0.06,null,{"$f":"'Sommaire du rôle_sec_1'!F34","v":4013950},{"$f":"'Sommaire du rôle_sec_1'!G34","v":0},null,240837,0,null,240837]
[4,0.12,null,{"$f":"'Sommaire du rôle_sec_1'!F35","v":5477860},{"$f":"'Sommaire du rôle_sec_1'!G35","v":0},null,657343.19999999995,0,null,657343.19999999995]
[5,0.22,null,{"$f":"'Sommaire du rôle_sec_1'!F36","v":3513090},{"$f":"'Sommaire du rôle_sec_1'!G36","v":0},null,772879.8,0,null,772879.8]
[6,0.4,null,{"$f":"'Sommaire du rôle_sec_1'!F37","v":3502990},{"$f":"'Sommaire du rôle_sec_1'!G37","v":0},null,1401196,0,null,1401196]
[7,0.6,null,{"$f":"'Sommaire du rôle_sec_1'!F38","v":3597215},{"$f":"'Sommaire du rôle_sec_1'!G38","v":6579670},null,2158329,3947802,null,6106131]
[8,0.85,null,{"$f":"'Sommaire du rôle_sec_1'!F39","v":2029370},{"$f":"'Sommaire du rôle_sec_1'!G39","v":19235660},null,1724964.5,16350311,null,18075275.5]
[9,1,null,{"$f":"'Sommaire du rôle_sec_1'!F40","v":288900},{"$f":"'Sommaire du rôle_sec_1'!G40","v":0},null,288900,0,null,288900]
[10,1,null,{"$f":"'Sommaire du rôle_sec_1'!F41","v":105068655},{"$f":"'Sommaire du rôle_sec_1'!G41","v":5627790},null,105068655,5627790,null,110696445]
["11 Cours de triage","100%",null,{"$f":"'Sommaire du rôle_sec_1'!F42","v":0},{"$f":"'Sommaire du rôle_sec_1'!G42","v":0},null,0,0,null,0]
["12 CHSLD",0.2,null,{"$f":"'Sommaire du rôle_sec_1'!F43","v":13938200},null,null,2787640,null,null,2787640]
["13 Cours de triage 40 %","40%",null,{"$f":"'Sommaire du rôle_sec_1'!F44","v":0},null,null,0,null,null,0]
[" APPLICATION DU TNR QUAND TTVD",1,null,{"$f":"'Sommaire du rôle_sec_1'!F45","v":5228300},{"$f":"'Sommaire du rôle_sec_1'!G45","v":0},null,5228300,{"$f":"B99*E99","v":0},null,5228300]
["Total",null,null,null,null,null,{"$f":"SUM(G84:G99)","v":120420639.09999999},{"$f":"SUM(H84:H99)","v":25925903},null,146346542.09999999]
[]
["ASSIETTE AU TAUX NON RÉSIDENTIEL SOUS-CATÉGORIE 1",null,null,null,null,null,null,null,null,null,null,"ASSIETTE AU TAUX NON RÉSIDENTIEL SOUS-CATÉGORIE 2",null,null,null,null,null,null,null,null,null,null,"ASSIETTE AU TAUX NON RÉSIDENTIEL SOUS-CATÉGORIE 3",null,null,null,null,null,null,null,null,null,null,"ASSIETTE AU TAUX NON RÉSIDENTIEL SOUS-CATÉGORIE 4",null,null,null,null,null,null,null,null,null,null,"ASSIETTE AU TAUX NON RÉSIDENTIEL SOUS-CATÉGORIE 5",null,null,null,null,null,null,null,null,null,null,"ASSIETTE AU TAUX NON RÉSIDENTIEL SOUS-CATÉGORIE 6",null,null,null,null,null,null,null,null,null,null,"ASSIETTE AU TAUX NON RÉSIDENTIEL SOUS-CATÉGORIE 7",null,null,null,null,null,null,null,null,null,null,"ASSIETTE AU TAUX NON RÉSIDENTIEL SOUS-CATÉGORIE 8",null,null,null,null,null,null,null,null,null,null,"ASSIETTE AU TAUX NON RÉSIDENTIEL SOUS-CATÉGORIE 9",null,null,null,null,null,null,null,null,null,null,"ASSIETTE AU TAUX NON RÉSIDENTIEL SOUS-CATÉGORIE 10"]
["Classe non résidentielle","Pourcentage de taxation",null,"VAL. NR À 100 % ET IND. CL. 2 À 50 %",null,null,null,null,null,null,null,"Classe non résidentielle","Pourcentage de taxation",null,"VAL. NR À 100 % ET IND. CL. 2 À 50 %",null,null,null,null,null,null,null,"Classe non résidentielle","Pourcentage de taxation",null,"VAL. NR À 100 % ET IND. CL. 2 À 50 %",null,null,null,null,null,null,null,"Classe non résidentielle","Pourcentage de taxation",null,"VAL. NR À 100 % ET IND. CL. 2 À 50 %",null,null,null,null,null,null,null,"Classe non résidentielle","Pourcentage de taxation",null,"VAL. NR À 100 % ET IND. CL. 2 À 50 %",null,null,null,null,null,null,null,"Classe non résidentielle","Pourcentage de taxation",null,"VAL. NR À 100 % ET IND. CL. 2 À 50 %",null,null,null,null,null,null,null,"Classe non résidentielle","Pourcentage de taxation",null,"VAL. NR À 100 % ET IND. CL. 2 À 50 %",null,null,null,null,null,null,null,"Classe non résidentielle","Pourcentage de taxation",null,"VAL. NR À 100 % ET IND. CL. 2 À 50 %",null,null,null,null,null,null,null,"Classe non résidentielle","Pourcentage de taxation",null,"VAL. NR À 100 % ET IND. CL. 2 À 50 %",null,null,null,null,null,null,null,"Classe non résidentielle","Pourcentage de taxation",null,"VAL. NR À 100 % ET IND. CL. 2 À 50 %"]
[null,null,null,"  Imposables","Compensables",null,"Imposables pondérées","Compensables pondérées",null,"Total",null,null,null,null,"  Imposables","Compensables",null,"Imposables pondérées","Compensables pondérées",null,"Total",null,null,null,null,"  Imposables","Compensables",null,"Imposables pondérées","Compensables pondérées",null,"Total",null,null,null,null,"  Imposables","Compensables",null,"Imposables pondérées","Compensables pondérées",null,"Total",null,null,null,null,"  Imposables","Compensables",null,"Imposables pondérées","Compensables pondérées",null,"Total",null,null,null,null,"  Imposables","Compensables",null,"Imposables pondérées","Compensables pondérées",null,"Total",null,null,null,null,"  Imposables","Compensables",null,"Imposables pondérées","Compensables pondérées",null,"Total",null,null,null,null,"  Imposables","Compensables",null,"Imposables pondérées","Compensables pondérées",null,"Total",null,null,null,null,"  Imposables","Compensables",null,"Imposables pondérées","Compensables pondérées",null,"Total",null,null,null,null,"  Imposables","Compensables",null,"Imposables pondérées","Compensables pondérées",null,"Total"]
[null,"(1)",null,"(2)","(3)",null,"(4) = (1) X (2)","(5) = (1 ) X  (3)",null,"(6) = (4) + (5)",null,null,"(1)",null,"(2)","(3)",null,"(4) = (1) X (2)","(5) = (1 ) X  (3)",null,"(6) = (4) + (5)",null,null,"(1)",null,"(2)","(3)",null,"(4) = (1) X (2)","(5) = (1 ) X  (3)",null,"(6) = (4) + (5)",null,null,"(1)",null,"(2)","(3)",null,"(4) = (1) X (2)","(5) = (1 ) X  (3)",null,"(6) = (4) + (5)",null,null,"(1)",null,"(2)","(3)",null,"(4) = (1) X (2)","(5) = (1 ) X  (3)",null,"(6) = (4) + (5)",null,null,"(1)",null,"(2)","(3)",null,"(4) = (1) X (2)","(5) = (1 ) X  (3)",null,"(6) = (4) + (5)",null,null,"(1)",null,"(2)","(3)",null,"(4) = (1) X (2)","(5) = (1 ) X  (3)",null,"(6) = (4) + (5)",null,null,"(1)",null,"(2)","(3)",null,"(4) = (1) X (2)","(5) = (1 ) X  (3)",null,"(6) = (4) + (5)",null,null,"(1)",null,"(2)","(3)",null,"(4) = (1) X (2)","(5) = (1 ) X  (3)",null,"(6) = (4) + (5)",null,null,"(1)",null,"(2)","(3)",null,"(4) = (1) X (2)","(5) = (1 ) X  (3)",null,"(6) = (4) + (5)"]
[" 1A",1E-3,null,{"$f":"'Sommaire du rôle_sec_1'!H30","v":6957650},{"$f":"'Sommaire du rôle_sec_1'!I30","v":0},null,{"$f":"B106*D106","v":6957.6500000000005},{"$f":"B106*E106","v":0},null,{"$f":"G106+H106","v":6957.6500000000005},null," 1A",1E-3,null,{"$f":"'Sommaire du rôle_sec_1'!J30","v":6957650},{"$f":"'Sommaire du rôle_sec_1'!K30","v":0},null,{"$f":"M106*O106","v":6957.6500000000005},{"$f":"M106*P106","v":0},null,{"$f":"R106+S106","v":6957.6500000000005},null," 1A",1E-3,null,{"$f":"'Sommaire du rôle_sec_1'!L30","v":6957650},{"$f":"'Sommaire du rôle_sec_1'!M30","v":0},null,{"$f":"X106*Z106","v":6957.6500000000005},{"$f":"X106*AA106","v":0},null,{"$f":"AC106+AD106","v":6957.6500000000005},null," 1A",1E-3,null,{"$f":"'Sommaire du rôle_sec_1'!N30","v":6957650},{"$f":"'Sommaire du rôle_sec_1'!O30","v":0},null,{"$f":"AI106*AK106","v":6957.6500000000005},{"$f":"AI106*AL106","v":0},null,{"$f":"AN106+AO106","v":6957.6500000000005},null," 1A",1E-3,null,{"$f":"'Sommaire du rôle_sec_1'!P30","v":6957650},{"$f":"'Sommaire du rôle_sec_1'!Q30","v":0},null,{"$f":"AT106*AV106","v":6957.6500000000005},{"$f":"AT106*AW106","v":0},null,{"$f":"AY106+AZ106","v":6957.6500000000005},null," 1A",1E-3,null,{"$f":"'Sommaire du rôle_sec_1'!R30","v":6957650},{"$f":"'Sommaire du rôle_sec_1'!S30","v":0},null,{"$f":"BE106*BG106","v":6957.6500000000005},{"$f":"BE106*BH106","v":0},null,{"$f":"BJ106+BK106","v":6957.6500000000005},null," 1A",1E-3,null,{"$f":"'Sommaire du rôle_sec_1'!T30","v":6957650},{"$f":"'Sommaire du rôle_sec_1'!U30","v":0},null,{"$f":"BP106*BR106","v":6957.6500000000005},{"$f":"BP106*BS106","v":0},null,{"$f":"BU106+BV106","v":6957.6500000000005},null," 1A",1E-3,null,{"$f":"'Sommaire du rôle_sec_1'!V30","v":6957650},{"$f":"'Sommaire du rôle_sec_1'!W30","v":0},null,{"$f":"CA106*CC106","v":6957.6500000000005},{"$f":"CA106*CD106","v":0},null,{"$f":"CF106+CG106","v":6957.6500000000005},null," 1A",1E-3,null,{"$f":"'Sommaire du rôle_sec_1'!X30","v":6957650},{"$f":"'Sommaire du rôle_sec_1'!Y30","v":0},null,{"$f":"CL106*CN106","v":6957.6500000000005},{"$f":"CL106*CO106","v":0},null,{"$f":"CQ106+CR106","v":6957.6500000000005},null," 1A",1E-3,null,{"$f":"'Sommaire du rôle_sec_1'!Z30","v":6957650},{"$f":"'Sommaire du rôle_sec_1'!AA30","v":0},null,{"$f":"CW106*CY106","v":6957.6500000000005},{"$f":"CW106*CZ106","v":0},null,{"$f":"DB106+DC106","v":6957.6500000000005}]
[" 1B",5.0000000000000001E-3,null,{"$f":"'Sommaire du rôle_sec_1'!H31","v":3155670},{"$f":"'Sommaire du rôle_sec_1'!I31","v":0},null,15778.35,0,null,15778.35,null," 1B",5.0000000000000001E-3,null,{"$f":"'Sommaire du rôle_sec_1'!J31","v":3155670},{"$f":"'Sommaire du rôle_sec_1'!K31","v":0},null,15778.35,0,null,15778.35,null," 1B",5.0000000000000001E-3,null,{"$f":"'Sommaire du rôle_sec_1'!L31","v":3155670},{"$f":"'Sommaire du rôle_sec_1'!M31","v":0},null,15778.35,0,null,15778.35,null," 1B",5.0000000000000001E-3,null,{"$f":"'Sommaire du rôle_sec_1'!N31","v":3155670},{"$f":"'Sommaire du rôle_sec_1'!O31","v":0},null,15778.35,0,null,15778.35,null," 1B",5.0000000000000001E-3,null,{"$f":"'Sommaire du rôle_sec_1'!P31","v":3155670},{"$f":"'Sommaire du rôle_sec_1'!Q31","v":0},null,15778.35,0,null,15778.35,null," 1B",5.0000000000000001E-3,null,{"$f":"'Sommaire du rôle_sec_1'!R31","v":3155670},{"$f":"'Sommaire du rôle_sec_1'!S31","v":0},null,15778.35,0,null,15778.35,null," 1B",5.0000000000000001E-3,null,{"$f":"'Sommaire du rôle_sec_1'!T31","v":3155670},{"$f":"'Sommaire du rôle_sec_1'!U31","v":0},null,15778.35,0,null,15778.35,null," 1B",5.0000000000000001E-3,null,{"$f":"'Sommaire du rôle_sec_1'!V31","v":3155670},{"$f":"'Sommaire du rôle_sec_1'!W31","v":0},null,15778.35,0,null,15778.35,null," 1B",5.0000000000000001E-3,null,{"$f":"'Sommaire du rôle_sec_1'!X31","v":3155670},{"$f":"'Sommaire du rôle_sec_1'!Y31","v":0},null,15778.35,0,null,15778.35,null," 1B",5.0000000000000001E-3,null,{"$f":"'Sommaire du rôle_sec_1'!Z31","v":3155670},{"$f":"'Sommaire du rôle_sec_1'!AA31","v":0},null,15778.35,0,null,15778.35]
[" 1C",0.01,null,{"$f":"'Sommaire du rôle_sec_1'!H32","v":444950},{"$f":"'Sommaire du rôle_sec_1'!I32","v":0},null,4449.5,0,null,4449.5,null," 1C",0.01,null,{"$f":"'Sommaire du rôle_sec_1'!J32","v":444950},{"$f":"'Sommaire du rôle_sec_1'!K32","v":0},null,4449.5,0,null,4449.5,null," 1C",0.01,null,{"$f":"'Sommaire du rôle_sec_1'!L32","v":444950},{"$f":"'Sommaire du rôle_sec_1'!M32","v":0},null,4449.5,0,null,4449.5,null," 1C",0.01,null,{"$f":"'Sommaire du rôle_sec_1'!N32","v":444950},{"$f":"'Sommaire du rôle_sec_1'!O32","v":0},null,4449.5,0,null,4449.5,null," 1C",0.01,null,{"$f":"'Sommaire du rôle_sec_1'!P32","v":444950},{"$f":"'Sommaire du rôle_sec_1'!Q32","v":0},null,4449.5,0,null,4449.5,null," 1C",0.01,null,{"$f":"'Sommaire du rôle_sec_1'!R32","v":444950},{"$f":"'Sommaire du rôle_sec_1'!S32","v":0},null,4449.5,0,null,4449.5,null," 1C",0.01,null,{"$f":"'Sommaire du rôle_sec_1'!T32","v":444950},{"$f":"'Sommaire du rôle_sec_1'!U32","v":0},null,4449.5,0,null,4449.5,null," 1C",0.01,null,{"$f":"'Sommaire du rôle_sec_1'!V32","v":444950},{"$f":"'Sommaire du rôle_sec_1'!W32","v":0},null,4449.5,0,null,4449.5,null," 1C",0.01,null,{"$f":"'Sommaire du rôle_sec_1'!X32","v":444950},{"$f":"'Sommaire du rôle_sec_1'!Y32","v":0},null,4449.5,0,null,4449.5,null," 1C",0.01,null,{"$f":"'Sommaire du rôle_sec_1'!Z32","v":444950},{"$f":"'Sommaire du rôle_sec_1'!AA32","v":0},null,4449.5,0,null,4449.5]
[2,0.03,null,{"$f":"'Sommaire du rôle_sec_1'!H33","v":2146970},{"$f":"'Sommaire du rôle_sec_1'!I33","v":0},null,64409.1,0,null,64409.1,null,2,0.03,null,{"$f":"'Sommaire du rôle_sec_1'!J33","v":2146970},{"$f":"'Sommaire du rôle_sec_1'!K33","v":0},null,64409.1,0,null,64409.1,null,2,0.03,null,{"$f":"'Sommaire du rôle_sec_1'!L33","v":2146970},{"$f":"'Sommaire du rôle_sec_1'!M33","v":0},null,64409.1,0,null,64409.1,null,2,0.03,null,{"$f":"'Sommaire du rôle_sec_1'!N33","v":2146970},{"$f":"'Sommaire du rôle_sec_1'!O33","v":0},null,64409.1,0,null,64409.1,null,2,0.03,null,{"$f":"'Sommaire du rôle_sec_1'!P33","v":2146970},{"$f":"'Sommaire du rôle_sec_1'!Q33","v":0},null,64409.1,0,null,64409.1,null,2,0.03,null,{"$f":"'Sommaire du rôle_sec_1'!R33","v":2146970},{"$f":"'Sommaire du rôle_sec_1'!S33","v":0},null,64409.1,0,null,64409.1,null,2,0.03,null,{"$f":"'Sommaire du rôle_sec_1'!T33","v":2146970},{"$f":"'Sommaire du rôle_sec_1'!U33","v":0},null,64409.1,0,null,64409.1,null,2,0.03,null,{"$f":"'Sommaire du rôle_sec_1'!V33","v":2146970},{"$f":"'Sommaire du rôle_sec_1'!W33","v":0},null,64409.1,0,null,64409.1,null,2,0.03,null,{"$f":"'Sommaire du rôle_sec_1'!X33","v":2146970},{"$f":"'Sommaire du rôle_sec_1'!Y33","v":0},null,64409.1,0,null,64409.1,null,2,0.03,null,{"$f":"'Sommaire du rôle_sec_1'!Z33","v":2146970},{"$f":"'Sommaire du rôle_sec_1'!AA33","v":0},null,64409.1,0,null,64409.1]
[3,0.06,null,{"$f":"'Sommaire du rôle_sec_1'!H34","v":4013950},{"$f":"'Sommaire du rôle_sec_1'!I34","v":0},null,240837,0,null,240837,null,3,0.06,null,{"$f":"'Sommaire du rôle_sec_1'!J34","v":4013950},{"$f":"'Sommaire du rôle_sec_1'!K34","v":0},null,240837,0,null,240837,null,3,0.06,null,{"$f":"'Sommaire du rôle_sec_1'!L34","v":4013950},{"$f":"'Sommaire du rôle_sec_1'!M34","v":0},null,240837,0,null,240837,null,3,0.06,null,{"$f":"'Sommaire du rôle_sec_1'!N34","v":4013950},{"$f":"'Sommaire du rôle_sec_1'!O34","v":0},null,240837,0,null,240837,null,3,0.06,null,{"$f":"'Sommaire du rôle_sec_1'!P34","v":4013950},{"$f":"'Sommaire du rôle_sec_1'!Q34","v":0},null,240837,0,null,240837,null,3,0.06,null,{"$f":"'Sommaire du rôle_sec_1'!R34","v":4013950},{"$f":"'Sommaire du rôle_sec_1'!S34","v":0},null,240837,0,null,240837,null,3,0.06,null,{"$f":"'Sommaire du rôle_sec_1'!T34","v":4013950},{"$f":"'Sommaire du rôle_sec_1'!U34","v":0},null,240837,0,null,240837,null,3,0.06,null,{"$f":"'Sommaire du rôle_sec_1'!V34","v":4013950},{"$f":"'Sommaire du rôle_sec_1'!W34","v":0},null,240837,0,null,240837,null,3,0.06,null,{"$f":"'Sommaire du rôle_sec_1'!X34","v":4013950},{"$f":"'Sommaire du rôle_sec_1'!Y34","v":0},null,240837,0,null,240837,null,3,0.06,null,{"$f":"'Sommaire du rôle_sec_1'!Z34","v":4013950},{"$f":"'Sommaire du rôle_sec_1'!AA34","v":0},null,240837,0,null,240837]
[4,0.12,null,{"$f":"'Sommaire du rôle_sec_1'!H35","v":5477860},{"$f":"'Sommaire du rôle_sec_1'!I35","v":0},null,657343.19999999995,0,null,657343.19999999995,null,4,0.12,null,{"$f":"'Sommaire du rôle_sec_1'!J35","v":5477860},{"$f":"'Sommaire du rôle_sec_1'!K35","v":0},null,657343.19999999995,0,null,657343.19999999995,null,4,0.12,null,{"$f":"'Sommaire du rôle_sec_1'!L35","v":5477860},{"$f":"'Sommaire du rôle_sec_1'!M35","v":0},null,657343.19999999995,0,null,657343.19999999995,null,4,0.12,null,{"$f":"'Sommaire du rôle_sec_1'!N35","v":5477860},{"$f":"'Sommaire du rôle_sec_1'!O35","v":0},null,657343.19999999995,0,null,657343.19999999995,null,4,0.12,null,{"$f":"'Sommaire du rôle_sec_1'!P35","v":5477860},{"$f":"'Sommaire du rôle_sec_1'!Q35","v":0},null,657343.19999999995,0,null,657343.19999999995,null,4,0.12,null,{"$f":"'Sommaire du rôle_sec_1'!R35","v":5477860},{"$f":"'Sommaire du rôle_sec_1'!S35","v":0},null,657343.19999999995,0,null,657343.19999999995,null,4,0.12,null,{"$f":"'Sommaire du rôle_sec_1'!T35","v":5477860},{"$f":"'Sommaire du rôle_sec_1'!U35","v":0},null,657343.19999999995,0,null,657343.19999999995,null,4,0.12,null,{"$f":"'Sommaire du rôle_sec_1'!V35","v":5477860},{"$f":"'Sommaire du rôle_sec_1'!W35","v":0},null,657343.19999999995,0,null,657343.19999999995,null,4,0.12,null,{"$f":"'Sommaire du rôle_sec_1'!X35","v":5477860},{"$f":"'Sommaire du rôle_sec_1'!Y35","v":0},null,657343.19999999995,0,null,657343.19999999995,null,4,0.12,null,{"$f":"'Sommaire du rôle_sec_1'!Z35","v":5477860},{"$f":"'Sommaire du rôle_sec_1'!AA35","v":0},null,657343.19999999995,0,null,657343.19999999995]
[5,0.22,null,{"$f":"'Sommaire du rôle_sec_1'!H36","v":3513090},{"$f":"'Sommaire du rôle_sec_1'!I36","v":0},null,772879.8,0,null,772879.8,null,5,0.22,null,{"$f":"'Sommaire du rôle_sec_1'!J36","v":3513090},{"$f":"'Sommaire du rôle_sec_1'!K36","v":0},null,772879.8,0,null,772879.8,null,5,0.22,null,{"$f":"'Sommaire du rôle_sec_1'!L36","v":3513090},{"$f":"'Sommaire du rôle_sec_1'!M36","v":0},null,772879.8,0,null,772879.8,null,5,0.22,null,{"$f":"'Sommaire du rôle_sec_1'!N36","v":3513090},{"$f":"'Sommaire du rôle_sec_1'!O36","v":0},null,772879.8,0,null,772879.8,null,5,0.22,null,{"$f":"'Sommaire du rôle_sec_1'!P36","v":3513090},{"$f":"'Sommaire du rôle_sec_1'!Q36","v":0},null,772879.8,0,null,772879.8,null,5,0.22,null,{"$f":"'Sommaire du rôle_sec_1'!R36","v":3513090},{"$f":"'Sommaire du rôle_sec_1'!S36","v":0},null,772879.8,0,null,772879.8,null,5,0.22,null,{"$f":"'Sommaire du rôle_sec_1'!T36","v":3513090},{"$f":"'Sommaire du rôle_sec_1'!U36","v":0},null,772879.8,0,null,772879.8,null,5,0.22,null,{"$f":"'Sommaire du rôle_sec_1'!V36","v":3513090},{"$f":"'Sommaire du rôle_sec_1'!W36","v":0},null,772879.8,0,null,772879.8,null,5,0.22,null,{"$f":"'Sommaire du rôle_sec_1'!X36","v":3513090},{"$f":"'Sommaire du rôle_sec_1'!Y36","v":0},null,772879.8,0,null,772879.8,null,5,0.22,null,{"$f":"'Sommaire du rôle_sec_1'!Z36","v":3513090},{"$f":"'Sommaire du rôle_sec_1'!AA36","v":0},null,772879.8,0,null,772879.8]
[6,0.4,null,{"$f":"'Sommaire du rôle_sec_1'!H37","v":3502990},{"$f":"'Sommaire du rôle_sec_1'!I37","v":0},null,1401196,0,null,1401196,null,6,0.4,null,{"$f":"'Sommaire du rôle_sec_1'!J37","v":3502990},{"$f":"'Sommaire du rôle_sec_1'!K37","v":0},null,1401196,0,null,1401196,null,6,0.4,null,{"$f":"'Sommaire du rôle_sec_1'!L37","v":3502990},{"$f":"'Sommaire du rôle_sec_1'!M37","v":0},null,1401196,0,null,1401196,null,6,0.4,null,{"$f":"'Sommaire du rôle_sec_1'!N37","v":3502990},{"$f":"'Sommaire du rôle_sec_1'!O37","v":0},null,1401196,0,null,1401196,null,6,0.4,null,{"$f":"'Sommaire du rôle_sec_1'!P37","v":3502990},{"$f":"'Sommaire du rôle_sec_1'!Q37","v":0},null,1401196,0,null,1401196,null,6,0.4,null,{"$f":"'Sommaire du rôle_sec_1'!R37","v":3502990},{"$f":"'Sommaire du rôle_sec_1'!S37","v":0},null,1401196,0,null,1401196,null,6,0.4,null,{"$f":"'Sommaire du rôle_sec_1'!T37","v":3502990},{"$f":"'Sommaire du rôle_sec_1'!U37","v":0},null,1401196,0,null,1401196,null,6,0.4,null,{"$f":"'Sommaire du rôle_sec_1'!V37","v":3502990},{"$f":"'Sommaire du rôle_sec_1'!W37","v":0},null,1401196,0,null,1401196,null,6,0.4,null,{"$f":"'Sommaire du rôle_sec_1'!X37","v":3502990},{"$f":"'Sommaire du rôle_sec_1'!Y37","v":0},null,1401196,0,null,1401196,null,6,0.4,null,{"$f":"'Sommaire du rôle_sec_1'!Z37","v":3502990},{"$f":"'Sommaire du rôle_sec_1'!AA37","v":0},null,1401196,0,null,1401196]
[7,0.6,null,{"$f":"'Sommaire du rôle_sec_1'!H38","v":3597215},{"$f":"'Sommaire du rôle_sec_1'!I38","v":6579670},null,2158329,3947802,null,6106131,null,7,0.6,null,{"$f":"'Sommaire du rôle_sec_1'!J38","v":3597215},{"$f":"'Sommaire du rôle_sec_1'!K38","v":6579670},null,2158329,3947802,null,6106131,null,7,0.6,null,{"$f":"'Sommaire du rôle_sec_1'!L38","v":3597215},{"$f":"'Sommaire du rôle_sec_1'!M38","v":6579670},null,2158329,3947802,null,6106131,null,7,0.6,null,{"$f":"'Sommaire du rôle_sec_1'!N38","v":3597215},{"$f":"'Sommaire du rôle_sec_1'!O38","v":6579670},null,2158329,3947802,null,6106131,null,7,0.6,null,{"$f":"'Sommaire du rôle_sec_1'!P38","v":3597215},{"$f":"'Sommaire du rôle_sec_1'!Q38","v":6579670},null,2158329,3947802,null,6106131,null,7,0.6,null,{"$f":"'Sommaire du rôle_sec_1'!R38","v":3597215},{"$f":"'Sommaire du rôle_sec_1'!S38","v":6579670},null,2158329,3947802,null,6106131,null,7,0.6,null,{"$f":"'Sommaire du rôle_sec_1'!T38","v":3597215},{"$f":"'Sommaire du rôle_sec_1'!U38","v":6579670},null,2158329,3947802,null,6106131,null,7,0.6,null,{"$f":"'Sommaire du rôle_sec_1'!V38","v":3597215},{"$f":"'Sommaire du rôle_sec_1'!W38","v":6579670},null,2158329,3947802,null,6106131,null,7,0.6,null,{"$f":"'Sommaire du rôle_sec_1'!X38","v":3597215},{"$f":"'Sommaire du rôle_sec_1'!Y38","v":6579670},null,2158329,3947802,null,6106131,null,7,0.6,null,{"$f":"'Sommaire du rôle_sec_1'!Z38","v":3597215},{"$f":"'Sommaire du rôle_sec_1'!AA38","v":6579670},null,2158329,3947802,null,6106131]
[8,0.85,null,{"$f":"'Sommaire du rôle_sec_1'!H39","v":2029370},{"$f":"'Sommaire du rôle_sec_1'!I39","v":19235660},null,1724964.5,16350311,null,18075275.5,null,8,0.85,null,{"$f":"'Sommaire du rôle_sec_1'!J39","v":2029370},{"$f":"'Sommaire du rôle_sec_1'!K39","v":19235660},null,1724964.5,16350311,null,18075275.5,null,8,0.85,null,{"$f":"'Sommaire du rôle_sec_1'!L39","v":2029370},{"$f":"'Sommaire du rôle_sec_1'!M39","v":19235660},null,1724964.5,16350311,null,18075275.5,null,8,0.85,null,{"$f":"'Sommaire du rôle_sec_1'!N39","v":2029370},{"$f":"'Sommaire du rôle_sec_1'!O39","v":19235660},null,1724964.5,16350311,null,18075275.5,null,8,0.85,null,{"$f":"'Sommaire du rôle_sec_1'!P39","v":2029370},{"$f":"'Sommaire du rôle_sec_1'!Q39","v":19235660},null,1724964.5,16350311,null,18075275.5,null,8,0.85,null,{"$f":"'Sommaire du rôle_sec_1'!R39","v":2029370},{"$f":"'Sommaire du rôle_sec_1'!S39","v":19235660},null,1724964.5,16350311,null,18075275.5,null,8,0.85,null,{"$f":"'Sommaire du rôle_sec_1'!T39","v":2029370},{"$f":"'Sommaire du rôle_sec_1'!U39","v":19235660},null,1724964.5,16350311,null,18075275.5,null,8,0.85,null,{"$f":"'Sommaire du rôle_sec_1'!V39","v":2029370},{"$f":"'Sommaire du rôle_sec_1'!W39","v":19235660},null,1724964.5,16350311,null,18075275.5,null,8,0.85,null,{"$f":"'Sommaire du rôle_sec_1'!X39","v":2029370},{"$f":"'Sommaire du rôle_sec_1'!Y39","v":19235660},null,1724964.5,16350311,null,18075275.5,null,8,0.85,null,{"$f":"'Sommaire du rôle_sec_1'!Z39","v":2029370},{"$f":"'Sommaire du rôle_sec_1'!AA39","v":19235660},null,1724964.5,16350311,null,18075275.5]
[9,1,null,{"$f":"'Sommaire du rôle_sec_1'!H40","v":288900},{"$f":"'Sommaire du rôle_sec_1'!I40","v":0},null,288900,0,null,288900,null,9,1,null,{"$f":"'Sommaire du rôle_sec_1'!J40","v":288900},{"$f":"'Sommaire du rôle_sec_1'!K40","v":0},null,288900,0,null,288900,null,9,1,null,{"$f":"'Sommaire du rôle_sec_1'!L40","v":288900},{"$f":"'Sommaire du rôle_sec_1'!M40","v":0},null,288900,0,null,288900,null,9,1,null,{"$f":"'Sommaire du rôle_sec_1'!N40","v":288900},{"$f":"'Sommaire du rôle_sec_1'!O40","v":0},null,288900,0,null,288900,null,9,1,null,{"$f":"'Sommaire du rôle_sec_1'!P40","v":288900},{"$f":"'Sommaire du rôle_sec_1'!Q40","v":0},null,288900,0,null,288900,null,9,1,null,{"$f":"'Sommaire du rôle_sec_1'!R40","v":288900},{"$f":"'Sommaire du rôle_sec_1'!S40","v":0},null,288900,0,null,288900,null,9,1,null,{"$f":"'Sommaire du rôle_sec_1'!T40","v":288900},{"$f":"'Sommaire du rôle_sec_1'!U40","v":0},null,288900,0,null,288900,null,9,1,null,{"$f":"'Sommaire du rôle_sec_1'!V40","v":288900},{"$f":"'Sommaire du rôle_sec_1'!W40","v":0},null,288900,0,null,288900,null,9,1,null,{"$f":"'Sommaire du rôle_sec_1'!X40","v":288900},{"$f":"'Sommaire du rôle_sec_1'!Y40","v":0},null,288900,0,null,288900,null,9,1,null,{"$f":"'Sommaire du rôle_sec_1'!Z40","v":288900},{"$f":"'Sommaire du rôle_sec_1'!AA40","v":0},null,288900,0,null,288900]
[10,1,null,{"$f":"'Sommaire du rôle_sec_1'!H41","v":105068655},{"$f":"'Sommaire du rôle_sec_1'!I41","v":5627790},null,105068655,5627790,null,110696445,null,10,1,null,{"$f":"'Sommaire du rôle_sec_1'!J41","v":105068655},{"$f":"'Sommaire du rôle_sec_1'!K41","v":5627790},null,105068655,5627790,null,110696445,null,10,1,null,{"$f":"'Sommaire du rôle_sec_1'!L41","v":105068655},{"$f":"'Sommaire du rôle_sec_1'!M41","v":5627790},null,105068655,5627790,null,110696445,null,10,1,null,{"$f":"'Sommaire du rôle_sec_1'!N41","v":105068655},{"$f":"'Sommaire du rôle_sec_1'!O41","v":5627790},null,105068655,5627790,null,110696445,null,10,1,null,{"$f":"'Sommaire du rôle_sec_1'!P41","v":105068655},{"$f":"'Sommaire du rôle_sec_1'!Q41","v":5627790},null,105068655,5627790,null,110696445,null,10,1,null,{"$f":"'Sommaire du rôle_sec_1'!R41","v":105068655},{"$f":"'Sommaire du rôle_sec_1'!S41","v":5627790},null,105068655,5627790,null,110696445,null,10,1,null,{"$f":"'Sommaire du rôle_sec_1'!T41","v":105068655},{"$f":"'Sommaire du rôle_sec_1'!U41","v":5627790},null,105068655,5627790,null,110696445,null,10,1,null,{"$f":"'Sommaire du rôle_sec_1'!V41","v":105068655},{"$f":"'Sommaire du rôle_sec_1'!W41","v":5627790},null,105068655,5627790,null,110696445,null,10,1,null,{"$f":"'Sommaire du rôle_sec_1'!X41","v":105068655},{"$f":"'Sommaire du rôle_sec_1'!Y41","v":5627790},null,105068655,5627790,null,110696445,null,10,1,null,{"$f":"'Sommaire du rôle_sec_1'!Z41","v":105068655},{"$f":"'Sommaire du rôle_sec_1'!AA41","v":5627790},null,105068655,5627790,null,110696445]
["11 Cours de triage","100%",null,{"$f":"'Sommaire du rôle_sec_1'!H42","v":0},{"$f":"'Sommaire du rôle_sec_1'!I42","v":0},null,0,0,null,0,null,"11 Cours de triage","100%",null,{"$f":"'Sommaire du rôle_sec_1'!J42","v":0},{"$f":"'Sommaire du rôle_sec_1'!K42","v":0},null,0,0,null,0,null,"11 Cours de triage","100%",null,{"$f":"'Sommaire du rôle_sec_1'!L42","v":0},{"$f":"'Sommaire du rôle_sec_1'!M42","v":0},null,0,0,null,0,null,"11 Cours de triage","100%",null,{"$f":"'Sommaire du rôle_sec_1'!N42","v":0},{"$f":"'Sommaire du rôle_sec_1'!O42","v":0},null,0,0,null,0,null,"11 Cours de triage","100%",null,{"$f":"'Sommaire du rôle_sec_1'!P42","v":0},{"$f":"'Sommaire du rôle_sec_1'!Q42","v":0},null,0,0,null,0,null,"11 Cours de triage","100%",null,{"$f":"'Sommaire du rôle_sec_1'!R42","v":0},{"$f":"'Sommaire du rôle_sec_1'!S42","v":0},null,0,0,null,0,null,"11 Cours de triage","100%",null,{"$f":"'Sommaire du rôle_sec_1'!T42","v":0},{"$f":"'Sommaire du rôle_sec_1'!U42","v":0},null,0,0,null,0,null,"11 Cours de triage","100%",null,{"$f":"'Sommaire du rôle_sec_1'!V42","v":0},{"$f":"'Sommaire du rôle_sec_1'!W42","v":0},null,0,0,null,0,null,"11 Cours de triage","100%",null,{"$f":"'Sommaire du rôle_sec_1'!X42","v":0},{"$f":"'Sommaire du rôle_sec_1'!Y42","v":0},null,0,0,null,0,null,"11 Cours de triage","100%",null,{"$f":"'Sommaire du rôle_sec_1'!Z42","v":0},{"$f":"'Sommaire du rôle_sec_1'!AA42","v":0},null,0,0,null,0]
["12 CHSLD",0.2,null,{"$f":"'Sommaire du rôle_sec_1'!H43","v":0},null,null,0,null,null,0,null,"12 CHSLD",0.2,null,{"$f":"'Sommaire du rôle_sec_1'!J43","v":0},null,null,0,null,null,0,null,"12 CHSLD",0.2,null,{"$f":"'Sommaire du rôle_sec_1'!L43","v":0},null,null,0,null,null,0,null,"12 CHSLD",0.2,null,{"$f":"'Sommaire du rôle_sec_1'!N43","v":0},null,null,0,null,null,0,null,"12 CHSLD",0.2,null,{"$f":"'Sommaire du rôle_sec_1'!P43","v":0},null,null,0,null,null,0,null,"12 CHSLD",0.2,null,{"$f":"'Sommaire du rôle_sec_1'!R43","v":0},null,null,0,null,null,0,null,"12 CHSLD",0.2,null,{"$f":"'Sommaire du rôle_sec_1'!T43","v":0},null,null,0,null,null,0,null,"12 CHSLD",0.2,null,{"$f":"'Sommaire du rôle_sec_1'!V43","v":0},null,null,0,null,null,0,null,"12 CHSLD",0.2,null,{"$f":"'Sommaire du rôle_sec_1'!X43","v":0},null,null,0,null,null,0,null,"12 CHSLD",0.2,null,{"$f":"'Sommaire du rôle_sec_1'!Z43","v":0},null,null,0,null,null,0]
["13 Cours de triage 40 %","40%",null,{"$f":"'Sommaire du rôle_sec_1'!H44","v":0},null,null,0,null,null,0,null,"13 Cours de triage 40 %","40%",null,{"$f":"'Sommaire du rôle_sec_1'!J44","v":0},null,null,0,null,null,0,null,"13 Cours de triage 40 %","40%",null,{"$f":"'Sommaire du rôle_sec_1'!L44","v":0},null,null,0,null,null,0,null,"13 Cours de triage 40 %","40%",null,{"$f":"'Sommaire du rôle_sec_1'!N44","v":0},null,null,0,null,null,0,null,"13 Cours de triage 40 %","40%",null,{"$f":"'Sommaire du rôle_sec_1'!P44","v":0},null,null,0,null,null,0,null,"13 Cours de triage 40 %","40%",null,{"$f":"'Sommaire du rôle_sec_1'!R44","v":0},null,null,0,null,null,0,null,"13 Cours de triage 40 %","40%",null,{"$f":"'Sommaire du rôle_sec_1'!T44","v":0},null,null,0,null,null,0,null,"13 Cours de triage 40 %","40%",null,{"$f":"'Sommaire du rôle_sec_1'!V44","v":0},null,null,0,null,null,0,null,"13 Cours de triage 40 %","40%",null,{"$f":"'Sommaire du rôle_sec_1'!X44","v":0},null,null,0,null,null,0,null,"13 Cours de triage 40 %","40%",null,{"$f":"'Sommaire du rôle_sec_1'!Z44","v":0},null,null,0,null,null,0]
[" APPLICATION DU TNR QUAND TTVD",1,null,{"$f":"'Sommaire du rôle_sec_1'!H45","v":0},{"$f":"'Sommaire du rôle_sec_1'!I45","v":0},null,0,{"$f":"B121*E121","v":0},null,0,null," APPLICATION DU TNR QUAND TTVD",1,null,{"$f":"'Sommaire du rôle_sec_1'!J45","v":0},{"$f":"'Sommaire du rôle_sec_1'!K45","v":0},null,0,{"$f":"M121*P121","v":0},null,0,null," APPLICATION DU TNR QUAND TTVD",1,null,{"$f":"'Sommaire du rôle_sec_1'!L45","v":0},{"$f":"'Sommaire du rôle_sec_1'!M45","v":0},null,0,{"$f":"X121*AA121","v":0},null,0,null," APPLICATION DU TNR QUAND TTVD",1,null,{"$f":"'Sommaire du rôle_sec_1'!N45","v":0},{"$f":"'Sommaire du rôle_sec_1'!O45","v":0},null,0,{"$f":"AI121*AL121","v":0},null,0,null," APPLICATION DU TNR QUAND TTVD",1,null,{"$f":"'Sommaire du rôle_sec_1'!P45","v":0},{"$f":"'Sommaire du rôle_sec_1'!Q45","v":0},null,0,{"$f":"AT121*AW121","v":0},null,0,null," APPLICATION DU TNR QUAND TTVD",1,null,{"$f":"'Sommaire du rôle_sec_1'!R45","v":0},{"$f":"'Sommaire du rôle_sec_1'!S45","v":0},null,0,{"$f":"BE121*BH121","v":0},null,0,null," APPLICATION DU TNR QUAND TTVD",1,null,{"$f":"'Sommaire du rôle_sec_1'!T45","v":0},{"$f":"'Sommaire du rôle_sec_1'!U45","v":0},null,0,{"$f":"BP121*BS121","v":0},null,0,null," APPLICATION DU TNR QUAND TTVD",1,null,{"$f":"'Sommaire du rôle_sec_1'!AE45","v":0},{"$f":"'Sommaire du rôle_sec_1'!AF45","v":0},null,0,{"$f":"CA121*CD121","v":0},null,0,null," APPLICATION DU TNR QUAND TTVD",1,null,{"$f":"'Sommaire du rôle_sec_1'!X45","v":0},{"$f":"'Sommaire du rôle_sec_1'!Y45","v":0},null,0,{"$f":"CL121*CO121","v":0},null,0,null," APPLICATION DU TNR QUAND TTVD",1,null,{"$f":"'Sommaire du rôle_sec_1'!Z45","v":0},{"$f":"'Sommaire du rôle_sec_1'!AA45","v":0},null,0,{"$f":"CW121*CZ121","v":0},null,0]
["Total",null,null,null,null,null,{"$f":"SUM(G106:G121)","v":112404699.09999999},{"$f":"SUM(H106:H121)","v":25925903},null,138330602.09999999,null,"Total",null,null,null,null,null,{"$f":"SUM(R106:R121)","v":112404699.09999999},{"$f":"SUM(S106:S121)","v":25925903},null,138330602.09999999,null,"Total",null,null,null,null,null,{"$f":"SUM(AC106:AC121)","v":112404699.09999999},{"$f":"SUM(AD106:AD121)","v":25925903},null,138330602.09999999,null,"Total",null,null,null,null,null,{"$f":"SUM(AN106:AN121)","v":112404699.09999999},{"$f":"SUM(AO106:AO121)","v":25925903},null,138330602.09999999,null,"Total",null,null,null,null,null,{"$f":"SUM(AY106:AY121)","v":112404699.09999999},{"$f":"SUM(AZ106:AZ121)","v":25925903},null,138330602.09999999,null,"Total",null,null,null,null,null,{"$f":"SUM(BJ106:BJ121)","v":112404699.09999999},{"$f":"SUM(BK106:BK121)","v":25925903},null,138330602.09999999,null,"Total",null,null,null,null,null,{"$f":"SUM(BU106:BU121)","v":112404699.09999999},{"$f":"SUM(BV106:BV121)","v":25925903},null,138330602.09999999,null,"Total",null,null,null,null,null,{"$f":"SUM(CF106:CF121)","v":112404699.09999999},{"$f":"SUM(CG106:CG121)","v":25925903},null,138330602.09999999,null,"Total",null,null,null,null,null,{"$f":"SUM(CQ106:CQ121)","v":112404699.09999999},{"$f":"SUM(CR106:CR121)","v":25925903},null,138330602.09999999,null,"Total",null,null,null,null,null,{"$f":"SUM(DB106:DB121)","v":112404699.09999999},{"$f":"SUM(DC106:DC121)","v":25925903},null,138330602.09999999]
[]
["ASSIETTE SOUS-CATÉGORIE RÉSIDUELLE"]
["Classe non résidentielle","Pourcentage de taxation",null,"VALEUR À 100 %"]
[null,null,null,"  Imposables","Compensables",null,"Imposables pondérées","Compensables pondérées",null,"Total"]
[null,"(1)",null,"(2)","(3)",null,"(4) = (1) X (2)","(5) = (1) X (3)",null,"(6) = (4) + (5)"]
[" 1A",0.999,null,{"$f":"'Sommaire du rôle_sec_1'!F53","v":6957650},{"$f":"'Sommaire du rôle_sec_1'!G53","v":0},null,{"$f":"D128*B128","v":6950692.3499999996},{"$f":"B128*E128","v":0},null,{"$f":"G128+H128","v":6950692.3499999996},2359638]
[" 1B",0.995,null,{"$f":"'Sommaire du rôle_sec_1'!F54","v":3155670},{"$f":"'Sommaire du rôle_sec_1'!G54","v":0},null,3139891.65,0,null,3139891.65,670132.5]
[" 1C",0.99,null,{"$f":"'Sommaire du rôle_sec_1'!F55","v":444950},{"$f":"'Sommaire du rôle_sec_1'!G55","v":0},null,440500.5,0,null,440500.5,4405005]
[2,0.97,null,{"$f":"'Sommaire du rôle_sec_1'!F56","v":2146970},{"$f":"'Sommaire du rôle_sec_1'!G56","v":0},null,2082560.9,0,null,2082560.9,21413332]
[3,0.94,null,{"$f":"'Sommaire du rôle_sec_1'!F57","v":4013950},{"$f":"'Sommaire du rôle_sec_1'!G57","v":0},null,3773113,0,null,3773113,36190282]
[4,0.88,null,{"$f":"'Sommaire du rôle_sec_1'!F58","v":5477860},{"$f":"'Sommaire du rôle_sec_1'!G58","v":0},null,4820516.8,0,null,4820516.8,27846104]
[5,0.78,null,{"$f":"'Sommaire du rôle_sec_1'!F59","v":3513090},{"$f":"'Sommaire du rôle_sec_1'!G59","v":0},null,2740210.2,0,null,2740210.2,22550424]
[6,0.6,null,{"$f":"'Sommaire du rôle_sec_1'!F60","v":3502990},{"$f":"'Sommaire du rôle_sec_1'!G60","v":0},null,2101794,0,null,2101794,19039560]
[7,0.4,null,{"$f":"'Sommaire du rôle_sec_1'!F61","v":3597215},{"$f":"'Sommaire du rôle_sec_1'!G61","v":6579670},null,1438886,2631868,null,4070754,37782600]
[8,0.15000000000000002,null,{"$f":"'Sommaire du rôle_sec_1'!F62","v":2029370},{"$f":"'Sommaire du rôle_sec_1'!G62","v":19235660},null,304405.50000000006,2885349.0000000005,null,3189754.5000000005,32037030.000000004]
["IMMEUBLES SANS PARTIE NON RÉSIDENTIELLE",1,null,{"$f":"'Sommaire du rôle_sec_1'!F63","v":733457532.81818187},{"$f":"'Sommaire du rôle_sec_1'!G63","v":190980},null,733457532.81818187,190980,null,733648512.81818187,7336485128]
["12  CHSLD",0.8,null,{"$f":"'Sommaire du rôle_sec_1'!F64","v":13938200},{"$f":"'Sommaire du rôle_sec_1'!G64","v":0},null,11150560]
["13 Cours de triage ",0.6,null,{"$f":"'Sommaire du rôle_sec_1'!F65","v":0},{"$f":"'Sommaire du rôle_sec_1'!G65","v":0},null,0]
["Total",null,null,null,null,null,{"$f":"SUM(G128:G140)","v":772400663.71818185},{"$f":"SUM(H128:H138)","v":5708197},{"$f":"SUM(I128:I138)","v":0},{"$f":"G141+H141","v":778108860.71818185}]
[]
["ASSIETTE AU TAUX RÉSIDENTIEL SOUS-CATÉGORIE 1",null,null,null,null,null,null,null,null,null,null,"ASSIETTE AU TAUX RÉSIDENTIEL SOUS-CATÉGORIE 2",null,null,null,null,null,null,null,null,null,null,"ASSIETTE AU TAUX RÉSIDENTIEL SOUS-CATÉGORIE 3",null,null,null,null,null,null,null,null,null,null,"ASSIETTE AU TAUX RÉSIDENTIEL SOUS-CATÉGORIE 4",null,null,null,null,null,null,null,null,null,null,"ASSIETTE AU TAUX RÉSIDENTIEL SOUS-CATÉGORIE 5",null,null,null,null,null,null,null,null,null,null,"ASSIETTE AU TAUX RÉSIDENTIEL SOUS-CATÉGORIE 6",null,null,null,null,null,null,null,null,null,null,"ASSIETTE AU TAUX RÉSIDENTIEL SOUS-CATÉGORIE 7",null,null,null,null,null,null,null,null,null,null,"ASSIETTE AU TAUX RÉSIDENTIEL SOUS-CATÉGORIE 8",null,null,null,null,null,null,null,null,null,null,"ASSIETTE AU TAUX RÉSIDENTIEL SOUS-CATÉGORIE 9",null,null,null,null,null,null,null,null,null,null,"ASSIETTE AU TAUX RÉSIDENTIEL SOUS-CATÉGORIE 10"]
["Classe non résidentielle","Pourcentage de taxation",null,"VALEUR À 100 %",null,null,null,null,null,null,null,"Classe non résidentielle","Pourcentage de taxation",null,"VALEUR À 100 %",null,null,null,null,null,null,null,"Classe non résidentielle","Pourcentage de taxation",null,"VALEUR À 100 %",null,null,null,null,null,null,null,"Classe non résidentielle","Pourcentage de taxation",null,"VALEUR À 100 %",null,null,null,null,null,null,null,"Classe non résidentielle","Pourcentage de taxation",null,"VALEUR À 100 %",null,null,null,null,null,null,null,"Classe non résidentielle","Pourcentage de taxation",null,"VALEUR À 100 %",null,null,null,null,null,null,null,"Classe non résidentielle","Pourcentage de taxation",null,"VALEUR À 100 %",null,null,null,null,null,null,null,"Classe non résidentielle","Pourcentage de taxation",null,"VALEUR À 100 %",null,null,null,null,null,null,null,"Classe non résidentielle","Pourcentage de taxation",null,"VALEUR À 100 %",null,null,null,null,null,null,null,"Classe non résidentielle","Pourcentage de taxation",null,"VALEUR À 100 %"]
[null,null,null,"  Imposables","Compensables",null,"Imposables pondérées","Compensables pondérées",null,"Total",null,null,null,null,"  Imposables","Compensables",null,"Imposables pondérées","Compensables pondérées",null,"Total",null,null,null,null,"  Imposables","Compensables",null,"Imposables pondérées","Compensables pondérées",null,"Total",null,null,null,null,"  Imposables","Compensables",null,"Imposables pondérées","Compensables pondérées",null,"Total",null,null,null,null,"  Imposables","Compensables",null,"Imposables pondérées","Compensables pondérées",null,"Total",null,null,null,null,"  Imposables","Compensables",null,"Imposables pondérées","Compensables pondérées",null,"Total",null,null,null,null,"  Imposables","Compensables",null,"Imposables pondérées","Compensables pondérées",null,"Total",null,null,null,null,"  Imposables","Compensables",null,"Imposables pondérées","Compensables pondérées",null,"Total",null,null,null,null,"  Imposables","Compensables",null,"Imposables pondérées","Compensables pondérées",null,"Total",null,null,null,null,"  Imposables","Compensables",null,"Imposables pondérées","Compensables pondérées",null,"Total"]
[null,"(1)",null,"(2)","(3)",null,"(4) = (1) X (2)","(5) = (1) X (3)",null,"(6) = (4) + (5)",null,null,"(1)",null,"(2)","(3)",null,"(4) = (1) X (2)","(5) = (1) X (3)",null,"(6) = (4) + (5)",null,null,"(1)",null,"(2)","(3)",null,"(4) = (1) X (2)","(5) = (1) X (3)",null,"(6) = (4) + (5)",null,null,"(1)",null,"(2)","(3)",null,"(4) = (1) X (2)","(5) = (1) X (3)",null,"(6) = (4) + (5)",null,null,"(1)",null,"(2)","(3)",null,"(4) = (1) X (2)","(5) = (1) X (3)",null,"(6) = (4) + (5)",null,null,"(1)",null,"(2)","(3)",null,"(4) = (1) X (2)","(5) = (1) X (3)",null,"(6) = (4) + (5)",null,null,"(1)",null,"(2)","(3)",null,"(4) = (1) X (2)","(5) = (1) X (3)",null,"(6) = (4) + (5)",null,null,"(1)",null,"(2)","(3)",null,"(4) = (1) X (2)","(5) = (1) X (3)",null,"(6) = (4) + (5)",null,null,"(1)",null,"(2)","(3)",null,"(4) = (1) X (2)","(5) = (1) X (3)",null,"(6) = (4) + (5)",null,null,"(1)",null,"(2)","(3)",null,"(4) = (1) X (2)","(5) = (1) X (3)",null,"(6) = (4) + (5)"]
[" 1A",0.999,null,{"$f":"'Sommaire du rôle_sec_1'!H53","v":6957650},{"$f":"'Sommaire du rôle_sec_1'!I53","v":0},null,{"$f":"D147*B147","v":6950692.3499999996},{"$f":"B147*E147","v":0},null,{"$f":"G147+H147","v":6950692.3499999996},null," 1A",0.999,null,{"$f":"'Sommaire du rôle_sec_1'!J53","v":6957650},{"$f":"'Sommaire du rôle_sec_1'!K53","v":0},null,{"$f":"O147*M147","v":6950692.3499999996},{"$f":"M147*P147","v":0},null,{"$f":"R147+S147","v":6950692.3499999996},null," 1A",0.999,null,{"$f":"'Sommaire du rôle_sec_1'!L53","v":6957650},{"$f":"'Sommaire du rôle_sec_1'!M53","v":0},null,{"$f":"Z147*X147","v":6950692.3499999996},{"$f":"X147*AA147","v":0},null,{"$f":"AC147+AD147","v":6950692.3499999996},null," 1A",0.999,null,{"$f":"'Sommaire du rôle_sec_1'!N53","v":6957650},{"$f":"'Sommaire du rôle_sec_1'!O53","v":0},null,{"$f":"AK147*AI147","v":6950692.3499999996},{"$f":"AI147*AL147","v":0},null,{"$f":"AN147+AO147","v":6950692.3499999996},null," 1A",0.999,null,{"$f":"'Sommaire du rôle_sec_1'!P53","v":6957650},{"$f":"'Sommaire du rôle_sec_1'!Q53","v":0},null,{"$f":"AV147*AT147","v":6950692.3499999996},{"$f":"AT147*AW147","v":0},null,{"$f":"AY147+AZ147","v":6950692.3499999996},null," 1A",0.999,null,{"$f":"'Sommaire du rôle_sec_1'!R53","v":6957650},{"$f":"'Sommaire du rôle_sec_1'!S53","v":0},null,{"$f":"BG147*BE147","v":6950692.3499999996},{"$f":"BE147*BH147","v":0},null,{"$f":"BJ147+BK147","v":6950692.3499999996},null," 1A",0.999,null,{"$f":"'Sommaire du rôle_sec_1'!T53","v":6957650},{"$f":"'Sommaire du rôle_sec_1'!U53","v":0},null,{"$f":"BR147*BP147","v":6950692.3499999996},{"$f":"BP147*BS147","v":0},null,{"$f":"BU147+BV147","v":6950692.3499999996},null," 1A",0.999,null,{"$f":"'Sommaire du rôle_sec_1'!V53","v":6957650},{"$f":"'Sommaire du rôle_sec_1'!W53","v":0},null,{"$f":"CC147*CA147","v":6950692.3499999996},{"$f":"CA147*CD147","v":0},null,{"$f":"CF147+CG147","v":6950692.3499999996},null," 1A",0.999,null,{"$f":"'Sommaire du rôle_sec_1'!X53","v":6957650},{"$f":"'Sommaire du rôle_sec_1'!Y53","v":0},null,{"$f":"CN147*CL147","v":6950692.3499999996},{"$f":"CL147*CO147","v":0},null,{"$f":"CQ147+CR147","v":6950692.3499999996},null," 1A",0.999,null,{"$f":"'Sommaire du rôle_sec_1'!Z53","v":6957650},{"$f":"'Sommaire du rôle_sec_1'!AA53","v":0},null,{"$f":"CY147*CW147","v":6950692.3499999996},{"$f":"CW147*CZ147","v":0},null,{"$f":"DB147+DC147","v":6950692.3499999996}]
[" 1B",0.995,null,{"$f":"'Sommaire du rôle_sec_1'!H54","v":3155670},{"$f":"'Sommaire du rôle_sec_1'!I54","v":0},null,3139891.65,0,null,3139891.65,null," 1B",0.995,null,{"$f":"'Sommaire du rôle_sec_1'!J54","v":3155670},{"$f":"'Sommaire du rôle_sec_1'!K54","v":0},null,3139891.65,0,null,3139891.65,null," 1B",0.995,null,{"$f":"'Sommaire du rôle_sec_1'!L54","v":3155670},{"$f":"'Sommaire du rôle_sec_1'!M54","v":0},null,3139891.65,0,null,3139891.65,null," 1B",0.995,null,{"$f":"'Sommaire du rôle_sec_1'!N54","v":3155670},{"$f":"'Sommaire du rôle_sec_1'!O54","v":0},null,3139891.65,0,null,3139891.65,null," 1B",0.995,null,{"$f":"'Sommaire du rôle_sec_1'!P54","v":3155670},{"$f":"'Sommaire du rôle_sec_1'!Q54","v":0},null,3139891.65,0,null,3139891.65,null," 1B",0.995,null,{"$f":"'Sommaire du rôle_sec_1'!R54","v":3155670},{"$f":"'Sommaire du rôle_sec_1'!S54","v":0},null,3139891.65,0,null,3139891.65,null," 1B",0.995,null,{"$f":"'Sommaire du rôle_sec_1'!T54","v":3155670},{"$f":"'Sommaire du rôle_sec_1'!U54","v":0},null,3139891.65,0,null,3139891.65,null," 1B",0.995,null,{"$f":"'Sommaire du rôle_sec_1'!V54","v":3155670},{"$f":"'Sommaire du rôle_sec_1'!W54","v":0},null,3139891.65,0,null,3139891.65,null," 1B",0.995,null,{"$f":"'Sommaire du rôle_sec_1'!X54","v":3155670},{"$f":"'Sommaire du rôle_sec_1'!Y54","v":0},null,3139891.65,0,null,3139891.65,null," 1B",0.995,null,{"$f":"'Sommaire du rôle_sec_1'!Z54","v":3155670},{"$f":"'Sommaire du rôle_sec_1'!AA54","v":0},null,3139891.65,0,null,3139891.65]
[" 1C",0.99,null,{"$f":"'Sommaire du rôle_sec_1'!H55","v":444950},{"$f":"'Sommaire du rôle_sec_1'!I55","v":0},null,440500.5,0,null,440500.5,null," 1C",0.99,null,{"$f":"'Sommaire du rôle_sec_1'!J55","v":444950},{"$f":"'Sommaire du rôle_sec_1'!K55","v":0},null,440500.5,0,null,440500.5,null," 1C",0.99,null,{"$f":"'Sommaire du rôle_sec_1'!L55","v":444950},{"$f":"'Sommaire du rôle_sec_1'!M55","v":0},null,440500.5,0,null,440500.5,null," 1C",0.99,null,{"$f":"'Sommaire du rôle_sec_1'!N55","v":444950},{"$f":"'Sommaire du rôle_sec_1'!O55","v":0},null,440500.5,0,null,440500.5,null," 1C",0.99,null,{"$f":"'Sommaire du rôle_sec_1'!P55","v":444950},{"$f":"'Sommaire du rôle_sec_1'!Q55","v":0},null,440500.5,0,null,440500.5,null," 1C",0.99,null,{"$f":"'Sommaire du rôle_sec_1'!R55","v":444950},{"$f":"'Sommaire du rôle_sec_1'!S55","v":0},null,440500.5,0,null,440500.5,null," 1C",0.99,null,{"$f":"'Sommaire du rôle_sec_1'!T55","v":444950},{"$f":"'Sommaire du rôle_sec_1'!U55","v":0},null,440500.5,0,null,440500.5,null," 1C",0.99,null,{"$f":"'Sommaire du rôle_sec_1'!V55","v":444950},{"$f":"'Sommaire du rôle_sec_1'!W55","v":0},null,440500.5,0,null,440500.5,null," 1C",0.99,null,{"$f":"'Sommaire du rôle_sec_1'!X55","v":444950},{"$f":"'Sommaire du rôle_sec_1'!Y55","v":0},null,440500.5,0,null,440500.5,null," 1C",0.99,null,{"$f":"'Sommaire du rôle_sec_1'!Z55","v":444950},{"$f":"'Sommaire du rôle_sec_1'!AA55","v":0},null,440500.5,0,null,440500.5]
[2,0.97,null,{"$f":"'Sommaire du rôle_sec_1'!H56","v":2146970},{"$f":"'Sommaire du rôle_sec_1'!I56","v":0},null,2082560.9,0,null,2082560.9,null,2,0.97,null,{"$f":"'Sommaire du rôle_sec_1'!J56","v":2146970},{"$f":"'Sommaire du rôle_sec_1'!K56","v":0},null,2082560.9,0,null,2082560.9,null,2,0.97,null,{"$f":"'Sommaire du rôle_sec_1'!L56","v":2146970},{"$f":"'Sommaire du rôle_sec_1'!M56","v":0},null,2082560.9,0,null,2082560.9,null,2,0.97,null,{"$f":"'Sommaire du rôle_sec_1'!N56","v":2146970},{"$f":"'Sommaire du rôle_sec_1'!O56","v":0},null,2082560.9,0,null,2082560.9,null,2,0.97,null,{"$f":"'Sommaire du rôle_sec_1'!P56","v":2146970},{"$f":"'Sommaire du rôle_sec_1'!Q56","v":0},null,2082560.9,0,null,2082560.9,null,2,0.97,null,{"$f":"'Sommaire du rôle_sec_1'!R56","v":2146970},{"$f":"'Sommaire du rôle_sec_1'!S56","v":0},null,2082560.9,0,null,2082560.9,null,2,0.97,null,{"$f":"'Sommaire du rôle_sec_1'!T56","v":2146970},{"$f":"'Sommaire du rôle_sec_1'!U56","v":0},null,2082560.9,0,null,2082560.9,null,2,0.97,null,{"$f":"'Sommaire du rôle_sec_1'!V56","v":2146970},{"$f":"'Sommaire du rôle_sec_1'!W56","v":0},null,2082560.9,0,null,2082560.9,null,2,0.97,null,{"$f":"'Sommaire du rôle_sec_1'!X56","v":2146970},{"$f":"'Sommaire du rôle_sec_1'!Y56","v":0},null,2082560.9,0,null,2082560.9,null,2,0.97,null,{"$f":"'Sommaire du rôle_sec_1'!Z56","v":2146970},{"$f":"'Sommaire du rôle_sec_1'!AA56","v":0},null,2082560.9,0,null,2082560.9]
[3,0.94,null,{"$f":"'Sommaire du rôle_sec_1'!H57","v":4013950},{"$f":"'Sommaire du rôle_sec_1'!I57","v":0},null,3773113,0,null,3773113,null,3,0.94,null,{"$f":"'Sommaire du rôle_sec_1'!J57","v":4013950},{"$f":"'Sommaire du rôle_sec_1'!K57","v":0},null,3773113,0,null,3773113,null,3,0.94,null,{"$f":"'Sommaire du rôle_sec_1'!L57","v":4013950},{"$f":"'Sommaire du rôle_sec_1'!M57","v":0},null,3773113,0,null,3773113,null,3,0.94,null,{"$f":"'Sommaire du rôle_sec_1'!N57","v":4013950},{"$f":"'Sommaire du rôle_sec_1'!O57","v":0},null,3773113,0,null,3773113,null,3,0.94,null,{"$f":"'Sommaire du rôle_sec_1'!P57","v":4013950},{"$f":"'Sommaire du rôle_sec_1'!Q57","v":0},null,3773113,0,null,3773113,null,3,0.94,null,{"$f":"'Sommaire du rôle_sec_1'!R57","v":4013950},{"$f":"'Sommaire du rôle_sec_1'!S57","v":0},null,3773113,0,null,3773113,null,3,0.94,null,{"$f":"'Sommaire du rôle_sec_1'!T57","v":4013950},{"$f":"'Sommaire du rôle_sec_1'!U57","v":0},null,3773113,0,null,3773113,null,3,0.94,null,{"$f":"'Sommaire du rôle_sec_1'!V57","v":4013950},{"$f":"'Sommaire du rôle_sec_1'!W57","v":0},null,3773113,0,null,3773113,null,3,0.94,null,{"$f":"'Sommaire du rôle_sec_1'!X57","v":4013950},{"$f":"'Sommaire du rôle_sec_1'!Y57","v":0},null,3773113,0,null,3773113,null,3,0.94,null,{"$f":"'Sommaire du rôle_sec_1'!Z57","v":4013950},{"$f":"'Sommaire du rôle_sec_1'!AA57","v":0},null,3773113,0,null,3773113]
[4,0.88,null,{"$f":"'Sommaire du rôle_sec_1'!H58","v":5477860},{"$f":"'Sommaire du rôle_sec_1'!I58","v":0},null,4820516.8,0,null,4820516.8,null,4,0.88,null,{"$f":"'Sommaire du rôle_sec_1'!J58","v":5477860},{"$f":"'Sommaire du rôle_sec_1'!K58","v":0},null,4820516.8,0,null,4820516.8,null,4,0.88,null,{"$f":"'Sommaire du rôle_sec_1'!L58","v":5477860},{"$f":"'Sommaire du rôle_sec_1'!M58","v":0},null,4820516.8,0,null,4820516.8,null,4,0.88,null,{"$f":"'Sommaire du rôle_sec_1'!N58","v":5477860},{"$f":"'Sommaire du rôle_sec_1'!O58","v":0},null,4820516.8,0,null,4820516.8,null,4,0.88,null,{"$f":"'Sommaire du rôle_sec_1'!P58","v":5477860},{"$f":"'Sommaire du rôle_sec_1'!Q58","v":0},null,4820516.8,0,null,4820516.8,null,4,0.88,null,{"$f":"'Sommaire du rôle_sec_1'!R58","v":5477860},{"$f":"'Sommaire du rôle_sec_1'!S58","v":0},null,4820516.8,0,null,4820516.8,null,4,0.88,null,{"$f":"'Sommaire du rôle_sec_1'!T58","v":5477860},{"$f":"'Sommaire du rôle_sec_1'!U58","v":0},null,4820516.8,0,null,4820516.8,null,4,0.88,null,{"$f":"'Sommaire du rôle_sec_1'!V58","v":5477860},{"$f":"'Sommaire du rôle_sec_1'!W58","v":0},null,4820516.8,0,null,4820516.8,null,4,0.88,null,{"$f":"'Sommaire du rôle_sec_1'!X58","v":5477860},{"$f":"'Sommaire du rôle_sec_1'!Y58","v":0},null,4820516.8,0,null,4820516.8,null,4,0.88,null,{"$f":"'Sommaire du rôle_sec_1'!Z58","v":5477860},{"$f":"'Sommaire du rôle_sec_1'!AA58","v":0},null,4820516.8,0,null,4820516.8]
[5,0.78,null,{"$f":"'Sommaire du rôle_sec_1'!H59","v":3513090},{"$f":"'Sommaire du rôle_sec_1'!I59","v":0},null,2740210.2,0,null,2740210.2,null,5,0.78,null,{"$f":"'Sommaire du rôle_sec_1'!J59","v":3513090},{"$f":"'Sommaire du rôle_sec_1'!K59","v":0},null,2740210.2,0,null,2740210.2,null,5,0.78,null,{"$f":"'Sommaire du rôle_sec_1'!L59","v":3513090},{"$f":"'Sommaire du rôle_sec_1'!M59","v":0},null,2740210.2,0,null,2740210.2,null,5,0.78,null,{"$f":"'Sommaire du rôle_sec_1'!N59","v":3513090},{"$f":"'Sommaire du rôle_sec_1'!O59","v":0},null,2740210.2,0,null,2740210.2,null,5,0.78,null,{"$f":"'Sommaire du rôle_sec_1'!P59","v":3513090},{"$f":"'Sommaire du rôle_sec_1'!Q59","v":0},null,2740210.2,0,null,2740210.2,null,5,0.78,null,{"$f":"'Sommaire du rôle_sec_1'!R59","v":3513090},{"$f":"'Sommaire du rôle_sec_1'!S59","v":0},null,2740210.2,0,null,2740210.2,null,5,0.78,null,{"$f":"'Sommaire du rôle_sec_1'!T59","v":3513090},{"$f":"'Sommaire du rôle_sec_1'!U59","v":0},null,2740210.2,0,null,2740210.2,null,5,0.78,null,{"$f":"'Sommaire du rôle_sec_1'!V59","v":3513090},{"$f":"'Sommaire du rôle_sec_1'!W59","v":0},null,2740210.2,0,null,2740210.2,null,5,0.78,null,{"$f":"'Sommaire du rôle_sec_1'!X59","v":3513090},{"$f":"'Sommaire du rôle_sec_1'!Y59","v":0},null,2740210.2,0,null,2740210.2,null,5,0.78,null,{"$f":"'Sommaire du rôle_sec_1'!Z59","v":3513090},{"$f":"'Sommaire du rôle_sec_1'!AA59","v":0},null,2740210.2,0,null,2740210.2]
[6,0.6,null,{"$f":"'Sommaire du rôle_sec_1'!H60","v":3502990},{"$f":"'Sommaire du rôle_sec_1'!I60","v":0},null,2101794,0,null,2101794,null,6,0.6,null,{"$f":"'Sommaire du rôle_sec_1'!J60","v":3502990},{"$f":"'Sommaire du rôle_sec_1'!K60","v":0},null,2101794,0,null,2101794,null,6,0.6,null,{"$f":"'Sommaire du rôle_sec_1'!L60","v":3502990},{"$f":"'Sommaire du rôle_sec_1'!M60","v":0},null,2101794,0,null,2101794,null,6,0.6,null,{"$f":"'Sommaire du rôle_sec_1'!N60","v":3502990},{"$f":"'Sommaire du rôle_sec_1'!O60","v":0},null,2101794,0,null,2101794,null,6,0.6,null,{"$f":"'Sommaire du rôle_sec_1'!P60","v":3502990},{"$f":"'Sommaire du rôle_sec_1'!Q60","v":0},null,2101794,0,null,2101794,null,6,0.6,null,{"$f":"'Sommaire du rôle_sec_1'!R60","v":3502990},{"$f":"'Sommaire du rôle_sec_1'!S60","v":0},null,2101794,0,null,2101794,null,6,0.6,null,{"$f":"'Sommaire du rôle_sec_1'!T60","v":3502990},{"$f":"'Sommaire du rôle_sec_1'!U60","v":0},null,2101794,0,null,2101794,null,6,0.6,null,{"$f":"'Sommaire du rôle_sec_1'!V60","v":3502990},{"$f":"'Sommaire du rôle_sec_1'!W60","v":0},null,2101794,0,null,2101794,null,6,0.6,null,{"$f":"'Sommaire du rôle_sec_1'!X60","v":3502990},{"$f":"'Sommaire du rôle_sec_1'!Y60","v":0},null,2101794,0,null,2101794,null,6,0.6,null,{"$f":"'Sommaire du rôle_sec_1'!Z60","v":3502990},{"$f":"'Sommaire du rôle_sec_1'!AA60","v":0},null,2101794,0,null,2101794]
[7,0.4,null,{"$f":"'Sommaire du rôle_sec_1'!H61","v":3597215},{"$f":"'Sommaire du rôle_sec_1'!I61","v":6579670},null,1438886,2631868,null,4070754,null,7,0.4,null,{"$f":"'Sommaire du rôle_sec_1'!J61","v":3597215},{"$f":"'Sommaire du rôle_sec_1'!K61","v":6579670},null,1438886,2631868,null,4070754,null,7,0.4,null,{"$f":"'Sommaire du rôle_sec_1'!L61","v":3597215},{"$f":"'Sommaire du rôle_sec_1'!M61","v":6579670},null,1438886,2631868,null,4070754,null,7,0.4,null,{"$f":"'Sommaire du rôle_sec_1'!N61","v":3597215},{"$f":"'Sommaire du rôle_sec_1'!O61","v":6579670},null,1438886,2631868,null,4070754,null,7,0.4,null,{"$f":"'Sommaire du rôle_sec_1'!P61","v":3597215},{"$f":"'Sommaire du rôle_sec_1'!Q61","v":6579670},null,1438886,2631868,null,4070754,null,7,0.4,null,{"$f":"'Sommaire du rôle_sec_1'!R61","v":3597215},{"$f":"'Sommaire du rôle_sec_1'!S61","v":6579670},null,1438886,2631868,null,4070754,null,7,0.4,null,{"$f":"'Sommaire du rôle_sec_1'!T61","v":3597215},{"$f":"'Sommaire du rôle_sec_1'!U61","v":6579670},null,1438886,2631868,null,4070754,null,7,0.4,null,{"$f":"'Sommaire du rôle_sec_1'!V61","v":3597215},{"$f":"'Sommaire du rôle_sec_1'!W61","v":6579670},null,1438886,2631868,null,4070754,null,7,0.4,null,{"$f":"'Sommaire du rôle_sec_1'!X61","v":3597215},{"$f":"'Sommaire du rôle_sec_1'!Y61","v":6579670},null,1438886,2631868,null,4070754,null,7,0.4,null,{"$f":"'Sommaire du rôle_sec_1'!Z61","v":3597215},{"$f":"'Sommaire du rôle_sec_1'!AA61","v":6579670},null,1438886,2631868,null,4070754]
[8,0.15000000000000002,null,{"$f":"'Sommaire du rôle_sec_1'!H62","v":2029370},{"$f":"'Sommaire du rôle_sec_1'!I62","v":19235660},null,304405.50000000006,2885349.0000000005,null,3189754.5000000005,null,8,0.15000000000000002,null,{"$f":"'Sommaire du rôle_sec_1'!J62","v":2029370},{"$f":"'Sommaire du rôle_sec_1'!K62","v":19235660},null,304405.50000000006,2885349.0000000005,null,3189754.5000000005,null,8,0.15000000000000002,null,{"$f":"'Sommaire du rôle_sec_1'!L62","v":2029370},{"$f":"'Sommaire du rôle_sec_1'!M62","v":19235660},null,304405.50000000006,2885349.0000000005,null,3189754.5000000005,null,8,0.15000000000000002,null,{"$f":"'Sommaire du rôle_sec_1'!N62","v":2029370},{"$f":"'Sommaire du rôle_sec_1'!O62","v":19235660},null,304405.50000000006,2885349.0000000005,null,3189754.5000000005,null,8,0.15000000000000002,null,{"$f":"'Sommaire du rôle_sec_1'!P62","v":2029370},{"$f":"'Sommaire du rôle_sec_1'!Q62","v":19235660},null,304405.50000000006,2885349.0000000005,null,3189754.5000000005,null,8,0.15000000000000002,null,{"$f":"'Sommaire du rôle_sec_1'!R62","v":2029370},{"$f":"'Sommaire du rôle_sec_1'!S62","v":19235660},null,304405.50000000006,2885349.0000000005,null,3189754.5000000005,null,8,0.15000000000000002,null,{"$f":"'Sommaire du rôle_sec_1'!T62","v":2029370},{"$f":"'Sommaire du rôle_sec_1'!U62","v":19235660},null,304405.50000000006,2885349.0000000005,null,3189754.5000000005,null,8,0.15000000000000002,null,{"$f":"'Sommaire du rôle_sec_1'!V62","v":2029370},{"$f":"'Sommaire du rôle_sec_1'!W62","v":19235660},null,304405.50000000006,2885349.0000000005,null,3189754.5000000005,null,8,0.15000000000000002,null,{"$f":"'Sommaire du rôle_sec_1'!X62","v":2029370},{"$f":"'Sommaire du rôle_sec_1'!Y62","v":19235660},null,304405.50000000006,2885349.0000000005,null,3189754.5000000005,null,8,0.15000000000000002,null,{"$f":"'Sommaire du rôle_sec_1'!Z62","v":2029370},{"$f":"'Sommaire du rôle_sec_1'!AA62","v":19235660},null,304405.50000000006,2885349.0000000005,null,3189754.5000000005]
["IMMEUBLES SANS PARTIE NON RÉSIDENTIELLE",1,null,{"$f":"'Sommaire du rôle_sec_1'!H63","v":733457532.81818187},{"$f":"'Sommaire du rôle_sec_1'!I63","v":190980},null,733457532.81818187,190980,null,733648512.81818187,null,"IMMEUBLES SANS PARTIE NON RÉSIDENTIELLE",1,null,{"$f":"'Sommaire du rôle_sec_1'!J63","v":733457532.81818187},{"$f":"'Sommaire du rôle_sec_1'!K63","v":190980},null,733457532.81818187,190980,null,733648512.81818187,null,"IMMEUBLES SANS PARTIE NON RÉSIDENTIELLE",1,null,{"$f":"'Sommaire du rôle_sec_1'!L63","v":733457532.81818187},{"$f":"'Sommaire du rôle_sec_1'!M63","v":190980},null,733457532.81818187,190980,null,733648512.81818187,null,"IMMEUBLES SANS PARTIE NON RÉSIDENTIELLE",1,null,{"$f":"'Sommaire du rôle_sec_1'!N63","v":733457532.81818187},{"$f":"'Sommaire du rôle_sec_1'!O63","v":190980},null,733457532.81818187,190980,null,733648512.81818187,null,"IMMEUBLES SANS PARTIE NON RÉSIDENTIELLE",1,null,{"$f":"'Sommaire du rôle_sec_1'!P63","v":733457532.81818187},{"$f":"'Sommaire du rôle_sec_1'!Q63","v":190980},null,733457532.81818187,190980,null,733648512.81818187,null,"IMMEUBLES SANS PARTIE NON RÉSIDENTIELLE",1,null,{"$f":"'Sommaire du rôle_sec_1'!R63","v":733457532.81818187},{"$f":"'Sommaire du rôle_sec_1'!S63","v":190980},null,733457532.81818187,190980,null,733648512.81818187,null,"IMMEUBLES SANS PARTIE NON RÉSIDENTIELLE",1,null,{"$f":"'Sommaire du rôle_sec_1'!T63","v":733457532.81818187},{"$f":"'Sommaire du rôle_sec_1'!U63","v":190980},null,733457532.81818187,190980,null,733648512.81818187,null,"IMMEUBLES SANS PARTIE NON RÉSIDENTIELLE",1,null,{"$f":"'Sommaire du rôle_sec_1'!V63","v":733457532.81818187},{"$f":"'Sommaire du rôle_sec_1'!W63","v":190980},null,733457532.81818187,190980,null,733648512.81818187,null,"IMMEUBLES SANS PARTIE NON RÉSIDENTIELLE",1,null,{"$f":"'Sommaire du rôle_sec_1'!X63","v":733457532.81818187},{"$f":"'Sommaire du rôle_sec_1'!Y63","v":190980},null,733457532.81818187,190980,null,733648512.81818187,null,"IMMEUBLES SANS PARTIE NON RÉSIDENTIELLE",1,null,{"$f":"'Sommaire du rôle_sec_1'!Z63","v":733457532.81818187},{"$f":"'Sommaire du rôle_sec_1'!AA63","v":190980},null,733457532.81818187,190980,null,733648512.81818187]
["12  CHSLD",0.8,null,null,null,null,0,null,null,null,null,"12  CHSLD",0.8,null,null,null,null,0,null,null,null,null,"12  CHSLD",0.8,null,null,null,null,0,null,null,null,null,"12  CHSLD",0.8,null,null,null,null,0,null,null,null,null,"12  CHSLD",0.8,null,null,null,null,0,null,null,null,null,"12  CHSLD",0.8,null,null,null,null,0,null,null,null,null,"12  CHSLD",0.8,null,null,null,null,0,null,null,null,null,"12  CHSLD",0.8,null,null,null,null,0,null,null,null,null,"12  CHSLD",0.8,null,null,null,null,null,null,null,null,null,"12  CHSLD",0.8]
["13 Cours de triage ",0.6,null,null,null,null,0,null,null,null,null,"13 Cours de triage ",0.6,null,null,null,null,0,null,null,null,null,"13 Cours de triage ",0.6,null,null,null,null,0,null,null,null,null,"13 Cours de triage ",0.6,null,null,null,null,0,null,null,null,null,"13 Cours de triage ",0.6,null,null,null,null,0,null,null,null,null,"13 Cours de triage ",0.6,null,null,null,null,0,null,null,null,null,"13 Cours de triage ",0.6,null,null,null,null,0,null,null,null,null,"13 Cours de triage ",0.6,null,null,null,null,0,null,null,null,null,"13 Cours de triage ",0.6,null,null,null,null,null,null,null,null,null,"13 Cours de triage ",0.6]
["Total",null,null,null,null,null,{"$f":"SUM(G147:G159)","v":761250103.71818185},{"$f":"SUM(H147:H157)","v":5708197},{"$f":"SUM(I147:I157)","v":0},{"$f":"G160+H160","v":766958300.71818185},null,"Total",null,null,null,null,null,{"$f":"SUM(R147:R159)","v":761250103.71818185},{"$f":"SUM(S147:S157)","v":5708197},null,{"$f":"R160+S160","v":766958300.71818185},null,"Total",null,null,null,null,null,{"$f":"SUM(AC147:AC159)","v":761250103.71818185},{"$f":"SUM(AD147:AD157)","v":5708197},null,{"$f":"AC160+AD160","v":766958300.71818185},null,"Total",null,null,null,null,null,{"$f":"SUM(AN147:AN159)","v":761250103.71818185},{"$f":"SUM(AO147:AO157)","v":5708197},null,{"$f":"AN160+AO160","v":766958300.71818185},null,"Total",null,null,null,null,null,{"$f":"SUM(AY147:AY159)","v":761250103.71818185},{"$f":"SUM(AZ147:AZ157)","v":5708197},null,{"$f":"AY160+AZ160","v":766958300.71818185},null,"Total",null,null,null,null,null,{"$f":"SUM(BJ147:BJ159)","v":761250103.71818185},{"$f":"SUM(BK147:BK157)","v":5708197},null,{"$f":"BJ160+BK160","v":766958300.71818185},null,"Total",null,null,null,null,null,{"$f":"SUM(BU147:BU159)","v":761250103.71818185},{"$f":"SUM(BV147:BV157)","v":5708197},null,{"$f":"BU160+BV160","v":766958300.71818185},null,"Total",null,null,null,null,null,{"$f":"SUM(CF147:CF159)","v":761250103.71818185},{"$f":"SUM(CG147:CG157)","v":5708197},null,{"$f":"CF160+CG160","v":766958300.71818185},null,"Total",null,null,null,null,null,{"$f":"SUM(CQ147:CQ159)","v":761250103.71818185},{"$f":"SUM(CR147:CR157)","v":5708197},null,{"$f":"CQ160+CR160","v":766958300.71818185},null,"Total",null,null,null,null,null,{"$f":"SUM(DB147:DB159)","v":761250103.71818185},{"$f":"SUM(DC147:DC157)","v":5708197},null,{"$f":"DB160+DC160","v":766958300.71818185}]

{"sheet":"Sommaire du rôle_sec_2","index":3,"n_rows":84,"n_cols":27,"rows_kept":84,"cut":false,"hidden":false,"merged":[[80,5,81,5],[80,6,81,6],[80,7,81,7],[80,8,81,8],[74,12,75,12],[74,13,75,13],[71,5,71,6],[71,7,71,10],[71,11,71,13],[80,9,81,9],[80,10,81,10],[80,11,81,11],[80,12,81,12],[80,13,81,13],[71,14,71,15],[74,5,75,5],[74,6,75,6],[74,7,75,7],[74,8,75,8],[74,9,75,9],[74,10,75,10],[74,14,75,14],[74,15,75,15],[70,5,70,6],[70,7,70,10],[70,11,70,13],[70,14,70,15],[51,1,51,4],[65,5,65,6],[65,7,65,8],[65,9,65,10],[65,11,65,12],[65,13,65,14],[68,5,69,6],[68,7,69,10],[68,11,69,13],[68,14,68,15],[69,14,69,15],[65,15,65,16],[80,14,81,14],[80,15,81,15],[74,11,75,11],[65,21,65,22],[65,23,65,24],[65,25,65,26],[50,19,50,20],[50,21,50,22],[27,23,27,24],[27,25,27,26],[47,1,47,26],[48,1,49,4],[48,7,48,8],[49,23,49,24],[49,25,49,26],[50,1,50,4],[50,5,50,6],[50,7,50,8],[50,9,50,10],[50,11,50,12],[50,13,50,14],[50,15,50,16],[50,17,50,18],[50,23,50,24],[50,25,50,26],[65,17,65,18],[65,19,65,20],[45,11,45,12],[45,13,45,14],[45,15,45,16],[45,17,45,18],[45,19,45,20],[48,23,48,24],[48,25,48,26],[49,21,49,22],[48,21,48,22],[45,21,45,22],[45,23,45,24],[45,25,45,26],[49,7,49,8],[49,9,49,10],[49,11,49,12],[49,13,49,14],[49,15,49,16],[49,17,49,18],[49,19,49,20],[48,9,48,10],[48,11,48,12],[48,13,48,14],[48,15,48,16],[48,17,48,18],[48,19,48,20],[27,19,27,20],[27,21,27,22],[24,1,24,26],[25,1,26,4],[25,7,25,8],[25,9,25,10],[25,11,25,12],[26,23,26,24],[26,25,26,26],[27,1,27,4],[27,5,27,6],[27,7,27,8],[27,9,27,10],[27,11,27,12],[27,13,27,14],[27,15,27,16],[27,17,27,18],[25,25,25,26],[26,17,26,18],[26,19,26,20],[26,21,26,22],[25,17,25,18],[25,19,25,20],[25,21,25,22],[28,1,28,4],[45,5,45,6],[45,7,45,8],[45,9,45,10],[18,11,18,13],[19,11,19,12],[21,8,21,10],[21,11,21,12],[21,15,21,16],[22,11,22,12],[22,15,22,16],[26,7,26,8],[26,9,26,10],[26,11,26,12],[26,13,26,14],[26,15,26,16],[25,13,25,14],[25,15,25,16],[25,23,25,24],[4,5,4,6],[4,7,4,8],[4,9,4,10],[4,15,4,16],[5,11,5,12],[5,13,5,14],[6,11,15,11],[16,11,17,13],[16,14,16,16],[1,1,1,16],[2,5,2,6],[2,7,2,8],[2,9,2,10],[2,15,2,16],[3,1,3,4],[3,5,3,6],[3,7,3,8],[3,9,3,10],[3,11,3,12],[3,13,3,14],[3,15,3,16]]}
[]
[null,"  ASSIETTES D'APPLICATION DES TAUX DE LA TAXE FONCIÈRE GÉNÉRALE 9"]
[null,"TAUX APPLICABLES",null,null,null,"TAUX NON RÉSIDENTIEL",null,"TAUX INDUSTRIEL (CLASSE 2)",null,"TAUX IND. (SAUF CL.1 ET 2)",null,"TAUX AGRICOLE",null,"TAUX FORESTIER",null,"TAUX CATÉGORIE RÉSIDUELLE"]
[null,"NOMBRE DE SECTEURS",null,null,null,null,null,null,null,null,null,null,null,null,null,null,null,null,{"$f":"IF(OR(F4>0,H4>0,J4>0,L4>0,N4>0,P4>0),\"UTILISER LE SIMULATEUR POUR LA TAXATION DE SECTEUR\",\"-\")","v":"-"}]
[null,"CLASSE NON RÉSIDENTIELLE ET",null,null,null,"VAL. NR À 100 % ET IND. CL. 2 À 50 %",null,"VALEUR À 50 %",null,"VALEUR À 100 %",null,"VALEURS À 100 % IMPOSABLES",null,"VALEURS À 100 % IMPOSABLES",null,"VALEUR À 100 %"]
[null,"POURCENTAGE DE TAXATION",null,null,null,"  IMPOSABLES","COMPENSABLES","  IMPOSABLES","COMPENSABLES","  IMPOSABLES","COMPENSABLES",null,null,null,null,"  IMPOSABLES","COMPENSABLES"]
[null," 1A",":     0,1 %",null,901,76534150,0,null,null,null,null,null,null,null,"99,9 % ",76534150,0]
[null," 1B",":     0,5 %",null,902,34712370,0,null,null,null,null,null,null,null,"99,5 % ",34712370,0]
[null," 1C",":     1 %",null,903,4894450,0,null,null,null,null,null,null,null,"99 % ",4894450,0]
[null," 2",":     3 %",null,904,23616670,0,null,null,605900,null,null,null,null,"97 % ",23616670,0]
[null," 3",":     6 %",null,905,44153450,0,null,null,181400,null,null,null,null,"94 % ",44153450,0]
[null," 4",":     12 %",null,906,60256460,0,null,null,215700,null,null,null,null,"88 % ",60256460,0]
[null," 5",":     22 %",null,907,38643990,0,null,null,null,null,null,null,null,"78 % ",38643990,0]
[null," 6",":     40 %",null,908,38532890,0,290100,null,2421200,null,null,null,null,"60 % ",38532890,0]
[null," 7",":     60 %",null,909,39569365,72376370,350350,null,354000,null,null,null,null,"40 % ",39569365,72376370]
[null," 8",":     85 %",null,910,22323070,211592260,null,null,1875900,null,null,null,null,"15 % ",22323070,211592260]
[null," 9",":     100 %",null,911,3177900,0,null,null,null,null,"TAUX TERRAINS VAGUES \nDESSERVIS"]
[null," 10",":     100 %",null,912,1155755205,61905690,10515650,null,225704400,2325200,null,null,null,null,8068032861,2100780]
[null," 11",":  Cours de triage 100 %",null,913,null,null,null,null,null,null,"VALEURS À 100 %"]
[null," 12",":  CHSLD 20 %",null,914,13938200,null,null,null,null,null,"  IMPOSABLES",null,"COMPENSABLES","80 % ",{"$f":"F20","v":13938200}]
[null," 13",":  Cours de triage 40 %",null,915,null,"CFIL (chemin de fer d'intérêt local)",null,null,null,null,null,null,null,"60 % ",{"$f":"F21","v":0}]
[null," APPLICATION DU TNR QUAND TTVD",null,null,916,5228300,null,null,"(TTVD − TAUX DE BASE) x ",null,null,{"$f":"F22","v":5228300},null,{"$f":"G22","v":0}]
[null," ASSIETTES D'APPLICATION ",null,null,917,{"$f":"F71+F72","v":1529652563.0999999},null,null,{"$f":"H71+H72","v":241701840},null,"(TTVD) x ",76716400,null,58400,null,{"$f":"O71+O72","v":8447691867.8999996}]
[]
[null,"ASSIETTES D'APPLICATION DES TAUX RELATIFS AUX SOUS-CATÉGORIES DES IMMEUBLES NON RÉSIDENTIELS (si applicables)"]
[null,"DÉNOMINATION DE LA SOUS-CATÉGORIE",null,null,null,"TAUX SOUS-CATÉGORIE DE RÉFÉRENCE",null,"TAUX SOUS-CATÉGORIE 1",null,"TAUX SOUS-CATÉGORIE 2",null,"TAUX SOUS-CATÉGORIE 3",null,"TAUX SOUS-CATÉGORIE 4",null,"TAUX SOUS-CATÉGORIE 5",null,"TAUX SOUS-CATÉGORIE 6",null,"TAUX SOUS-CATÉGORIE 7",null,"TAUX SOUS-CATÉGORIE 8",null,"TAUX SOUS-CATÉGORIE 9",null,"TAUX SOUS-CATÉGORIE 10"]
[]
[null,"NOMBRE DE SECTEURS"]
[null,"POURCENTAGE DE TAXATION",null,null,null,"  IMPOSABLES","COMPENSABLES","  IMPOSABLES","COMPENSABLES","  IMPOSABLES","COMPENSABLES","  IMPOSABLES","COMPENSABLES","  IMPOSABLES","COMPENSABLES","  IMPOSABLES","COMPENSABLES","  IMPOSABLES","COMPENSABLES","  IMPOSABLES","COMPENSABLES","  IMPOSABLES","COMPENSABLES","  IMPOSABLES","COMPENSABLES","  IMPOSABLES","COMPENSABLES"]
[null," 1A","     0,1 %",null,{"$f":"E22+1","v":917}]
[null," 1B","     0,5 %",null,{"$f":"E30+1","v":918}]
[null," 1C","     1 %",null,919]
[null," 2","     3 %",null,920]
[null," 3","     6 %",null,921]
[null," 4","     12 %",null,922]
[null," 5","     22 %",null,923]
[null," 6","     40 %",null,924]
[null," 7","     60 %",null,925]
[null," 8","     85 %",null,926]
[null," 9","     100 %",null,927]
[null," 10","     100 %",null,928]
[null," 11","  Cours de triage 100 %",null,929]
[null," 12","  CHSLD 20 %",null,930]
[null," 13","  Cours de triage 40 %",null,931,null,"CFIL"]
[null," APPLICATION DU TNR QUAND TTVD",null,null,932]
[null," ASSIETTES D'APPLICATION ",null,null,933,{"$f":"F77+F78","v":0},null,{"$f":"G77+G78","v":0},null,{"$f":"H77+H78","v":0},null,{"$f":"I77+I78","v":0},null,{"$f":"J77+J78","v":0},null,{"$f":"K77+K78","v":0},null,{"$f":"L77+L78","v":0},null,{"$f":"M77+M78","v":0},null,{"$f":"N77+N78","v":0},null,{"$f":"O77+O78","v":0},null,{"$f":"P77+P78","v":0}]
[]
[null,"ASSIETTES D'APPLICATION DES TAUX RELATIFS AUX SOUS-CATÉGORIES DES IMMEUBLES RÉSIDENTIELS (si applicables)"]
[null,"DÉNOMINATION DE LA SOUS-CATÉGORIE",null,null,null,"TAUX SOUS-CATÉGORIE RÉSIDUELLE",null,"TAUX SOUS-CATÉGORIE 1",null,"TAUX SOUS-CATÉGORIE 2",null,"TAUX SOUS-CATÉGORIE 3",null,"TAUX SOUS-CATÉGORIE 4",null,"TAUX SOUS-CATÉGORIE 5",null,"TAUX SOUS-CATÉGORIE 6",null,"TAUX SOUS-CATÉGORIE 7",null,"TAUX SOUS-CATÉGORIE 8",null,"TAUX SOUS-CATÉGORIE 9",null,"TAUX SOUS-CATÉGORIE 10"]
[]
[null,"NOMBRE DE SECTEURS"]
[null,"POURCENTAGE DE TAXATION",null,null,null,"  IMPOSABLES","COMPENSABLES","  IMPOSABLES","COMPENSABLES","  IMPOSABLES","COMPENSABLES","  IMPOSABLES","COMPENSABLES","  IMPOSABLES","COMPENSABLES","  IMPOSABLES","COMPENSABLES","  IMPOSABLES","COMPENSABLES","  IMPOSABLES","COMPENSABLES","  IMPOSABLES","COMPENSABLES","  IMPOSABLES","COMPENSABLES","  IMPOSABLES","COMPENSABLES"]
[null," 1A","99,9 % ",null,935]
[null," 1B","99,5 % ",null,{"$f":"E53+1","v":936}]
[null," 1C","99 % ",null,937]
[null," 2","97 % ",null,938]
[null," 3","94 % ",null,939]
[null," 4","88 % ",null,940]
[null," 5","78 % ",null,941]
[null," 6","60 % ",null,942]
[null," 7","40 % ",null,943]
[null," 8","15 % ",null,944]
[null," 9","100% immeubles sans partie non résidentielle",null,945]
[null," 12","  CHSLD 80 %",null,946]
[null," 13","  Cours de triage 60 %",null,947]
[null," ASSIETTES D'APPLICATION ",null,null,948,{"$f":"F83+F84","v":0},null,{"$f":"G83+G84","v":0},null,{"$f":"H83+H84","v":0},null,{"$f":"I83+I84","v":0},null,{"$f":"J83+J84","v":0},null,{"$f":"K83+K84","v":0},null,{"$f":"L83+L84","v":0},null,{"$f":"M83+M84","v":0},null,{"$f":"N83+N84","v":0},null,{"$f":"O83+O84","v":0},null,{"$f":"P83+P84","v":0}]
[]
[]
[null,null,null,null,null,"TAUX NON RÉSIDENTIEL",null,"TAUX INDUSTRIEL ",null,null,null,"TAUX TERRAINS VAGUES \nDESSERVIS",null,null,"TAUX CATÉGORIE RÉSIDUELLE (TAUX DE BASE)"]
[]
[null,null,"Assiette imposable",null,null,{"$f":"Détermination_sec_2!G23","v":1244467630.0999999},null,{"$f":"Détermination_sec_2!G41+Détermination_sec_2!G59","v":239376640},null,null,null,{"$f":"L23","v":76716400},null,null,{"$f":"Détermination_sec_2!G78","v":8384901700.8999996}]
[null,null,"Assiette compensable",null,null,{"$f":"Détermination_sec_2!H23","v":285184933},null,{"$f":"Détermination_sec_2!H41+Détermination_sec_2!H59","v":2325200},null,null,null,{"$f":"N23","v":58400},null,null,{"$f":"Détermination_sec_2!H78","v":62790167}]
[]
[null,"Sous-catégorie des immeubles non résidentiels"]
[null,null,null,null,null,"TAUX SOUS-CATÉGORIE DE RÉFÉRENCE","Sous-catégorie 1","Sous-catégorie 2","Sous-catégorie 3","Sous-catégorie 4","Sous-catégorie 5","Sous-catégorie 6","Sous-catégorie 7","Sous-catégorie 8","Sous-catégorie 9","Sous-catégorie 10"]
[]
[null,null,"Assiette imposable",null,null,{"$f":"Détermination_sec_2!G100","v":0},{"$f":"Détermination_sec_2!G122","v":0},{"$f":"Détermination_sec_2!R122","v":0},{"$f":"Détermination_sec_2!AC122","v":0},{"$f":"Détermination_sec_2!AN122","v":0},{"$f":"Détermination_sec_2!AY122","v":0},{"$f":"Détermination_sec_2!BJ122","v":0},{"$f":"Détermination_sec_2!BU122","v":0},{"$f":"Détermination_sec_2!CF122","v":0},{"$f":"Détermination_sec_2!CQ122","v":0},{"$f":"Détermination_sec_2!DB122","v":0}]
[null,null,"Assiette compensable",null,null,{"$f":"Détermination_sec_2!H100","v":0},{"$f":"Détermination_sec_2!H122","v":0},{"$f":"Détermination_sec_2!S122","v":0},{"$f":"Détermination_sec_2!AD122","v":0},{"$f":"Détermination_sec_2!AO122","v":0},{"$f":"Détermination_sec_2!AZ122","v":0},{"$f":"Détermination_sec_2!BK122","v":0},{"$f":"Détermination_sec_2!BV122","v":0},{"$f":"Détermination_sec_2!CG122","v":0},{"$f":"Détermination_sec_2!CR122","v":0},{"$f":"Détermination_sec_2!DC122","v":0}]
[]
[null,"Sous-catégorie des immeubles résidentiels"]
[null,null,null,null,null,"TAUX SOUS-CATÉGORIE RÉSIDUELLE","Sous-catégorie 1","Sous-catégorie 2","Sous-catégorie 3","Sous-catégorie 4","Sous-catégorie 5","Sous-catégorie 6","Sous-catégorie 7","Sous-catégorie 8","Sous-catégorie 9","Sous-catégorie 10"]
[]
[null,null,"Assiette imposable",null,null,{"$f":"Détermination_sec_2!G141","v":0},{"$f":"Détermination_sec_2!G160","v":0},{"$f":"Détermination_sec_2!R160","v":0},{"$f":"Détermination_sec_2!AC160","v":0},{"$f":"Détermination_sec_2!AN160","v":0},{"$f":"Détermination_sec_2!AY160","v":0},{"$f":"Détermination_sec_2!BJ160","v":0},{"$f":"Détermination_sec_2!BU160","v":0},{"$f":"Détermination_sec_2!CF160","v":0},{"$f":"Détermination_sec_2!CQ160","v":0},{"$f":"Détermination_sec_2!DB160","v":0}]
[null,null,"Assiette compensable",null,null,{"$f":"Détermination_sec_2!H141","v":0},{"$f":"Détermination_sec_2!H160","v":0},{"$f":"Détermination_sec_2!S160","v":0},{"$f":"Détermination_sec_2!AD160","v":0},{"$f":"Détermination_sec_2!AO160","v":0},{"$f":"Détermination_sec_2!AZ160","v":0},{"$f":"Détermination_sec_2!BK160","v":0},{"$f":"Détermination_sec_2!BV160","v":0},{"$f":"Détermination_sec_2!CG160","v":0},{"$f":"Détermination_sec_2!CR160","v":0},{"$f":"Détermination_sec_2!DC160","v":0}]

{"sheet":"Détermination_sec_2","index":4,"n_rows":160,"n_cols":109,"rows_kept":160,"cut":false,"hidden":true,"merged":[[143,102,143,103],[143,66,144,66],[143,67,144,67],[143,69,143,70],[143,77,144,77],[143,78,144,78],[143,80,143,81],[143,88,144,88],[143,89,144,89],[143,91,143,92],[143,99,144,99],[143,100,144,100],[143,58,143,59],[143,22,144,22],[143,23,144,23],[143,25,143,26],[143,33,144,33],[143,34,144,34],[143,36,143,37],[143,44,144,44],[143,45,144,45],[143,47,143,48],[143,55,144,55],[143,56,144,56],[143,0,144,0],[143,1,144,1],[143,3,143,4],[143,11,144,11],[143,12,144,12],[143,14,143,15],[102,99,103,99],[102,100,103,100],[102,102,102,103],[124,0,125,0],[124,1,125,1],[124,3,124,4],[102,77,103,77],[102,78,103,78],[102,80,102,81],[102,88,103,88],[102,47,102,48],[102,89,103,89],[102,91,102,92],[102,55,103,55],[102,56,103,56],[102,58,102,59],[102,66,103,66],[102,67,103,67],[102,69,102,70],[102,33,103,33],[102,34,103,34],[102,36,102,37],[102,44,103,44],[102,45,103,45],[102,25,102,26],[80,0,81,0],[80,1,81,1],[80,3,80,4],[102,0,103,0],[102,1,103,1],[102,3,102,4],[102,11,103,11],[102,12,103,12],[102,14,102,15],[102,22,103,22],[102,23,103,23],[43,0,44,0],[43,1,44,1],[43,3,43,4],[61,0,62,0],[61,1,62,1],[61,3,61,4],[3,0,4,0],[3,1,4,1],[3,3,3,4],[25,0,26,0],[25,1,26,1],[25,3,25,4]]}
["DÉTERMINATION DES ASSIETTES "]
[]
["ASSIETTE AU TAUX NON RÉSIDENTIEL"]
["Classe non résidentielle","Pourcentage de taxation",null,"VAL. NR À 100 % ET IND. CL. 2 À 50 %"]
[null,null,null,"  Imposables","Compensables",null,"Imposables pondérées","Compensables pondérées",null,"Total"]
[null,"(1)",null,"(2)","(3)",null,"(4) = (1) X (2)","(5) = (1 ) X  (3)",null,"(6) = (4) + (5)"]
[" 1A",1E-3,null,{"$f":"'Sommaire du rôle_sec_2'!F7","v":76534150},{"$f":"'Sommaire du rôle_sec_2'!G7","v":0},null,{"$f":"B7*D7","v":76534.150000000009},{"$f":"B7*E7","v":0},null,{"$f":"G7+H7","v":76534.150000000009}]
[" 1B",5.0000000000000001E-3,null,{"$f":"'Sommaire du rôle_sec_2'!F8","v":34712370},{"$f":"'Sommaire du rôle_sec_2'!G8","v":0},null,173561.85,0,null,173561.85]
[" 1C",0.01,null,{"$f":"'Sommaire du rôle_sec_2'!F9","v":4894450},{"$f":"'Sommaire du rôle_sec_2'!G9","v":0},null,48944.5,0,null,48944.5]
[2,0.03,null,{"$f":"'Sommaire du rôle_sec_2'!F10","v":23616670},{"$f":"'Sommaire du rôle_sec_2'!G10","v":0},null,708500.1,0,null,708500.1]
[3,0.06,null,{"$f":"'Sommaire du rôle_sec_2'!F11","v":44153450},{"$f":"'Sommaire du rôle_sec_2'!G11","v":0},null,2649207,0,null,2649207]
[4,0.12,null,{"$f":"'Sommaire du rôle_sec_2'!F12","v":60256460},{"$f":"'Sommaire du rôle_sec_2'!G12","v":0},null,7230775.2000000002,0,null,7230775.2000000002]
[5,0.22,null,{"$f":"'Sommaire du rôle_sec_2'!F13","v":38643990},{"$f":"'Sommaire du rôle_sec_2'!G13","v":0},null,8501677.8000000007,0,null,8501677.8000000007]
[6,0.4,null,{"$f":"'Sommaire du rôle_sec_2'!F14","v":38532890},{"$f":"'Sommaire du rôle_sec_2'!G14","v":0},null,15413156,0,null,15413156]
[7,0.6,null,{"$f":"'Sommaire du rôle_sec_2'!F15","v":39569365},{"$f":"'Sommaire du rôle_sec_2'!G15","v":72376370},null,23741619,43425822,null,67167441]
[8,0.85,null,{"$f":"'Sommaire du rôle_sec_2'!F16","v":22323070},{"$f":"'Sommaire du rôle_sec_2'!G16","v":211592260},null,18974609.5,179853421,null,198828030.5]
[9,1,null,{"$f":"'Sommaire du rôle_sec_2'!F17","v":3177900},{"$f":"'Sommaire du rôle_sec_2'!G17","v":0},null,3177900,0,null,3177900]
[10,1,null,{"$f":"'Sommaire du rôle_sec_2'!F18","v":1155755205},{"$f":"'Sommaire du rôle_sec_2'!G18","v":61905690},null,1155755205,61905690,null,1217660895]
["11 Cours de triage","100%",null,{"$f":"'Sommaire du rôle_sec_2'!F19","v":0},{"$f":"'Sommaire du rôle_sec_2'!G19","v":0},null,0,0,null,0]
["12 CHSLD",0.2,null,{"$f":"'Sommaire du rôle_sec_2'!F20","v":13938200},null,null,2787640,null,null,2787640]
["13 Cours de triage 40 %","40%",null,{"$f":"'Sommaire du rôle_sec_2'!F21","v":0},null,null,0,null,null,0]
[" APPLICATION DU TNR QUAND TTVD",1,null,{"$f":"'Sommaire du rôle_sec_2'!F22","v":5228300},{"$f":"'Sommaire du rôle_sec_2'!G22","v":0},null,5228300,{"$f":"B22*E22","v":0},null,5228300]
["Total",null,null,null,null,null,{"$f":"SUM(G7:G22)","v":1244467630.0999999},{"$f":"SUM(H7:H22)","v":285184933},null,1529652563.0999999]
[]
["ASSIETTE AU TAUX INDUSTRIEL (CLASSE 2)"]
["Classe non résidentielle","Pourcentage de taxation",null,"VALEUR À 50 %"]
[null,null,null,"  Imposables","Compensables",null,"Imposables pondérées","Compensables pondérées",null,"Total"]
[null,"(1)",null,"(2)","(3)",null,"(4) = (1) X (2)","(5) = (1) X (3)",null,"(6) = (4) + (5)"]
[" 1A",1E-3,null,{"$f":"'Sommaire du rôle_sec_2'!H7","v":0},{"$f":"'Sommaire du rôle_sec_2'!I7","v":0},null,{"$f":"B29*D29","v":0},{"$f":"B29*E29","v":0},null,{"$f":"G29+H29","v":0}]
[" 1B",5.0000000000000001E-3,null,{"$f":"'Sommaire du rôle_sec_2'!H8","v":0},{"$f":"'Sommaire du rôle_sec_2'!I8","v":0},null,0,0,null,0]
[" 1C",0.01,null,{"$f":"'Sommaire du rôle_sec_2'!H9","v":0},{"$f":"'Sommaire du rôle_sec_2'!I9","v":0},null,0,0,null,0]
[2,0.03,null,{"$f":"'Sommaire du rôle_sec_2'!H10","v":0},{"$f":"'Sommaire du rôle_sec_2'!I10","v":0},null,0,0,null,0]
[3,0.06,null,{"$f":"'Sommaire du rôle_sec_2'!H11","v":0},{"$f":"'Sommaire du rôle_sec_2'!I11","v":0},null,0,0,null,0]
[4,0.12,null,{"$f":"'Sommaire du rôle_sec_2'!H12","v":0},{"$f":"'Sommaire du rôle_sec_2'!I12","v":0},null,0,0,null,0]
[5,0.22,null,{"$f":"'Sommaire du rôle_sec_2'!H13","v":0},{"$f":"'Sommaire du rôle_sec_2'!I13","v":0},null,0,0,null,0]
[6,0.4,null,{"$f":"'Sommaire du rôle_sec_2'!H14","v":290100},{"$f":"'Sommaire du rôle_sec_2'!I14","v":0},null,116040,0,null,116040]
[7,0.6,null,{"$f":"'Sommaire du rôle_sec_2'!H15","v":350350},{"$f":"'Sommaire du rôle_sec_2'!I15","v":0},null,210210,0,null,210210]
[8,0.85,null,{"$f":"'Sommaire du rôle_sec_2'!H16","v":0},{"$f":"'Sommaire du rôle_sec_2'!I16","v":0},null,0,0,null,0]
[9,1,null,{"$f":"'Sommaire du rôle_sec_2'!H17","v":0},{"$f":"'Sommaire du rôle_sec_2'!I17","v":0},null,0,0,null,0]
[10,1,null,{"$f":"'Sommaire du rôle_sec_2'!H18","v":10515650},{"$f":"'Sommaire du rôle_sec_2'!I18","v":0},null,10515650,0,null,10515650]
["Total",null,null,null,null,null,{"$f":"SUM(G29:G40)","v":10841900},{"$f":"SUM(H29:H40)","v":0},null,10841900]
[]
["ASSIETTE AU TAUX IND. (SAUF CL.1 ET 2)"]
["Classe non résidentielle","Pourcentage de taxation",null,"VALEUR À 100 %"]
[null,null,null,"  Imposables","Compensables",null,"Imposables pondérées","Compensables pondérées",null,"Total"]
[null,"(1)",null,"(2)","(3)",null,"(4) = (1) X (2)","(5) = (1) X (3)",null,"(6) = (4) + (5)"]
[" 1A",1E-3,null,{"$f":"'Sommaire du rôle_sec_2'!J7","v":0},{"$f":"'Sommaire du rôle_sec_2'!K7","v":0},null,{"$f":"B47*D47","v":0},{"$f":"B47*E47","v":0},null,{"$f":"G47+H47","v":0}]
[" 1B",5.0000000000000001E-3,null,{"$f":"'Sommaire du rôle_sec_2'!J8","v":0},{"$f":"'Sommaire du rôle_sec_2'!K8","v":0},null,0,0,null,0]
[" 1C",0.01,null,{"$f":"'Sommaire du rôle_sec_2'!J9","v":0},{"$f":"'Sommaire du rôle_sec_2'!K9","v":0},null,0,0,null,0]
[2,0.03,null,{"$f":"'Sommaire du rôle_sec_2'!J10","v":605900},{"$f":"'Sommaire du rôle_sec_2'!K10","v":0},null,18177,0,null,18177]
[3,0.06,null,{"$f":"'Sommaire du rôle_sec_2'!J11","v":181400},{"$f":"'Sommaire du rôle_sec_2'!K11","v":0},null,10884,0,null,10884]
[4,0.12,null,{"$f":"'Sommaire du rôle_sec_2'!J12","v":215700},{"$f":"'Sommaire du rôle_sec_2'!K12","v":0},null,25884,0,null,25884]
[5,0.22,null,{"$f":"'Sommaire du rôle_sec_2'!J13","v":0},{"$f":"'Sommaire du rôle_sec_2'!K13","v":0},null,0,0,null,0]
[6,0.4,null,{"$f":"'Sommaire du rôle_sec_2'!J14","v":2421200},{"$f":"'Sommaire du rôle_sec_2'!K14","v":0},null,968480,0,null,968480]
[7,0.6,null,{"$f":"'Sommaire du rôle_sec_2'!J15","v":354000},{"$f":"'Sommaire du rôle_sec_2'!K15","v":0},null,212400,0,null,212400]
[8,0.85,null,{"$f":"'Sommaire du rôle_sec_2'!J16","v":1875900},{"$f":"'Sommaire du rôle_sec_2'!K16","v":0},null,1594515,0,null,1594515]
[9,1,null,{"$f":"'Sommaire du rôle_sec_2'!J17","v":0},{"$f":"'Sommaire du rôle_sec_2'!K17","v":0},null,0,0,null,0]
[10,1,null,{"$f":"'Sommaire du rôle_sec_2'!J18","v":225704400},{"$f":"'Sommaire du rôle_sec_2'!K18","v":2325200},null,225704400,2325200,null,228029600]
["Total",null,null,null,null,null,{"$f":"SUM(G47:G58)","v":228534740},{"$f":"SUM(H47:H58)","v":2325200},null,230859940]
[]
["ASSIETTE AU TAUX DE BASE"]
["Classe non résidentielle","Pourcentage de taxation",null,"VALEUR À 100 %"]
[null,null,null,"  Imposables","Compensables",null,"Imposables pondérées","Compensables pondérées",null,"Total"]
[null,"(1)",null,"(2)","(3)",null,"(4) = (1) X (2)","(5) = (1) X (3)",null,"(6) = (4) + (5)"]
[" 1A",0.999,null,{"$f":"'Sommaire du rôle_sec_2'!P7","v":76534150},{"$f":"'Sommaire du rôle_sec_2'!Q7","v":0},null,{"$f":"D65*B65","v":76457615.849999994},{"$f":"B65*E65","v":0},null,{"$f":"G65+H65","v":76457615.849999994}]
[" 1B",0.995,null,{"$f":"'Sommaire du rôle_sec_2'!P8","v":34712370},{"$f":"'Sommaire du rôle_sec_2'!Q8","v":0},null,34538808.149999999,0,null,34538808.149999999]
[" 1C",0.99,null,{"$f":"'Sommaire du rôle_sec_2'!P9","v":4894450},{"$f":"'Sommaire du rôle_sec_2'!Q9","v":0},null,4845505.5,0,null,4845505.5]
[2,0.97,null,{"$f":"'Sommaire du rôle_sec_2'!P10","v":23616670},{"$f":"'Sommaire du rôle_sec_2'!Q10","v":0},null,22908169.899999999,0,null,22908169.899999999]
[3,0.94,null,{"$f":"'Sommaire du rôle_sec_2'!P11","v":44153450},{"$f":"'Sommaire du rôle_sec_2'!Q11","v":0},null,41504243,0,null,41504243]
[4,0.88,null,{"$f":"'Sommaire du rôle_sec_2'!P12","v":60256460},{"$f":"'Sommaire du rôle_sec_2'!Q12","v":0},null,53025684.799999997,0,null,53025684.799999997]
[5,0.78,null,{"$f":"'Sommaire du rôle_sec_2'!P13","v":38643990},{"$f":"'Sommaire du rôle_sec_2'!Q13","v":0},null,30142312.199999999,0,null,30142312.199999999]
[6,0.6,null,{"$f":"'Sommaire du rôle_sec_2'!P14","v":38532890},{"$f":"'Sommaire du rôle_sec_2'!Q14","v":0},null,23119734,0,null,23119734]
[7,0.4,null,{"$f":"'Sommaire du rôle_sec_2'!P15","v":39569365},{"$f":"'Sommaire du rôle_sec_2'!Q15","v":72376370},null,15827746,28950548,null,44778294]
[8,0.15000000000000002,null,{"$f":"'Sommaire du rôle_sec_2'!P16","v":22323070},{"$f":"'Sommaire du rôle_sec_2'!Q16","v":211592260},null,3348460.5000000005,31738839.000000004,null,35087299.500000007]
["IMMEUBLES SANS PARTIE NON RÉSIDENTIELLE",1,null,{"$f":"'Sommaire du rôle_sec_2'!P18","v":8068032861},{"$f":"'Sommaire du rôle_sec_2'!Q18","v":2100780},null,8068032861,2100780,null,8070133641]
["12  CHSLD",0.8,null,{"$f":"'Sommaire du rôle_sec_2'!P20","v":13938200},null,null,11150560]
["13 Cours de triage ",0.6,null,{"$f":"'Sommaire du rôle_sec_2'!P21","v":0},null,null,0]
["Total",null,null,null,null,null,{"$f":"SUM(G65:G77)","v":8384901700.8999996},{"$f":"SUM(H65:H75)","v":62790167},{"$f":"SUM(I65:I75)","v":0},{"$f":"G78+H78","v":8447691867.8999996}]
[]
["ASSIETTE AU TAUX NON RÉSIDENTIEL RÉFÉRENCE"]
["Classe non résidentielle","Pourcentage de taxation",null,"VAL. NR À 100 % ET IND. CL. 2 À 50 %"]
[null,null,null,"  Imposables","Compensables",null,"Imposables pondérées","Compensables pondérées",null,"Total"]
[null,"(1)",null,"(2)","(3)",null,"(4) = (1) X (2)","(5) = (1 ) X  (3)",null,"(6) = (4) + (5)"]
[" 1A",1E-3,null,{"$f":"'Sommaire du rôle_sec_2'!F30","v":0},{"$f":"'Sommaire du rôle_sec_2'!G30","v":0},null,{"$f":"B84*D84","v":0},{"$f":"B84*E84","v":0},null,{"$f":"G84+H84","v":0}]
[" 1B",5.0000000000000001E-3,null,{"$f":"'Sommaire du rôle_sec_2'!F31","v":0},{"$f":"'Sommaire du rôle_sec_2'!G31","v":0},null,0,0,null,0]
[" 1C",0.01,null,{"$f":"'Sommaire du rôle_sec_2'!F32","v":0},{"$f":"'Sommaire du rôle_sec_2'!G32","v":0},null,0,0,null,0]
[2,0.03,null,{"$f":"'Sommaire du rôle_sec_2'!F33","v":0},{"$f":"'Sommaire du rôle_sec_2'!G33","v":0},null,0,0,null,0]
[3,0.06,null,{"$f":"'Sommaire du rôle_sec_2'!F34","v":0},{"$f":"'Sommaire du rôle_sec_2'!G34","v":0},null,0,0,null,0]
[4,0.12,null,{"$f":"'Sommaire du rôle_sec_2'!F35","v":0},{"$f":"'Sommaire du rôle_sec_2'!G35","v":0},null,0,0,null,0]
[5,0.22,null,{"$f":"'Sommaire du rôle_sec_2'!F36","v":0},{"$f":"'Sommaire du rôle_sec_2'!G36","v":0},null,0,0,null,0]
[6,0.4,null,{"$f":"'Sommaire du rôle_sec_2'!F37","v":0},{"$f":"'Sommaire du rôle_sec_2'!G37","v":0},null,0,0,null,0]
[7,0.6,null,{"$f":"'Sommaire du rôle_sec_2'!F38","v":0},{"$f":"'Sommaire du rôle_sec_2'!G38","v":0},null,0,0,null,0]
[8,0.85,null,{"$f":"'Sommaire du rôle_sec_2'!F39","v":0},{"$f":"'Sommaire du rôle_sec_2'!G39","v":0},null,0,0,null,0]
[9,1,null,{"$f":"'Sommaire du rôle_sec_2'!F40","v":0},{"$f":"'Sommaire du rôle_sec_2'!G40","v":0},null,0,0,null,0]
[10,1,null,{"$f":"'Sommaire du rôle_sec_2'!F41","v":0},{"$f":"'Sommaire du rôle_sec_2'!G41","v":0},null,0,0,null,0]
["11 Cours de triage","100%",null,{"$f":"'Sommaire du rôle_sec_2'!F42","v":0},{"$f":"'Sommaire du rôle_sec_2'!G42","v":0},null,0,0,null,0]
["12 CHSLD",0.2,null,{"$f":"'Sommaire du rôle_sec_2'!F43","v":0},null,null,0,null,null,0]
["13 Cours de triage 40 %","40%",null,{"$f":"'Sommaire du rôle_sec_2'!F44","v":0},null,null,0,null,null,0]
[" APPLICATION DU TNR QUAND TTVD",1,null,{"$f":"'Sommaire du rôle_sec_2'!F45","v":0},{"$f":"'Sommaire du rôle_sec_2'!G45","v":0},null,0,{"$f":"B99*E99","v":0},null,0]
["Total",null,null,null,null,null,{"$f":"SUM(G84:G99)","v":0},{"$f":"SUM(H84:H99)","v":0},null,0]
[]
["ASSIETTE AU TAUX NON RÉSIDENTIEL SOUS-CATÉGORIE 1",null,null,null,null,null,null,null,null,null,null,"ASSIETTE AU TAUX NON RÉSIDENTIEL SOUS-CATÉGORIE 2",null,null,null,null,null,null,null,null,null,null,"ASSIETTE AU TAUX NON RÉSIDENTIEL SOUS-CATÉGORIE 3",null,null,null,null,null,null,null,null,null,null,"ASSIETTE AU TAUX NON RÉSIDENTIEL SOUS-CATÉGORIE 4",null,null,null,null,null,null,null,null,null,null,"ASSIETTE AU TAUX NON RÉSIDENTIEL SOUS-CATÉGORIE 5",null,null,null,null,null,null,null,null,null,null,"ASSIETTE AU TAUX NON RÉSIDENTIEL SOUS-CATÉGORIE 6",null,null,null,null,null,null,null,null,null,null,"ASSIETTE AU TAUX NON RÉSIDENTIEL SOUS-CATÉGORIE 7",null,null,null,null,null,null,null,null,null,null,"ASSIETTE AU TAUX NON RÉSIDENTIEL SOUS-CATÉGORIE 8",null,null,null,null,null,null,null,null,null,null,"ASSIETTE AU TAUX NON RÉSIDENTIEL SOUS-CATÉGORIE 9",null,null,null,null,null,null,null,null,null,null,"ASSIETTE AU TAUX NON RÉSIDENTIEL SOUS-CATÉGORIE 10"]
["Classe non résidentielle","Pourcentage de taxation",null,"VAL. NR À 100 % ET IND. CL. 2 À 50 %",null,null,null,null,null,null,null,"Classe non résidentielle","Pourcentage de taxation",null,"VAL. NR À 100 % ET IND. CL. 2 À 50 %",null,null,null,null,null,null,null,"Classe non résidentielle","Pourcentage de taxation",null,"VAL. NR À 100 % ET IND. CL. 2 À 50 %",null,null,null,null,null,null,null,"Classe non résidentielle","Pourcentage de taxation",null,"VAL. NR À 100 % ET IND. CL. 2 À 50 %",null,null,null,null,null,null,null,"Classe non résidentielle","Pourcentage de taxation",null,"VAL. NR À 100 % ET IND. CL. 2 À 50 %",null,null,null,null,null,null,null,"Classe non résidentielle","Pourcentage de taxation",null,"VAL. NR À 100 % ET IND. CL. 2 À 50 %",null,null,null,null,null,null,null,"Classe non résidentielle","Pourcentage de taxation",null,"VAL. NR À 100 % ET IND. CL. 2 À 50 %",null,null,null,null,null,null,null,"Classe non résidentielle","Pourcentage de taxation",null,"VAL. NR À 100 % ET IND. CL. 2 À 50 %",null,null,null,null,null,null,null,"Classe non résidentielle","Pourcentage de taxation",null,"VAL. NR À 100 % ET IND. CL. 2 À 50 %",null,null,null,null,null,null,null,"Classe non résidentielle","Pourcentage de taxation",null,"VAL. NR À 100 % ET IND. CL. 2 À 50 %"]
[null,null,null,"  Imposables","Compensables",null,"Imposables pondérées","Compensables pondérées",null,"Total",null,null,null,null,"  Imposables","Compensables",null,"Imposables pondérées","Compensables pondérées",null,"Total",null,null,null,null,"  Imposables","Compensables",null,"Imposables pondérées","Compensables pondérées",null,"Total",null,null,null,null,"  Imposables","Compensables",null,"Imposables pondérées","Compensables pondérées",null,"Total",null,null,null,null,"  Imposables","Compensables",null,"Imposables pondérées","Compensables pondérées",null,"Total",null,null,null,null,"  Imposables","Compensables",null,"Imposables pondérées","Compensables pondérées",null,"Total",null,null,null,null,"  Imposables","Compensables",null,"Imposables pondérées","Compensables pondérées",null,"Total",null,null,null,null,"  Imposables","Compensables",null,"Imposables pondérées","Compensables pondérées",null,"Total",null,null,null,null,"  Imposables","Compensables",null,"Imposables pondérées","Compensables pondérées",null,"Total",null,null,null,null,"  Imposables","Compensables",null,"Imposables pondérées","Compensables pondérées",null,"Total"]
[null,"(1)",null,"(2)","(3)",null,"(4) = (1) X (2)","(5) = (1 ) X  (3)",null,"(6) = (4) + (5)",null,null,"(1)",null,"(2)","(3)",null,"(4) = (1) X (2)","(5) = (1 ) X  (3)",null,"(6) = (4) + (5)",null,null,"(1)",null,"(2)","(3)",null,"(4) = (1) X (2)","(5) = (1 ) X  (3)",null,"(6) = (4) + (5)",null,null,"(1)",null,"(2)","(3)",null,"(4) = (1) X (2)","(5) = (1 ) X  (3)",null,"(6) = (4) + (5)",null,null,"(1)",null,"(2)","(3)",null,"(4) = (1) X (2)","(5) = (1 ) X  (3)",null,"(6) = (4) + (5)",null,null,"(1)",null,"(2)","(3)",null,"(4) = (1) X (2)","(5) = (1 ) X  (3)",null,"(6) = (4) + (5)",null,null,"(1)",null,"(2)","(3)",null,"(4) = (1) X (2)","(5) = (1 ) X  (3)",null,"(6) = (4) + (5)",null,null,"(1)",null,"(2)","(3)",null,"(4) = (1) X (2)","(5) = (1 ) X  (3)",null,"(6) = (4) + (5)",null,null,"(1)",null,"(2)","(3)",null,"(4) = (1) X (2)","(5) = (1 ) X  (3)",null,"(6) = (4) + (5)",null,null,"(1)",null,"(2)","(3)",null,"(4) = (1) X (2)","(5) = (1 ) X  (3)",null,"(6) = (4) + (5)"]
[" 1A",1E-3,null,{"$f":"'Sommaire du rôle_sec_2'!H30","v":0},{"$f":"'Sommaire du rôle_sec_2'!I30","v":0},null,{"$f":"B106*D106","v":0},{"$f":"B106*E106","v":0},null,{"$f":"G106+H106","v":0},null," 1A",1E-3,null,{"$f":"'Sommaire du rôle_sec_2'!J30","v":0},{"$f":"'Sommaire du rôle_sec_2'!K30","v":0},null,{"$f":"M106*O106","v":0},{"$f":"M106*P106","v":0},null,{"$f":"R106+S106","v":0},null," 1A",1E-3,null,{"$f":"'Sommaire du rôle_sec_2'!L30","v":0},{"$f":"'Sommaire du rôle_sec_2'!M30","v":0},null,{"$f":"X106*Z106","v":0},{"$f":"X106*AA106","v":0},null,{"$f":"AC106+AD106","v":0},null," 1A",1E-3,null,{"$f":"'Sommaire du rôle_sec_2'!N30","v":0},{"$f":"'Sommaire du rôle_sec_2'!O30","v":0},null,{"$f":"AI106*AK106","v":0},{"$f":"AI106*AL106","v":0},null,{"$f":"AN106+AO106","v":0},null," 1A",1E-3,null,{"$f":"'Sommaire du rôle_sec_2'!P30","v":0},{"$f":"'Sommaire du rôle_sec_2'!Q30","v":0},null,{"$f":"AT106*AV106","v":0},{"$f":"AT106*AW106","v":0},null,{"$f":"AY106+AZ106","v":0},null," 1A",1E-3,null,{"$f":"'Sommaire du rôle_sec_2'!R30","v":0},{"$f":"'Sommaire du rôle_sec_2'!S30","v":0},null,{"$f":"BE106*BG106","v":0},{"$f":"BE106*BH106","v":0},null,{"$f":"BJ106+BK106","v":0},null," 1A",1E-3,null,{"$f":"'Sommaire du rôle_sec_2'!T30","v":0},{"$f":"'Sommaire du rôle_sec_2'!U30","v":0},null,{"$f":"BP106*BR106","v":0},{"$f":"BP106*BS106","v":0},null,{"$f":"BU106+BV106","v":0},null," 1A",1E-3,null,{"$f":"'Sommaire du rôle_sec_2'!V30","v":0},{"$f":"'Sommaire du rôle_sec_2'!W30","v":0},null,{"$f":"CA106*CC106","v":0},{"$f":"CA106*CD106","v":0},null,{"$f":"CF106+CG106","v":0},null," 1A",1E-3,null,{"$f":"'Sommaire du rôle_sec_2'!X30","v":0},{"$f":"'Sommaire du rôle_sec_2'!Y30","v":0},null,{"$f":"CL106*CN106","v":0},{"$f":"CL106*CO106","v":0},null,{"$f":"CQ106+CR106","v":0},null," 1A",1E-3,null,{"$f":"'Sommaire du rôle_sec_2'!Z30","v":0},{"$f":"'Sommaire du rôle_sec_2'!AA30","v":0},null,{"$f":"CW106*CY106","v":0},{"$f":"CW106*CZ106","v":0},null,{"$f":"DB106+DC106","v":0}]
[" 1B",5.0000000000000001E-3,null,{"$f":"'Sommaire du rôle_sec_2'!H31","v":0},{"$f":"'Sommaire du rôle_sec_2'!I31","v":0},null,0,0,null,0,null," 1B",5.0000000000000001E-3,null,{"$f":"'Sommaire du rôle_sec_2'!J31","v":0},{"$f":"'Sommaire du rôle_sec_2'!K31","v":0},null,0,0,null,0,null," 1B",5.0000000000000001E-3,null,{"$f":"'Sommaire du rôle_sec_2'!L31","v":0},{"$f":"'Sommaire du rôle_sec_2'!M31","v":0},null,0,0,null,0,null," 1B",5.0000000000000001E-3,null,{"$f":"'Sommaire du rôle_sec_2'!N31","v":0},{"$f":"'Sommaire du rôle_sec_2'!O31","v":0},null,0,0,null,0,null," 1B",5.0000000000000001E-3,null,{"$f":"'Sommaire du rôle_sec_2'!P31","v":0},{"$f":"'Sommaire du rôle_sec_2'!Q31","v":0},null,0,0,null,0,null," 1B",5.0000000000000001E-3,null,{"$f":"'Sommaire du rôle_sec_2'!R31","v":0},{"$f":"'Sommaire du rôle_sec_2'!S31","v":0},null,0,0,null,0,null," 1B",5.0000000000000001E-3,null,{"$f":"'Sommaire du rôle_sec_2'!T31","v":0},{"$f":"'Sommaire du rôle_sec_2'!U31","v":0},null,0,0,null,0,null," 1B",5.0000000000000001E-3,null,{"$f":"'Sommaire du rôle_sec_2'!V31","v":0},{"$f":"'Sommaire du rôle_sec_2'!W31","v":0},null,0,0,null,0,null," 1B",5.0000000000000001E-3,null,{"$f":"'Sommaire du rôle_sec_2'!X31","v":0},{"$f":"'Sommaire du rôle_sec_2'!Y31","v":0},null,0,0,null,0,null," 1B",5.0000000000000001E-3,null,{"$f":"'Sommaire du rôle_sec_2'!Z31","v":0},{"$f":"'Sommaire du rôle_sec_2'!AA31","v":0},null,0,0,null,0]
[" 1C",0.01,null,{"$f":"'Sommaire du rôle_sec_2'!H32","v":0},{"$f":"'Sommaire du rôle_sec_2'!I32","v":0},null,0,0,null,0,null," 1C",0.01,null,{"$f":"'Sommaire du rôle_sec_2'!J32","v":0},{"$f":"'Sommaire du rôle_sec_2'!K32","v":0},null,0,0,null,0,null," 1C",0.01,null,{"$f":"'Sommaire du rôle_sec_2'!L32","v":0},{"$f":"'Sommaire du rôle_sec_2'!M32","v":0},null,0,0,null,0,null," 1C",0.01,null,{"$f":"'Sommaire du rôle_sec_2'!N32","v":0},{"$f":"'Sommaire du rôle_sec_2'!O32","v":0},null,0,0,null,0,null," 1C",0.01,null,{"$f":"'Sommaire du rôle_sec_2'!P32","v":0},{"$f":"'Sommaire du rôle_sec_2'!Q32","v":0},null,0,0,null,0,null," 1C",0.01,null,{"$f":"'Sommaire du rôle_sec_2'!R32","v":0},{"$f":"'Sommaire du rôle_sec_2'!S32","v":0},null,0,0,null,0,null," 1C",0.01,null,{"$f":"'Sommaire du rôle_sec_2'!T32","v":0},{"$f":"'Sommaire du rôle_sec_2'!U32","v":0},null,0,0,null,0,null," 1C",0.01,null,{"$f":"'Sommaire du rôle_sec_2'!V32","v":0},{"$f":"'Sommaire du rôle_sec_2'!W32","v":0},null,0,0,null,0,null," 1C",0.01,null,{"$f":"'Sommaire du rôle_sec_2'!X32","v":0},{"$f":"'Sommaire du rôle_sec_2'!Y32","v":0},null,0,0,null,0,null," 1C",0.01,null,{"$f":"'Sommaire du rôle_sec_2'!Z32","v":0},{"$f":"'Sommaire du rôle_sec_2'!AA32","v":0},null,0,0,null,0]
[2,0.03,null,{"$f":"'Sommaire du rôle_sec_2'!H33","v":0},{"$f":"'Sommaire du rôle_sec_2'!I33","v":0},null,0,0,null,0,null,2,0.03,null,{"$f":"'Sommaire du rôle_sec_2'!J33","v":0},{"$f":"'Sommaire du rôle_sec_2'!K33","v":0},null,0,0,null,0,null,2,0.03,null,{"$f":"'Sommaire du rôle_sec_2'!L33","v":0},{"$f":"'Sommaire du rôle_sec_2'!M33","v":0},null,0,0,null,0,null,2,0.03,null,{"$f":"'Sommaire du rôle_sec_2'!N33","v":0},{"$f":"'Sommaire du rôle_sec_2'!O33","v":0},null,0,0,null,0,null,2,0.03,null,{"$f":"'Sommaire du rôle_sec_2'!P33","v":0},{"$f":"'Sommaire du rôle_sec_2'!Q33","v":0},null,0,0,null,0,null,2,0.03,null,{"$f":"'Sommaire du rôle_sec_2'!R33","v":0},{"$f":"'Sommaire du rôle_sec_2'!S33","v":0},null,0,0,null,0,null,2,0.03,null,{"$f":"'Sommaire du rôle_sec_2'!T33","v":0},{"$f":"'Sommaire du rôle_sec_2'!U33","v":0},null,0,0,null,0,null,2,0.03,null,{"$f":"'Sommaire du rôle_sec_2'!V33","v":0},{"$f":"'Sommaire du rôle_sec_2'!W33","v":0},null,0,0,null,0,null,2,0.03,null,{"$f":"'Sommaire du rôle_sec_2'!X33","v":0},{"$f":"'Sommaire du rôle_sec_2'!Y33","v":0},null,0,0,null,0,null,2,0.03,null,{"$f":"'Sommaire du rôle_sec_2'!Z33","v":0},{"$f":"'Sommaire du rôle_sec_2'!AA33","v":0},null,0,0,null,0]
[3,0.06,null,{"$f":"'Sommaire du rôle_sec_2'!H34","v":0},{"$f":"'Sommaire du rôle_sec_2'!I34","v":0},null,0,0,null,0,null,3,0.06,null,{"$f":"'Sommaire du rôle_sec_2'!J34","v":0},{"$f":"'Sommaire du rôle_sec_2'!K34","v":0},null,0,0,null,0,null,3,0.06,null,{"$f":"'Sommaire du rôle_sec_2'!L34","v":0},{"$f":"'Sommaire du rôle_sec_2'!M34","v":0},null,0,0,null,0,null,3,0.06,null,{"$f":"'Sommaire du rôle_sec_2'!N34","v":0},{"$f":"'Sommaire du rôle_sec_2'!O34","v":0},null,0,0,null,0,null,3,0.06,null,{"$f":"'Sommaire du rôle_sec_2'!P34","v":0},{"$f":"'Sommaire du rôle_sec_2'!Q34","v":0},null,0,0,null,0,null,3,0.06,null,{"$f":"'Sommaire du rôle_sec_2'!R34","v":0},{"$f":"'Sommaire du rôle_sec_2'!S34","v":0},null,0,0,null,0,null,3,0.06,null,{"$f":"'Sommaire du rôle_sec_2'!T34","v":0},{"$f":"'Sommaire du rôle_sec_2'!U34","v":0},null,0,0,null,0,null,3,0.06,null,{"$f":"'Sommaire du rôle_sec_2'!V34","v":0},{"$f":"'Sommaire du rôle_sec_2'!W34","v":0},null,0,0,null,0,null,3,0.06,null,{"$f":"'Sommaire du rôle_sec_2'!X34","v":0},{"$f":"'Sommaire du rôle_sec_2'!Y34","v":0},null,0,0,null,0,null,3,0.06,null,{"$f":"'Sommaire du rôle_sec_2'!Z34","v":0},{"$f":"'Sommaire du rôle_sec_2'!AA34","v":0},null,0,0,null,0]
[4,0.12,null,{"$f":"'Sommaire du rôle_sec_2'!H35","v":0},{"$f":"'Sommaire du rôle_sec_2'!I35","v":0},null,0,0,null,0,null,4,0.12,null,{"$f":"'Sommaire du rôle_sec_2'!J35","v":0},{"$f":"'Sommaire du rôle_sec_2'!K35","v":0},null,0,0,null,0,null,4,0.12,null,{"$f":"'Sommaire du rôle_sec_2'!L35","v":0},{"$f":"'Sommaire du rôle_sec_2'!M35","v":0},null,0,0,null,0,null,4,0.12,null,{"$f":"'Sommaire du rôle_sec_2'!N35","v":0},{"$f":"'Sommaire du rôle_sec_2'!O35","v":0},null,0,0,null,0,null,4,0.12,null,{"$f":"'Sommaire du rôle_sec_2'!P35","v":0},{"$f":"'Sommaire du rôle_sec_2'!Q35","v":0},null,0,0,null,0,null,4,0.12,null,{"$f":"'Sommaire du rôle_sec_2'!R35","v":0},{"$f":"'Sommaire du rôle_sec_2'!S35","v":0},null,0,0,null,0,null,4,0.12,null,{"$f":"'Sommaire du rôle_sec_2'!T35","v":0},{"$f":"'Sommaire du rôle_sec_2'!U35","v":0},null,0,0,null,0,null,4,0.12,null,{"$f":"'Sommaire du rôle_sec_2'!V35","v":0},{"$f":"'Sommaire du rôle_sec_2'!W35","v":0},null,0,0,null,0,null,4,0.12,null,{"$f":"'Sommaire du rôle_sec_2'!X35","v":0},{"$f":"'Sommaire du rôle_sec_2'!Y35","v":0},null,0,0,null,0,null,4,0.12,null,{"$f":"'Sommaire du rôle_sec_2'!Z35","v":0},{"$f":"'Sommaire du rôle_sec_2'!AA35","v":0},null,0,0,null,0]
[5,0.22,null,{"$f":"'Sommaire du rôle_sec_2'!H36","v":0},{"$f":"'Sommaire du rôle_sec_2'!I36","v":0},null,0,0,null,0,null,5,0.22,null,{"$f":"'Sommaire du rôle_sec_2'!J36","v":0},{"$f":"'Sommaire du rôle_sec_2'!K36","v":0},null,0,0,null,0,null,5,0.22,null,{"$f":"'Sommaire du rôle_sec_2'!L36","v":0},{"$f":"'Sommaire du rôle_sec_2'!M36","v":0},null,0,0,null,0,null,5,0.22,null,{"$f":"'Sommaire du rôle_sec_2'!N36","v":0},{"$f":"'Sommaire du rôle_sec_2'!O36","v":0},null,0,0,null,0,null,5,0.22,null,{"$f":"'Sommaire du rôle_sec_2'!P36","v":0},{"$f":"'Sommaire du rôle_sec_2'!Q36","v":0},null,0,0,null,0,null,5,0.22,null,{"$f":"'Sommaire du rôle_sec_2'!R36","v":0},{"$f":"'Sommaire du rôle_sec_2'!S36","v":0},null,0,0,null,0,null,5,0.22,null,{"$f":"'Sommaire du rôle_sec_2'!T36","v":0},{"$f":"'Sommaire du rôle_sec_2'!U36","v":0},null,0,0,null,0,null,5,0.22,null,{"$f":"'Sommaire du rôle_sec_2'!V36","v":0},{"$f":"'Sommaire du rôle_sec_2'!W36","v":0},null,0,0,null,0,null,5,0.22,null,{"$f":"'Sommaire du rôle_sec_2'!X36","v":0},{"$f":"'Sommaire du rôle_sec_2'!Y36","v":0},null,0,0,null,0,null,5,0.22,null,{"$f":"'Sommaire du rôle_sec_2'!Z36","v":0},{"$f":"'Sommaire du rôle_sec_2'!AA36","v":0},null,0,0,null,0]
[6,0.4,null,{"$f":"'Sommaire du rôle_sec_2'!H37","v":0},{"$f":"'Sommaire du rôle_sec_2'!I37","v":0},null,0,0,null,0,null,6,0.4,null,{"$f":"'Sommaire du rôle_sec_2'!J37","v":0},{"$f":"'Sommaire du rôle_sec_2'!K37","v":0},null,0,0,null,0,null,6,0.4,null,{"$f":"'Sommaire du rôle_sec_2'!L37","v":0},{"$f":"'Sommaire du rôle_sec_2'!M37","v":0},null,0,0,null,0,null,6,0.4,null,{"$f":"'Sommaire du rôle_sec_2'!N37","v":0},{"$f":"'Sommaire du rôle_sec_2'!O37","v":0},null,0,0,null,0,null,6,0.4,null,{"$f":"'Sommaire du rôle_sec_2'!P37","v":0},{"$f":"'Sommaire du rôle_sec_2'!Q37","v":0},null,0,0,null,0,null,6,0.4,null,{"$f":"'Sommaire du rôle_sec_2'!R37","v":0},{"$f":"'Sommaire du rôle_sec_2'!S37","v":0},null,0,0,null,0,null,6,0.4,null,{"$f":"'Sommaire du rôle_sec_2'!T37","v":0},{"$f":"'Sommaire du rôle_sec_2'!U37","v":0},null,0,0,null,0,null,6,0.4,null,{"$f":"'Sommaire du rôle_sec_2'!V37","v":0},{"$f":"'Sommaire du rôle_sec_2'!W37","v":0},null,0,0,null,0,null,6,0.4,null,{"$f":"'Sommaire du rôle_sec_2'!X37","v":0},{"$f":"'Sommaire du rôle_sec_2'!Y37","v":0},null,0,0,null,0,null,6,0.4,null,{"$f":"'Sommaire du rôle_sec_2'!Z37","v":0},{"$f":"'Sommaire du rôle_sec_2'!AA37","v":0},null,0,0,null,0]
[7,0.6,null,{"$f":"'Sommaire du rôle_sec_2'!H38","v":0},{"$f":"'Sommaire du rôle_sec_2'!I38","v":0},null,0,0,null,0,null,7,0.6,null,{"$f":"'Sommaire du rôle_sec_2'!J38","v":0},{"$f":"'Sommaire du rôle_sec_2'!K38","v":0},null,0,0,null,0,null,7,0.6,null,{"$f":"'Sommaire du rôle_sec_2'!L38","v":0},{"$f":"'Sommaire du rôle_sec_2'!M38","v":0},null,0,0,null,0,null,7,0.6,null,{"$f":"'Sommaire du rôle_sec_2'!N38","v":0},{"$f":"'Sommaire du rôle_sec_2'!O38","v":0},null,0,0,null,0,null,7,0.6,null,{"$f":"'Sommaire du rôle_sec_2'!P38","v":0},{"$f":"'Sommaire du rôle_sec_2'!Q38","v":0},null,0,0,null,0,null,7,0.6,null,{"$f":"'Sommaire du rôle_sec_2'!R38","v":0},{"$f":"'Sommaire du rôle_sec_2'!S38","v":0},null,0,0,null,0,null,7,0.6,null,{"$f":"'Sommaire du rôle_sec_2'!T38","v":0},{"$f":"'Sommaire du rôle_sec_2'!U38","v":0},null,0,0,null,0,null,7,0.6,null,{"$f":"'Sommaire du rôle_sec_2'!V38","v":0},{"$f":"'Sommaire du rôle_sec_2'!W38","v":0},null,0,0,null,0,null,7,0.6,null,{"$f":"'Sommaire du rôle_sec_2'!X38","v":0},{"$f":"'Sommaire du rôle_sec_2'!Y38","v":0},null,0,0,null,0,null,7,0.6,null,{"$f":"'Sommaire du rôle_sec_2'!Z38","v":0},{"$f":"'Sommaire du rôle_sec_2'!AA38","v":0},null,0,0,null,0]
[8,0.85,null,{"$f":"'Sommaire du rôle_sec_2'!H39","v":0},{"$f":"'Sommaire du rôle_sec_2'!I39","v":0},null,0,0,null,0,null,8,0.85,null,{"$f":"'Sommaire du rôle_sec_2'!J39","v":0},{"$f":"'Sommaire du rôle_sec_2'!K39","v":0},null,0,0,null,0,null,8,0.85,null,{"$f":"'Sommaire du rôle_sec_2'!L39","v":0},{"$f":"'Sommaire du rôle_sec_2'!M39","v":0},null,0,0,null,0,null,8,0.85,null,{"$f":"'Sommaire du rôle_sec_2'!N39","v":0},{"$f":"'Sommaire du rôle_sec_2'!O39","v":0},null,0,0,null,0,null,8,0.85,null,{"$f":"'Sommaire du rôle_sec_2'!P39","v":0},{"$f":"'Sommaire du rôle_sec_2'!Q39","v":0},null,0,0,null,0,null,8,0.85,null,{"$f":"'Sommaire du rôle_sec_2'!R39","v":0},{"$f":"'Sommaire du rôle_sec_2'!S39","v":0},null,0,0,null,0,null,8,0.85,null,{"$f":"'Sommaire du rôle_sec_2'!T39","v":0},{"$f":"'Sommaire du rôle_sec_2'!U39","v":0},null,0,0,null,0,null,8,0.85,null,{"$f":"'Sommaire du rôle_sec_2'!V39","v":0},{"$f":"'Sommaire du rôle_sec_2'!W39","v":0},null,0,0,null,0,null,8,0.85,null,{"$f":"'Sommaire du rôle_sec_2'!X39","v":0},{"$f":"'Sommaire du rôle_sec_2'!Y39","v":0},null,0,0,null,0,null,8,0.85,null,{"$f":"'Sommaire du rôle_sec_2'!Z39","v":0},{"$f":"'Sommaire du rôle_sec_2'!AA39","v":0},null,0,0,null,0]
[9,1,null,{"$f":"'Sommaire du rôle_sec_2'!H40","v":0},{"$f":"'Sommaire du rôle_sec_2'!I40","v":0},null,0,0,null,0,null,9,1,null,{"$f":"'Sommaire du rôle_sec_2'!J40","v":0},{"$f":"'Sommaire du rôle_sec_2'!K40","v":0},null,0,0,null,0,null,9,1,null,{"$f":"'Sommaire du rôle_sec_2'!L40","v":0},{"$f":"'Sommaire du rôle_sec_2'!M40","v":0},null,0,0,null,0,null,9,1,null,{"$f":"'Sommaire du rôle_sec_2'!N40","v":0},{"$f":"'Sommaire du rôle_sec_2'!O40","v":0},null,0,0,null,0,null,9,1,null,{"$f":"'Sommaire du rôle_sec_2'!P40","v":0},{"$f":"'Sommaire du rôle_sec_2'!Q40","v":0},null,0,0,null,0,null,9,1,null,{"$f":"'Sommaire du rôle_sec_2'!R40","v":0},{"$f":"'Sommaire du rôle_sec_2'!S40","v":0},null,0,0,null,0,null,9,1,null,{"$f":"'Sommaire du rôle_sec_2'!T40","v":0},{"$f":"'Sommaire du rôle_sec_2'!U40","v":0},null,0,0,null,0,null,9,1,null,{"$f":"'Sommaire du rôle_sec_2'!V40","v":0},{"$f":"'Sommaire du rôle_sec_2'!W40","v":0},null,0,0,null,0,null,9,1,null,{"$f":"'Sommaire du rôle_sec_2'!X40","v":0},{"$f":"'Sommaire du rôle_sec_2'!Y40","v":0},null,0,0,null,0,null,9,1,null,{"$f":"'Sommaire du rôle_sec_2'!Z40","v":0},{"$f":"'Sommaire du rôle_sec_2'!AA40","v":0},null,0,0,null,0]
[10,1,null,{"$f":"'Sommaire du rôle_sec_2'!H41","v":0},{"$f":"'Sommaire du rôle_sec_2'!I41","v":0},null,0,0,null,0,null,10,1,null,{"$f":"'Sommaire du rôle_sec_2'!J41","v":0},{"$f":"'Sommaire du rôle_sec_2'!K41","v":0},null,0,0,null,0,null,10,1,null,{"$f":"'Sommaire du rôle_sec_2'!L41","v":0},{"$f":"'Sommaire du rôle_sec_2'!M41","v":0},null,0,0,null,0,null,10,1,null,{"$f":"'Sommaire du rôle_sec_2'!N41","v":0},{"$f":"'Sommaire du rôle_sec_2'!O41","v":0},null,0,0,null,0,null,10,1,null,{"$f":"'Sommaire du rôle_sec_2'!P41","v":0},{"$f":"'Sommaire du rôle_sec_2'!Q41","v":0},null,0,0,null,0,null,10,1,null,{"$f":"'Sommaire du rôle_sec_2'!R41","v":0},{"$f":"'Sommaire du rôle_sec_2'!S41","v":0},null,0,0,null,0,null,10,1,null,{"$f":"'Sommaire du rôle_sec_2'!T41","v":0},{"$f":"'Sommaire du rôle_sec_2'!U41","v":0},null,0,0,null,0,null,10,1,null,{"$f":"'Sommaire du rôle_sec_2'!V41","v":0},{"$f":"'Sommaire du rôle_sec_2'!W41","v":0},null,0,0,null,0,null,10,1,null,{"$f":"'Sommaire du rôle_sec_2'!X41","v":0},{"$f":"'Sommaire du rôle_sec_2'!Y41","v":0},null,0,0,null,0,null,10,1,null,{"$f":"'Sommaire du rôle_sec_2'!Z41","v":0},{"$f":"'Sommaire du rôle_sec_2'!AA41","v":0},null,0,0,null,0]
["11 Cours de triage","100%",null,{"$f":"'Sommaire du rôle_sec_2'!H42","v":0},{"$f":"'Sommaire du rôle_sec_2'!I42","v":0},null,0,0,null,0,null,"11 Cours de triage","100%",null,{"$f":"'Sommaire du rôle_sec_2'!J42","v":0},{"$f":"'Sommaire du rôle_sec_2'!K42","v":0},null,0,0,null,0,null,"11 Cours de triage","100%",null,{"$f":"'Sommaire du rôle_sec_2'!L42","v":0},{"$f":"'Sommaire du rôle_sec_2'!M42","v":0},null,0,0,null,0,null,"11 Cours de triage","100%",null,{"$f":"'Sommaire du rôle_sec_2'!N42","v":0},{"$f":"'Sommaire du rôle_sec_2'!O42","v":0},null,0,0,null,0,null,"11 Cours de triage","100%",null,{"$f":"'Sommaire du rôle_sec_2'!P42","v":0},{"$f":"'Sommaire du rôle_sec_2'!Q42","v":0},null,0,0,null,0,null,"11 Cours de triage","100%",null,{"$f":"'Sommaire du rôle_sec_2'!R42","v":0},{"$f":"'Sommaire du rôle_sec_2'!S42","v":0},null,0,0,null,0,null,"11 Cours de triage","100%",null,{"$f":"'Sommaire du rôle_sec_2'!T42","v":0},{"$f":"'Sommaire du rôle_sec_2'!U42","v":0},null,0,0,null,0,null,"11 Cours de triage","100%",null,{"$f":"'Sommaire du rôle_sec_2'!V42","v":0},{"$f":"'Sommaire du rôle_sec_2'!W42","v":0},null,0,0,null,0,null,"11 Cours de triage","100%",null,{"$f":"'Sommaire du rôle_sec_2'!X42","v":0},{"$f":"'Sommaire du rôle_sec_2'!Y42","v":0},null,0,0,null,0,null,"11 Cours de triage","100%",null,{"$f":"'Sommaire du rôle_sec_2'!Z42","v":0},{"$f":"'Sommaire du rôle_sec_2'!AA42","v":0},null,0,0,null,0]
["12 CHSLD",0.2,null,{"$f":"'Sommaire du rôle_sec_2'!H43","v":0},null,null,0,null,null,0,null,"12 CHSLD",0.2,null,{"$f":"'Sommaire du rôle_sec_2'!J43","v":0},null,null,0,null,null,0,null,"12 CHSLD",0.2,null,{"$f":"'Sommaire du rôle_sec_2'!L43","v":0},null,null,0,null,null,0,null,"12 CHSLD",0.2,null,{"$f":"'Sommaire du rôle_sec_2'!N43","v":0},null,null,0,null,null,0,null,"12 CHSLD",0.2,null,{"$f":"'Sommaire du rôle_sec_2'!P43","v":0},null,null,0,null,null,0,null,"12 CHSLD",0.2,null,{"$f":"'Sommaire du rôle_sec_2'!R43","v":0},null,null,0,null,null,0,null,"12 CHSLD",0.2,null,{"$f":"'Sommaire du rôle_sec_2'!T43","v":0},null,null,0,null,null,0,null,"12 CHSLD",0.2,null,{"$f":"'Sommaire du rôle_sec_2'!V43","v":0},null,null,0,null,null,0,null,"12 CHSLD",0.2,null,{"$f":"'Sommaire du rôle_sec_2'!X43","v":0},null,null,0,null,null,0,null,"12 CHSLD",0.2,null,{"$f":"'Sommaire du rôle_sec_2'!Z43","v":0},null,null,0,null,null,0]
["13 Cours de triage 40 %","40%",null,{"$f":"'Sommaire du rôle_sec_2'!H44","v":0},null,null,0,null,null,0,null,"13 Cours de triage 40 %","40%",null,{"$f":"'Sommaire du rôle_sec_2'!J44","v":0},null,null,0,null,null,0,null,"13 Cours de triage 40 %","40%",null,{"$f":"'Sommaire du rôle_sec_2'!L44","v":0},null,null,0,null,null,0,null,"13 Cours de triage 40 %","40%",null,{"$f":"'Sommaire du rôle_sec_2'!N44","v":0},null,null,0,null,null,0,null,"13 Cours de triage 40 %","40%",null,{"$f":"'Sommaire du rôle_sec_2'!P44","v":0},null,null,0,null,null,0,null,"13 Cours de triage 40 %","40%",null,{"$f":"'Sommaire du rôle_sec_2'!R44","v":0},null,null,0,null,null,0,null,"13 Cours de triage 40 %","40%",null,{"$f":"'Sommaire du rôle_sec_2'!T44","v":0},null,null,0,null,null,0,null,"13 Cours de triage 40 %","40%",null,{"$f":"'Sommaire du rôle_sec_2'!V44","v":0},null,null,0,null,null,0,null,"13 Cours de triage 40 %","40%",null,{"$f":"'Sommaire du rôle_sec_2'!X44","v":0},null,null,0,null,null,0,null,"13 Cours de triage 40 %","40%",null,{"$f":"'Sommaire du rôle_sec_2'!Z44","v":0},null,null,0,null,null,0]
[" APPLICATION DU TNR QUAND TTVD",1,null,{"$f":"'Sommaire du rôle_sec_2'!H45","v":0},{"$f":"'Sommaire du rôle_sec_2'!I45","v":0},null,0,{"$f":"B121*E121","v":0},null,0,null," APPLICATION DU TNR QUAND TTVD",1,null,{"$f":"'Sommaire du rôle_sec_2'!J45","v":0},{"$f":"'Sommaire du rôle_sec_2'!K45","v":0},null,0,{"$f":"M121*P121","v":0},null,0,null," APPLICATION DU TNR QUAND TTVD",1,null,{"$f":"'Sommaire du rôle_sec_2'!L45","v":0},{"$f":"'Sommaire du rôle_sec_2'!M45","v":0},null,0,{"$f":"X121*AA121","v":0},null,0,null," APPLICATION DU TNR QUAND TTVD",1,null,{"$f":"'Sommaire du rôle_sec_2'!N45","v":0},{"$f":"'Sommaire du rôle_sec_2'!O45","v":0},null,0,{"$f":"AI121*AL121","v":0},null,0,null," APPLICATION DU TNR QUAND TTVD",1,null,{"$f":"'Sommaire du rôle_sec_2'!P45","v":0},{"$f":"'Sommaire du rôle_sec_2'!Q45","v":0},null,0,{"$f":"AT121*AW121","v":0},null,0,null," APPLICATION DU TNR QUAND TTVD",1,null,{"$f":"'Sommaire du rôle_sec_2'!R45","v":0},{"$f":"'Sommaire du rôle_sec_2'!S45","v":0},null,0,{"$f":"BE121*BH121","v":0},null,0,null," APPLICATION DU TNR QUAND TTVD",1,null,{"$f":"'Sommaire du rôle_sec_2'!T45","v":0},{"$f":"'Sommaire du rôle_sec_2'!U45","v":0},null,0,{"$f":"BP121*BS121","v":0},null,0,null," APPLICATION DU TNR QUAND TTVD",1,null,{"$f":"'Sommaire du rôle_sec_2'!AE45","v":0},{"$f":"'Sommaire du rôle_sec_2'!AF45","v":0},null,0,{"$f":"CA121*CD121","v":0},null,0,null," APPLICATION DU TNR QUAND TTVD",1,null,{"$f":"'Sommaire du rôle_sec_2'!X45","v":0},{"$f":"'Sommaire du rôle_sec_2'!Y45","v":0},null,0,{"$f":"CL121*CO121","v":0},null,0,null," APPLICATION DU TNR QUAND TTVD",1,null,{"$f":"'Sommaire du rôle_sec_2'!Z45","v":0},{"$f":"'Sommaire du rôle_sec_2'!AA45","v":0},null,0,{"$f":"CW121*CZ121","v":0},null,0]
["Total",null,null,null,null,null,{"$f":"SUM(G106:G121)","v":0},{"$f":"SUM(H106:H121)","v":0},null,0,null,"Total",null,null,null,null,null,{"$f":"SUM(R106:R121)","v":0},{"$f":"SUM(S106:S121)","v":0},null,0,null,"Total",null,null,null,null,null,{"$f":"SUM(AC106:AC121)","v":0},{"$f":"SUM(AD106:AD121)","v":0},null,0,null,"Total",null,null,null,null,null,{"$f":"SUM(AN106:AN121)","v":0},{"$f":"SUM(AO106:AO121)","v":0},null,0,null,"Total",null,null,null,null,null,{"$f":"SUM(AY106:AY121)","v":0},{"$f":"SUM(AZ106:AZ121)","v":0},null,0,null,"Total",null,null,null,null,null,{"$f":"SUM(BJ106:BJ121)","v":0},{"$f":"SUM(BK106:BK121)","v":0},null,0,null,"Total",null,null,null,null,null,{"$f":"SUM(BU106:BU121)","v":0},{"$f":"SUM(BV106:BV121)","v":0},null,0,null,"Total",null,null,null,null,null,{"$f":"SUM(CF106:CF121)","v":0},{"$f":"SUM(CG106:CG121)","v":0},null,0,null,"Total",null,null,null,null,null,{"$f":"SUM(CQ106:CQ121)","v":0},{"$f":"SUM(CR106:CR121)","v":0},null,0,null,"Total",null,null,null,null,null,{"$f":"SUM(DB106:DB121)","v":0},{"$f":"SUM(DC106:DC121)","v":0},null,0]
[]
["ASSIETTE SOUS-CATÉGORIE RÉSIDUELLE"]
["Classe non résidentielle","Pourcentage de taxation",null,"VALEUR À 100 %"]
[null,null,null,"  Imposables","Compensables",null,"Imposables pondérées","Compensables pondérées",null,"Total"]
[null,"(1)",null,"(2)","(3)",null,"(4) = (1) X (2)","(5) = (1) X (3)",null,"(6) = (4) + (5)"]
[" 1A",0.999,null,{"$f":"'Sommaire du rôle_sec_2'!F53","v":0},{"$f":"'Sommaire du rôle_sec_2'!G53","v":0},null,{"$f":"D128*B128","v":0},{"$f":"B128*E128","v":0},null,{"$f":"G128+H128","v":0},2359638]
[" 1B",0.995,null,{"$f":"'Sommaire du rôle_sec_2'!F54","v":0},{"$f":"'Sommaire du rôle_sec_2'!G54","v":0},null,0,0,null,0,670132.5]
[" 1C",0.99,null,{"$f":"'Sommaire du rôle_sec_2'!F55","v":0},{"$f":"'Sommaire du rôle_sec_2'!G55","v":0},null,0,0,null,0,4405005]
[2,0.97,null,{"$f":"'Sommaire du rôle_sec_2'!F56","v":0},{"$f":"'Sommaire du rôle_sec_2'!G56","v":0},null,0,0,null,0,21413332]
[3,0.94,null,{"$f":"'Sommaire du rôle_sec_2'!F57","v":0},{"$f":"'Sommaire du rôle_sec_2'!G57","v":0},null,0,0,null,0,36190282]
[4,0.88,null,{"$f":"'Sommaire du rôle_sec_2'!F58","v":0},{"$f":"'Sommaire du rôle_sec_2'!G58","v":0},null,0,0,null,0,27846104]
[5,0.78,null,{"$f":"'Sommaire du rôle_sec_2'!F59","v":0},{"$f":"'Sommaire du rôle_sec_2'!G59","v":0},null,0,0,null,0,22550424]
[6,0.6,null,{"$f":"'Sommaire du rôle_sec_2'!F60","v":0},{"$f":"'Sommaire du rôle_sec_2'!G60","v":0},null,0,0,null,0,19039560]
[7,0.4,null,{"$f":"'Sommaire du rôle_sec_2'!F61","v":0},{"$f":"'Sommaire du rôle_sec_2'!G61","v":0},null,0,0,null,0,37782600]
[8,0.15000000000000002,null,{"$f":"'Sommaire du rôle_sec_2'!F62","v":0},{"$f":"'Sommaire du rôle_sec_2'!G62","v":0},null,0,0,null,0,32037030.000000004]
["IMMEUBLES SANS PARTIE NON RÉSIDENTIELLE",1,null,{"$f":"'Sommaire du rôle_sec_2'!F63","v":0},{"$f":"'Sommaire du rôle_sec_2'!G63","v":0},null,0,0,null,0,7336485128]
["12  CHSLD",0.8,null,{"$f":"'Sommaire du rôle_sec_2'!F64","v":0},{"$f":"'Sommaire du rôle_sec_2'!G64","v":0},null,0]
["13 Cours de triage ",0.6,null,{"$f":"'Sommaire du rôle_sec_2'!F65","v":0},{"$f":"'Sommaire du rôle_sec_2'!G65","v":0},null,0]
["Total",null,null,null,null,null,{"$f":"SUM(G128:G140)","v":0},{"$f":"SUM(H128:H138)","v":0},{"$f":"SUM(I128:I138)","v":0},{"$f":"G141+H141","v":0}]
[]
["ASSIETTE AU TAUX RÉSIDENTIEL SOUS-CATÉGORIE 1",null,null,null,null,null,null,null,null,null,null,"ASSIETTE AU TAUX RÉSIDENTIEL SOUS-CATÉGORIE 2",null,null,null,null,null,null,null,null,null,null,"ASSIETTE AU TAUX RÉSIDENTIEL SOUS-CATÉGORIE 3",null,null,null,null,null,null,null,null,null,null,"ASSIETTE AU TAUX RÉSIDENTIEL SOUS-CATÉGORIE 4",null,null,null,null,null,null,null,null,null,null,"ASSIETTE AU TAUX RÉSIDENTIEL SOUS-CATÉGORIE 5",null,null,null,null,null,null,null,null,null,null,"ASSIETTE AU TAUX RÉSIDENTIEL SOUS-CATÉGORIE 6",null,null,null,null,null,null,null,null,null,null,"ASSIETTE AU TAUX RÉSIDENTIEL SOUS-CATÉGORIE 7",null,null,null,null,null,null,null,null,null,null,"ASSIETTE AU TAUX RÉSIDENTIEL SOUS-CATÉGORIE 8",null,null,null,null,null,null,null,null,null,null,"ASSIETTE AU TAUX RÉSIDENTIEL SOUS-CATÉGORIE 9",null,null,null,null,null,null,null,null,null,null,"ASSIETTE AU TAUX RÉSIDENTIEL SOUS-CATÉGORIE 10"]
["Classe non résidentielle","Pourcentage de taxation",null,"VALEUR À 100 %",null,null,null,null,null,null,null,"Classe non résidentielle","Pourcentage de taxation",null,"VALEUR À 100 %",null,null,null,null,null,null,null,"Classe non résidentielle","Pourcentage de taxation",null,"VALEUR À 100 %",null,null,null,null,null,null,null,"Classe non résidentielle","Pourcentage de taxation",null,"VALEUR À 100 %",null,null,null,null,null,null,null,"Classe non résidentielle","Pourcentage de taxation",null,"VALEUR À 100 %",null,null,null,null,null,null,null,"Classe non résidentielle","Pourcentage de taxation",null,"VALEUR À 100 %",null,null,null,null,null,null,null,"Classe non résidentielle","Pourcentage de taxation",null,"VALEUR À 100 %",null,null,null,null,null,null,null,"Classe non résidentielle","Pourcentage de taxation",null,"VALEUR À 100 %",null,null,null,null,null,null,null,"Classe non résidentielle","Pourcentage de taxation",null,"VALEUR À 100 %",null,null,null,null,null,null,null,"Classe non résidentielle","Pourcentage de taxation",null,"VALEUR À 100 %"]
[null,null,null,"  Imposables","Compensables",null,"Imposables pondérées","Compensables pondérées",null,"Total",null,null,null,null,"  Imposables","Compensables",null,"Imposables pondérées","Compensables pondérées",null,"Total",null,null,null,null,"  Imposables","Compensables",null,"Imposables pondérées","Compensables pondérées",null,"Total",null,null,null,null,"  Imposables","Compensables",null,"Imposables pondérées","Compensables pondérées",null,"Total",null,null,null,null,"  Imposables","Compensables",null,"Imposables pondérées","Compensables pondérées",null,"Total",null,null,null,null,"  Imposables","Compensables",null,"Imposables pondérées","Compensables pondérées",null,"Total",null,null,null,null,"  Imposables","Compensables",null,"Imposables pondérées","Compensables pondérées",null,"Total",null,null,null,null,"  Imposables","Compensables",null,"Imposables pondérées","Compensables pondérées",null,"Total",null,null,null,null,"  Imposables","Compensables",null,"Imposables pondérées","Compensables pondérées",null,"Total",null,null,null,null,"  Imposables","Compensables",null,"Imposables pondérées","Compensables pondérées",null,"Total"]
[null,"(1)",null,"(2)","(3)",null,"(4) = (1) X (2)","(5) = (1) X (3)",null,"(6) = (4) + (5)",null,null,"(1)",null,"(2)","(3)",null,"(4) = (1) X (2)","(5) = (1) X (3)",null,"(6) = (4) + (5)",null,null,"(1)",null,"(2)","(3)",null,"(4) = (1) X (2)","(5) = (1) X (3)",null,"(6) = (4) + (5)",null,null,"(1)",null,"(2)","(3)",null,"(4) = (1) X (2)","(5) = (1) X (3)",null,"(6) = (4) + (5)",null,null,"(1)",null,"(2)","(3)",null,"(4) = (1) X (2)","(5) = (1) X (3)",null,"(6) = (4) + (5)",null,null,"(1)",null,"(2)","(3)",null,"(4) = (1) X (2)","(5) = (1) X (3)",null,"(6) = (4) + (5)",null,null,"(1)",null,"(2)","(3)",null,"(4) = (1) X (2)","(5) = (1) X (3)",null,"(6) = (4) + (5)",null,null,"(1)",null,"(2)","(3)",null,"(4) = (1) X (2)","(5) = (1) X (3)",null,"(6) = (4) + (5)",null,null,"(1)",null,"(2)","(3)",null,"(4) = (1) X (2)","(5) = (1) X (3)",null,"(6) = (4) + (5)",null,null,"(1)",null,"(2)","(3)",null,"(4) = (1) X (2)","(5) = (1) X (3)",null,"(6) = (4) + (5)"]
[" 1A",0.999,null,{"$f":"'Sommaire du rôle_sec_2'!H53","v":0},{"$f":"'Sommaire du rôle_sec_2'!I53","v":0},null,{"$f":"D147*B147","v":0},{"$f":"B147*E147","v":0},null,{"$f":"G147+H147","v":0},null," 1A",0.999,null,{"$f":"'Sommaire du rôle_sec_2'!J53","v":0},{"$f":"'Sommaire du rôle_sec_2'!K53","v":0},null,{"$f":"O147*M147","v":0},{"$f":"M147*P147","v":0},null,{"$f":"R147+S147","v":0},null," 1A",0.999,null,{"$f":"'Sommaire du rôle_sec_2'!L53","v":0},{"$f":"'Sommaire du rôle_sec_2'!M53","v":0},null,{"$f":"Z147*X147","v":0},{"$f":"X147*AA147","v":0},null,{"$f":"AC147+AD147","v":0},null," 1A",0.999,null,{"$f":"'Sommaire du rôle_sec_2'!N53","v":0},{"$f":"'Sommaire du rôle_sec_2'!O53","v":0},null,{"$f":"AK147*AI147","v":0},{"$f":"AI147*AL147","v":0},null,{"$f":"AN147+AO147","v":0},null," 1A",0.999,null,{"$f":"'Sommaire du rôle_sec_2'!P53","v":0},{"$f":"'Sommaire du rôle_sec_2'!Q53","v":0},null,{"$f":"AV147*AT147","v":0},{"$f":"AT147*AW147","v":0},null,{"$f":"AY147+AZ147","v":0},null," 1A",0.999,null,{"$f":"'Sommaire du rôle_sec_2'!R53","v":0},{"$f":"'Sommaire du rôle_sec_2'!S53","v":0},null,{"$f":"BG147*BE147","v":0},{"$f":"BE147*BH147","v":0},null,{"$f":"BJ147+BK147","v":0},null," 1A",0.999,null,{"$f":"'Sommaire du rôle_sec_2'!T53","v":0},{"$f":"'Sommaire du rôle_sec_2'!U53","v":0},null,{"$f":"BR147*BP147","v":0},{"$f":"BP147*BS147","v":0},null,{"$f":"BU147+BV147","v":0},null," 1A",0.999,null,{"$f":"'Sommaire du rôle_sec_2'!V53","v":0},{"$f":"'Sommaire du rôle_sec_2'!W53","v":0},null,{"$f":"CC147*CA147","v":0},{"$f":"CA147*CD147","v":0},null,{"$f":"CF147+CG147","v":0},null," 1A",0.999,null,{"$f":"'Sommaire du rôle_sec_2'!X53","v":0},{"$f":"'Sommaire du rôle_sec_2'!Y53","v":0},null,{"$f":"CN147*CL147","v":0},{"$f":"CL147*CO147","v":0},null,{"$f":"CQ147+CR147","v":0},null," 1A",0.999,null,{"$f":"'Sommaire du rôle_sec_2'!Z53","v":0},{"$f":"'Sommaire du rôle_sec_2'!AA53","v":0},null,{"$f":"CY147*CW147","v":0},{"$f":"CW147*CZ147","v":0},null,{"$f":"DB147+DC147","v":0}]
[" 1B",0.995,null,{"$f":"'Sommaire du rôle_sec_2'!H54","v":0},{"$f":"'Sommaire du rôle_sec_2'!I54","v":0},null,0,0,null,0,null," 1B",0.995,null,{"$f":"'Sommaire du rôle_sec_2'!J54","v":0},{"$f":"'Sommaire du rôle_sec_2'!K54","v":0},null,0,0,null,0,null," 1B",0.995,null,{"$f":"'Sommaire du rôle_sec_2'!L54","v":0},{"$f":"'Sommaire du rôle_sec_2'!M54","v":0},null,0,0,null,0,null," 1B",0.995,null,{"$f":"'Sommaire du rôle_sec_2'!N54","v":0},{"$f":"'Sommaire du rôle_sec_2'!O54","v":0},null,0,0,null,0,null," 1B",0.995,null,{"$f":"'Sommaire du rôle_sec_2'!P54","v":0},{"$f":"'Sommaire du rôle_sec_2'!Q54","v":0},null,0,0,null,0,null," 1B",0.995,null,{"$f":"'Sommaire du rôle_sec_2'!R54","v":0},{"$f":"'Sommaire du rôle_sec_2'!S54","v":0},null,0,0,null,0,null," 1B",0.995,null,{"$f":"'Sommaire du rôle_sec_2'!T54","v":0},{"$f":"'Sommaire du rôle_sec_2'!U54","v":0},null,0,0,null,0,null," 1B",0.995,null,{"$f":"'Sommaire du rôle_sec_2'!V54","v":0},{"$f":"'Sommaire du rôle_sec_2'!W54","v":0},null,0,0,null,0,null," 1B",0.995,null,{"$f":"'Sommaire du rôle_sec_2'!X54","v":0},{"$f":"'Sommaire du rôle_sec_2'!Y54","v":0},null,0,0,null,0,null," 1B",0.995,null,{"$f":"'Sommaire du rôle_sec_2'!Z54","v":0},{"$f":"'Sommaire du rôle_sec_2'!AA54","v":0},null,0,0,null,0]
[" 1C",0.99,null,{"$f":"'Sommaire du rôle_sec_2'!H55","v":0},{"$f":"'Sommaire du rôle_sec_2'!I55","v":0},null,0,0,null,0,null," 1C",0.99,null,{"$f":"'Sommaire du rôle_sec_2'!J55","v":0},{"$f":"'Sommaire du rôle_sec_2'!K55","v":0},null,0,0,null,0,null," 1C",0.99,null,{"$f":"'Sommaire du rôle_sec_2'!L55","v":0},{"$f":"'Sommaire du rôle_sec_2'!M55","v":0},null,0,0,null,0,null," 1C",0.99,null,{"$f":"'Sommaire du rôle_sec_2'!N55","v":0},{"$f":"'Sommaire du rôle_sec_2'!O55","v":0},null,0,0,null,0,null," 1C",0.99,null,{"$f":"'Sommaire du rôle_sec_2'!P55","v":0},{"$f":"'Sommaire du rôle_sec_2'!Q55","v":0},null,0,0,null,0,null," 1C",0.99,null,{"$f":"'Sommaire du rôle_sec_2'!R55","v":0},{"$f":"'Sommaire du rôle_sec_2'!S55","v":0},null,0,0,null,0,null," 1C",0.99,null,{"$f":"'Sommaire du rôle_sec_2'!T55","v":0},{"$f":"'Sommaire du rôle_sec_2'!U55","v":0},null,0,0,null,0,null," 1C",0.99,null,{"$f":"'Sommaire du rôle_sec_2'!V55","v":0},{"$f":"'Sommaire du rôle_sec_2'!W55","v":0},null,0,0,null,0,null," 1C",0.99,null,{"$f":"'Sommaire du rôle_sec_2'!X55","v":0},{"$f":"'Sommaire du rôle_sec_2'!Y55","v":0},null,0,0,null,0,null," 1C",0.99,null,{"$f":"'Sommaire du rôle_sec_2'!Z55","v":0},{"$f":"'Sommaire du rôle_sec_2'!AA55","v":0},null,0,0,null,0]
[2,0.97,null,{"$f":"'Sommaire du rôle_sec_2'!H56","v":0},{"$f":"'Sommaire du rôle_sec_2'!I56","v":0},null,0,0,null,0,null,2,0.97,null,{"$f":"'Sommaire du rôle_sec_2'!J56","v":0},{"$f":"'Sommaire du rôle_sec_2'!K56","v":0},null,0,0,null,0,null,2,0.97,null,{"$f":"'Sommaire du rôle_sec_2'!L56","v":0},{"$f":"'Sommaire du rôle_sec_2'!M56","v":0},null,0,0,null,0,null,2,0.97,null,{"$f":"'Sommaire du rôle_sec_2'!N56","v":0},{"$f":"'Sommaire du rôle_sec_2'!O56","v":0},null,0,0,null,0,null,2,0.97,null,{"$f":"'Sommaire du rôle_sec_2'!P56","v":0},{"$f":"'Sommaire du rôle_sec_2'!Q56","v":0},null,0,0,null,0,null,2,0.97,null,{"$f":"'Sommaire du rôle_sec_2'!R56","v":0},{"$f":"'Sommaire du rôle_sec_2'!S56","v":0},null,0,0,null,0,null,2,0.97,null,{"$f":"'Sommaire du rôle_sec_2'!T56","v":0},{"$f":"'Sommaire du rôle_sec_2'!U56","v":0},null,0,0,null,0,null,2,0.97,null,{"$f":"'Sommaire du rôle_sec_2'!V56","v":0},{"$f":"'Sommaire du rôle_sec_2'!W56","v":0},null,0,0,null,0,null,2,0.97,null,{"$f":"'Sommaire du rôle_sec_2'!X56","v":0},{"$f":"'Sommaire du rôle_sec_2'!Y56","v":0},null,0,0,null,0,null,2,0.97,null,{"$f":"'Sommaire du rôle_sec_2'!Z56","v":0},{"$f":"'Sommaire du rôle_sec_2'!AA56","v":0},null,0,0,null,0]
[3,0.94,null,{"$f":"'Sommaire du rôle_sec_2'!H57","v":0},{"$f":"'Sommaire du rôle_sec_2'!I57","v":0},null,0,0,null,0,null,3,0.94,null,{"$f":"'Sommaire du rôle_sec_2'!J57","v":0},{"$f":"'Sommaire du rôle_sec_2'!K57","v":0},null,0,0,null,0,null,3,0.94,null,{"$f":"'Sommaire du rôle_sec_2'!L57","v":0},{"$f":"'Sommaire du rôle_sec_2'!M57","v":0},null,0,0,null,0,null,3,0.94,null,{"$f":"'Sommaire du rôle_sec_2'!N57","v":0},{"$f":"'Sommaire du rôle_sec_2'!O57","v":0},null,0,0,null,0,null,3,0.94,null,{"$f":"'Sommaire du rôle_sec_2'!P57","v":0},{"$f":"'Sommaire du rôle_sec_2'!Q57","v":0},null,0,0,null,0,null,3,0.94,null,{"$f":"'Sommaire du rôle_sec_2'!R57","v":0},{"$f":"'Sommaire du rôle_sec_2'!S57","v":0},null,0,0,null,0,null,3,0.94,null,{"$f":"'Sommaire du rôle_sec_2'!T57","v":0},{"$f":"'Sommaire du rôle_sec_2'!U57","v":0},null,0,0,null,0,null,3,0.94,null,{"$f":"'Sommaire du rôle_sec_2'!V57","v":0},{"$f":"'Sommaire du rôle_sec_2'!W57","v":0},null,0,0,null,0,null,3,0.94,null,{"$f":"'Sommaire du rôle_sec_2'!X57","v":0},{"$f":"'Sommaire du rôle_sec_2'!Y57","v":0},null,0,0,null,0,null,3,0.94,null,{"$f":"'Sommaire du rôle_sec_2'!Z57","v":0},{"$f":"'Sommaire du rôle_sec_2'!AA57","v":0},null,0,0,null,0]
[4,0.88,null,{"$f":"'Sommaire du rôle_sec_2'!H58","v":0},{"$f":"'Sommaire du rôle_sec_2'!I58","v":0},null,0,0,null,0,null,4,0.88,null,{"$f":"'Sommaire du rôle_sec_2'!J58","v":0},{"$f":"'Sommaire du rôle_sec_2'!K58","v":0},null,0,0,null,0,null,4,0.88,null,{"$f":"'Sommaire du rôle_sec_2'!L58","v":0},{"$f":"'Sommaire du rôle_sec_2'!M58","v":0},null,0,0,null,0,null,4,0.88,null,{"$f":"'Sommaire du rôle_sec_2'!N58","v":0},{"$f":"'Sommaire du rôle_sec_2'!O58","v":0},null,0,0,null,0,null,4,0.88,null,{"$f":"'Sommaire du rôle_sec_2'!P58","v":0},{"$f":"'Sommaire du rôle_sec_2'!Q58","v":0},null,0,0,null,0,null,4,0.88,null,{"$f":"'Sommaire du rôle_sec_2'!R58","v":0},{"$f":"'Sommaire du rôle_sec_2'!S58","v":0},null,0,0,null,0,null,4,0.88,null,{"$f":"'Sommaire du rôle_sec_2'!T58","v":0},{"$f":"'Sommaire du rôle_sec_2'!U58","v":0},null,0,0,null,0,null,4,0.88,null,{"$f":"'Sommaire du rôle_sec_2'!V58","v":0},{"$f":"'Sommaire du rôle_sec_2'!W58","v":0},null,0,0,null,0,null,4,0.88,null,{"$f":"'Sommaire du rôle_sec_2'!X58","v":0},{"$f":"'Sommaire du rôle_sec_2'!Y58","v":0},null,0,0,null,0,null,4,0.88,null,{"$f":"'Sommaire du rôle_sec_2'!Z58","v":0},{"$f":"'Sommaire du rôle_sec_2'!AA58","v":0},null,0,0,null,0]
[5,0.78,null,{"$f":"'Sommaire du rôle_sec_2'!H59","v":0},{"$f":"'Sommaire du rôle_sec_2'!I59","v":0},null,0,0,null,0,null,5,0.78,null,{"$f":"'Sommaire du rôle_sec_2'!J59","v":0},{"$f":"'Sommaire du rôle_sec_2'!K59","v":0},null,0,0,null,0,null,5,0.78,null,{"$f":"'Sommaire du rôle_sec_2'!L59","v":0},{"$f":"'Sommaire du rôle_sec_2'!M59","v":0},null,0,0,null,0,null,5,0.78,null,{"$f":"'Sommaire du rôle_sec_2'!N59","v":0},{"$f":"'Sommaire du rôle_sec_2'!O59","v":0},null,0,0,null,0,null,5,0.78,null,{"$f":"'Sommaire du rôle_sec_2'!P59","v":0},{"$f":"'Sommaire du rôle_sec_2'!Q59","v":0},null,0,0,null,0,null,5,0.78,null,{"$f":"'Sommaire du rôle_sec_2'!R59","v":0},{"$f":"'Sommaire du rôle_sec_2'!S59","v":0},null,0,0,null,0,null,5,0.78,null,{"$f":"'Sommaire du rôle_sec_2'!T59","v":0},{"$f":"'Sommaire du rôle_sec_2'!U59","v":0},null,0,0,null,0,null,5,0.78,null,{"$f":"'Sommaire du rôle_sec_2'!V59","v":0},{"$f":"'Sommaire du rôle_sec_2'!W59","v":0},null,0,0,null,0,null,5,0.78,null,{"$f":"'Sommaire du rôle_sec_2'!X59","v":0},{"$f":"'Sommaire du rôle_sec_2'!Y59","v":0},null,0,0,null,0,null,5,0.78,null,{"$f":"'Sommaire du rôle_sec_2'!Z59","v":0},{"$f":"'Sommaire du rôle_sec_2'!AA59","v":0},null,0,0,null,0]
[6,0.6,null,{"$f":"'Sommaire du rôle_sec_2'!H60","v":0},{"$f":"'Sommaire du rôle_sec_2'!I60","v":0},null,0,0,null,0,null,6,0.6,null,{"$f":"'Sommaire du rôle_sec_2'!J60","v":0},{"$f":"'Sommaire du rôle_sec_2'!K60","v":0},null,0,0,null,0,null,6,0.6,null,{"$f":"'Sommaire du rôle_sec_2'!L60","v":0},{"$f":"'Sommaire du rôle_sec_2'!M60","v":0},null,0,0,null,0,null,6,0.6,null,{"$f":"'Sommaire du rôle_sec_2'!N60","v":0},{"$f":"'Sommaire du rôle_sec_2'!O60","v":0},null,0,0,null,0,null,6,0.6,null,{"$f":"'Sommaire du rôle_sec_2'!P60","v":0},{"$f":"'Sommaire du rôle_sec_2'!Q60","v":0},null,0,0,null,0,null,6,0.6,null,{"$f":"'Sommaire du rôle_sec_2'!R60","v":0},{"$f":"'Sommaire du rôle_sec_2'!S60","v":0},null,0,0,null,0,null,6,0.6,null,{"$f":"'Sommaire du rôle_sec_2'!T60","v":0},{"$f":"'Sommaire du rôle_sec_2'!U60","v":0},null,0,0,null,0,null,6,0.6,null,{"$f":"'Sommaire du rôle_sec_2'!V60","v":0},{"$f":"'Sommaire du rôle_sec_2'!W60","v":0},null,0,0,null,0,null,6,0.6,null,{"$f":"'Sommaire du rôle_sec_2'!X60","v":0},{"$f":"'Sommaire du rôle_sec_2'!Y60","v":0},null,0,0,null,0,null,6,0.6,null,{"$f":"'Sommaire du rôle_sec_2'!Z60","v":0},{"$f":"'Sommaire du rôle_sec_2'!AA60","v":0},null,0,0,null,0]
[7,0.4,null,{"$f":"'Sommaire du rôle_sec_2'!H61","v":0},{"$f":"'Sommaire du rôle_sec_2'!I61","v":0},null,0,0,null,0,null,7,0.4,null,{"$f":"'Sommaire du rôle_sec_2'!J61","v":0},{"$f":"'Sommaire du rôle_sec_2'!K61","v":0},null,0,0,null,0,null,7,0.4,null,{"$f":"'Sommaire du rôle_sec_2'!L61","v":0},{"$f":"'Sommaire du rôle_sec_2'!M61","v":0},null,0,0,null,0,null,7,0.4,null,{"$f":"'Sommaire du rôle_sec_2'!N61","v":0},{"$f":"'Sommaire du rôle_sec_2'!O61","v":0},null,0,0,null,0,null,7,0.4,null,{"$f":"'Sommaire du rôle_sec_2'!P61","v":0},{"$f":"'Sommaire du rôle_sec_2'!Q61","v":0},null,0,0,null,0,null,7,0.4,null,{"$f":"'Sommaire du rôle_sec_2'!R61","v":0},{"$f":"'Sommaire du rôle_sec_2'!S61","v":0},null,0,0,null,0,null,7,0.4,null,{"$f":"'Sommaire du rôle_sec_2'!T61","v":0},{"$f":"'Sommaire du rôle_sec_2'!U61","v":0},null,0,0,null,0,null,7,0.4,null,{"$f":"'Sommaire du rôle_sec_2'!V61","v":0},{"$f":"'Sommaire du rôle_sec_2'!W61","v":0},null,0,0,null,0,null,7,0.4,null,{"$f":"'Sommaire du rôle_sec_2'!X61","v":0},{"$f":"'Sommaire du rôle_sec_2'!Y61","v":0},null,0,0,null,0,null,7,0.4,null,{"$f":"'Sommaire du rôle_sec_2'!Z61","v":0},{"$f":"'Sommaire du rôle_sec_2'!AA61","v":0},null,0,0,null,0]
[8,0.15000000000000002,null,{"$f":"'Sommaire du rôle_sec_2'!H62","v":0},{"$f":"'Sommaire du rôle_sec_2'!I62","v":0},null,0,0,null,0,null,8,0.15000000000000002,null,{"$f":"'Sommaire du rôle_sec_2'!J62","v":0},{"$f":"'Sommaire du rôle_sec_2'!K62","v":0},null,0,0,null,0,null,8,0.15000000000000002,null,{"$f":"'Sommaire du rôle_sec_2'!L62","v":0},{"$f":"'Sommaire du rôle_sec_2'!M62","v":0},null,0,0,null,0,null,8,0.15000000000000002,null,{"$f":"'Sommaire du rôle_sec_2'!N62","v":0},{"$f":"'Sommaire du rôle_sec_2'!O62","v":0},null,0,0,null,0,null,8,0.15000000000000002,null,{"$f":"'Sommaire du rôle_sec_2'!P62","v":0},{"$f":"'Sommaire du rôle_sec_2'!Q62","v":0},null,0,0,null,0,null,8,0.15000000000000002,null,{"$f":"'Sommaire du rôle_sec_2'!R62","v":0},{"$f":"'Sommaire du rôle_sec_2'!S62","v":0},null,0,0,null,0,null,8,0.15000000000000002,null,{"$f":"'Sommaire du rôle_sec_2'!T62","v":0},{"$f":"'Sommaire du rôle_sec_2'!U62","v":0},null,0,0,null,0,null,8,0.15000000000000002,null,{"$f":"'Sommaire du rôle_sec_2'!V62","v":0},{"$f":"'Sommaire du rôle_sec_2'!W62","v":0},null,0,0,null,0,null,8,0.15000000000000002,null,{"$f":"'Sommaire du rôle_sec_2'!X62","v":0},{"$f":"'Sommaire du rôle_sec_2'!Y62","v":0},null,0,0,null,0,null,8,0.15000000000000002,null,{"$f":"'Sommaire du rôle_sec_2'!Z62","v":0},{"$f":"'Sommaire du rôle_sec_2'!AA62","v":0},null,0,0,null,0]
["IMMEUBLES SANS PARTIE NON RÉSIDENTIELLE",1,null,{"$f":"'Sommaire du rôle_sec_2'!H63","v":0},{"$f":"'Sommaire du rôle_sec_2'!I63","v":0},null,0,0,null,0,null,"IMMEUBLES SANS PARTIE NON RÉSIDENTIELLE",1,null,{"$f":"'Sommaire du rôle_sec_2'!J63","v":0},{"$f":"'Sommaire du rôle_sec_2'!K63","v":0},null,0,0,null,0,null,"IMMEUBLES SANS PARTIE NON RÉSIDENTIELLE",1,null,{"$f":"'Sommaire du rôle_sec_2'!L63","v":0},{"$f":"'Sommaire du rôle_sec_2'!M63","v":0},null,0,0,null,0,null,"IMMEUBLES SANS PARTIE NON RÉSIDENTIELLE",1,null,{"$f":"'Sommaire du rôle_sec_2'!N63","v":0},{"$f":"'Sommaire du rôle_sec_2'!O63","v":0},null,0,0,null,0,null,"IMMEUBLES SANS PARTIE NON RÉSIDENTIELLE",1,null,{"$f":"'Sommaire du rôle_sec_2'!P63","v":0},{"$f":"'Sommaire du rôle_sec_2'!Q63","v":0},null,0,0,null,0,null,"IMMEUBLES SANS PARTIE NON RÉSIDENTIELLE",1,null,{"$f":"'Sommaire du rôle_sec_2'!R63","v":0},{"$f":"'Sommaire du rôle_sec_2'!S63","v":0},null,0,0,null,0,null,"IMMEUBLES SANS PARTIE NON RÉSIDENTIELLE",1,null,{"$f":"'Sommaire du rôle_sec_2'!T63","v":0},{"$f":"'Sommaire du rôle_sec_2'!U63","v":0},null,0,0,null,0,null,"IMMEUBLES SANS PARTIE NON RÉSIDENTIELLE",1,null,{"$f":"'Sommaire du rôle_sec_2'!V63","v":0},{"$f":"'Sommaire du rôle_sec_2'!W63","v":0},null,0,0,null,0,null,"IMMEUBLES SANS PARTIE NON RÉSIDENTIELLE",1,null,{"$f":"'Sommaire du rôle_sec_2'!X63","v":0},{"$f":"'Sommaire du rôle_sec_2'!Y63","v":0},null,0,0,null,0,null,"IMMEUBLES SANS PARTIE NON RÉSIDENTIELLE",1,null,{"$f":"'Sommaire du rôle_sec_2'!Z63","v":0},{"$f":"'Sommaire du rôle_sec_2'!AA63","v":0},null,0,0,null,0]
["12  CHSLD",0.8,null,null,null,null,0,null,null,null,null,"12  CHSLD",0.8,null,null,null,null,0,null,null,null,null,"12  CHSLD",0.8,null,null,null,null,0,null,null,null,null,"12  CHSLD",0.8,null,null,null,null,0,null,null,null,null,"12  CHSLD",0.8,null,null,null,null,0,null,null,null,null,"12  CHSLD",0.8,null,null,null,null,0,null,null,null,null,"12  CHSLD",0.8,null,null,null,null,0,null,null,null,null,"12  CHSLD",0.8,null,null,null,null,0,null,null,null,null,"12  CHSLD",0.8,null,null,null,null,null,null,null,null,null,"12  CHSLD",0.8]
["13 Cours de triage ",0.6,null,null,null,null,0,null,null,null,null,"13 Cours de triage ",0.6,null,null,null,null,0,null,null,null,null,"13 Cours de triage ",0.6,null,null,null,null,0,null,null,null,null,"13 Cours de triage ",0.6,null,null,null,null,0,null,null,null,null,"13 Cours de triage ",0.6,null,null,null,null,0,null,null,null,null,"13 Cours de triage ",0.6,null,null,null,null,0,null,null,null,null,"13 Cours de triage ",0.6,null,null,null,null,0,null,null,null,null,"13 Cours de triage ",0.6,null,null,null,null,0,null,null,null,null,"13 Cours de triage ",0.6,null,null,null,null,null,null,null,null,null,"13 Cours de triage ",0.6]
["Total",null,null,null,null,null,{"$f":"SUM(G147:G159)","v":0},{"$f":"SUM(H147:H157)","v":0},{"$f":"SUM(I147:I157)","v":0},{"$f":"G160+H160","v":0},null,"Total",null,null,null,null,null,{"$f":"SUM(R147:R159)","v":0},{"$f":"SUM(S147:S157)","v":0},null,{"$f":"R160+S160","v":0},null,"Total",null,null,null,null,null,{"$f":"SUM(AC147:AC159)","v":0},{"$f":"SUM(AD147:AD157)","v":0},null,{"$f":"AC160+AD160","v":0},null,"Total",null,null,null,null,null,{"$f":"SUM(AN147:AN159)","v":0},{"$f":"SUM(AO147:AO157)","v":0},null,{"$f":"AN160+AO160","v":0},null,"Total",null,null,null,null,null,{"$f":"SUM(AY147:AY159)","v":0},{"$f":"SUM(AZ147:AZ157)","v":0},null,{"$f":"AY160+AZ160","v":0},null,"Total",null,null,null,null,null,{"$f":"SUM(BJ147:BJ159)","v":0},{"$f":"SUM(BK147:BK157)","v":0},null,{"$f":"BJ160+BK160","v":0},null,"Total",null,null,null,null,null,{"$f":"SUM(BU147:BU159)","v":0},{"$f":"SUM(BV147:BV157)","v":0},null,{"$f":"BU160+BV160","v":0},null,"Total",null,null,null,null,null,{"$f":"SUM(CF147:CF159)","v":0},{"$f":"SUM(CG147:CG157)","v":0},null,{"$f":"CF160+CG160","v":0},null,"Total",null,null,null,null,null,{"$f":"SUM(CQ147:CQ159)","v":0},{"$f":"SUM(CR147:CR157)","v":0},null,{"$f":"CQ160+CR160","v":0},null,"Total",null,null,null,null,null,{"$f":"SUM(DB147:DB159)","v":0},{"$f":"SUM(DC147:DC157)","v":0},null,{"$f":"DB160+DC160","v":0}]

{"sheet":"Sommaire du rôle_sec_3","index":5,"n_rows":84,"n_cols":27,"rows_kept":84,"cut":false,"hidden":false,"merged":[[80,5,81,5],[80,6,81,6],[80,7,81,7],[80,8,81,8],[74,12,75,12],[74,13,75,13],[71,5,71,6],[71,7,71,10],[71,11,71,13],[80,9,81,9],[80,10,81,10],[80,11,81,11],[80,12,81,12],[80,13,81,13],[71,14,71,15],[74,5,75,5],[74,6,75,6],[74,7,75,7],[74,8,75,8],[74,9,75,9],[74,10,75,10],[74,14,75,14],[74,15,75,15],[70,5,70,6],[70,7,70,10],[70,11,70,13],[70,14,70,15],[51,1,51,4],[65,5,65,6],[65,7,65,8],[65,9,65,10],[65,11,65,12],[65,13,65,14],[68,5,69,6],[68,7,69,10],[68,11,69,13],[68,14,68,15],[69,14,69,15],[65,15,65,16],[80,14,81,14],[80,15,81,15],[74,11,75,11],[65,21,65,22],[65,23,65,24],[65,25,65,26],[50,19,50,20],[50,21,50,22],[27,23,27,24],[27,25,27,26],[47,1,47,26],[48,1,49,4],[48,7,48,8],[49,23,49,24],[49,25,49,26],[50,1,50,4],[50,5,50,6],[50,7,50,8],[50,9,50,10],[50,11,50,12],[50,13,50,14],[50,15,50,16],[50,17,50,18],[50,23,50,24],[50,25,50,26],[65,17,65,18],[65,19,65,20],[45,11,45,12],[45,13,45,14],[45,15,45,16],[45,17,45,18],[45,19,45,20],[48,23,48,24],[48,25,48,26],[49,21,49,22],[48,21,48,22],[45,21,45,22],[45,23,45,24],[45,25,45,26],[49,7,49,8],[49,9,49,10],[49,11,49,12],[49,13,49,14],[49,15,49,16],[49,17,49,18],[49,19,49,20],[48,9,48,10],[48,11,48,12],[48,13,48,14],[48,15,48,16],[48,17,48,18],[48,19,48,20],[27,19,27,20],[27,21,27,22],[24,1,24,26],[25,1,26,4],[25,7,25,8],[25,9,25,10],[25,11,25,12],[26,23,26,24],[26,25,26,26],[27,1,27,4],[27,5,27,6],[27,7,27,8],[27,9,27,10],[27,11,27,12],[27,13,27,14],[27,15,27,16],[27,17,27,18],[25,25,25,26],[26,17,26,18],[26,19,26,20],[26,21,26,22],[25,17,25,18],[25,19,25,20],[25,21,25,22],[28,1,28,4],[45,5,45,6],[45,7,45,8],[45,9,45,10],[18,11,18,13],[19,11,19,12],[21,8,21,10],[21,11,21,12],[21,15,21,16],[22,11,22,12],[22,15,22,16],[26,7,26,8],[26,9,26,10],[26,11,26,12],[26,13,26,14],[26,15,26,16],[25,13,25,14],[25,15,25,16],[25,23,25,24],[4,5,4,6],[4,7,4,8],[4,9,4,10],[4,15,4,16],[5,11,5,12],[5,13,5,14],[6,11,15,11],[16,11,17,13],[16,14,16,16],[1,1,1,16],[2,5,2,6],[2,7,2,8],[2,9,2,10],[2,15,2,16],[3,1,3,4],[3,5,3,6],[3,7,3,8],[3,9,3,10],[3,11,3,12],[3,13,3,14],[3,15,3,16]]}
[]
[null,"  ASSIETTES D'APPLICATION DES TAUX DE LA TAXE FONCIÈRE GÉNÉRALE 9"]
[null,"TAUX APPLICABLES",null,null,null,"TAUX NON RÉSIDENTIEL",null,"TAUX INDUSTRIEL (CLASSE 2)",null,"TAUX IND. (SAUF CL.1 ET 2)",null,"TAUX AGRICOLE",null,"TAUX FORESTIER",null,"TAUX CATÉGORIE RÉSIDUELLE"]
[null,"NOMBRE DE SECTEURS",null,null,null,null,null,null,null,null,null,null,null,null,null,null,null,null,{"$f":"IF(OR(F4>0,H4>0,J4>0,L4>0,N4>0,P4>0),\"UTILISER LE SIMULATEUR POUR LA TAXATION DE SECTEUR\",\"-\")","v":"-"}]
[null,"CLASSE NON RÉSIDENTIELLE ET",null,null,null,"VAL. NR À 100 % ET IND. CL. 2 À 50 %",null,"VALEUR À 50 %",null,"VALEUR À 100 %",null,"VALEURS À 100 % IMPOSABLES",null,"VALEURS À 100 % IMPOSABLES",null,"VALEUR À 100 %"]
[null,"POURCENTAGE DE TAXATION",null,null,null,"  IMPOSABLES","COMPENSABLES","  IMPOSABLES","COMPENSABLES","  IMPOSABLES","COMPENSABLES",null,null,null,null,"  IMPOSABLES","COMPENSABLES"]
[null," 1A",":     0,1 %",null,901,76534150,0,null,null,null,null,null,null,null,"99,9 % ",76534150,0]
[null," 1B",":     0,5 %",null,902,34712370,0,null,null,null,null,null,null,null,"99,5 % ",34712370,0]
[null," 1C",":     1 %",null,903,4894450,0,null,null,null,null,null,null,null,"99 % ",4894450,0]
[null," 2",":     3 %",null,904,23616670,0,null,null,605900,null,null,null,null,"97 % ",23616670,0]
[null," 3",":     6 %",null,905,44153450,0,null,null,181400,null,null,null,null,"94 % ",44153450,0]
[null," 4",":     12 %",null,906,60256460,0,null,null,215700,null,null,null,null,"88 % ",60256460,0]
[null," 5",":     22 %",null,907,38643990,0,null,null,null,null,null,null,null,"78 % ",38643990,0]
[null," 6",":     40 %",null,908,38532890,0,290100,null,2421200,null,null,null,null,"60 % ",38532890,0]
[null," 7",":     60 %",null,909,39569365,72376370,350350,null,354000,null,null,null,null,"40 % ",39569365,72376370]
[null," 8",":     85 %",null,910,22323070,211592260,null,null,1875900,null,null,null,null,"15 % ",22323070,211592260]
[null," 9",":     100 %",null,911,3177900,0,null,null,null,null,"TAUX TERRAINS VAGUES \nDESSERVIS"]
[null," 10",":     100 %",null,912,1155755205,61905690,10515650,null,225704400,2325200,null,null,null,null,8068032861,2100780]
[null," 11",":  Cours de triage 100 %",null,913,null,null,null,null,null,null,"VALEURS À 100 %"]
[null," 12",":  CHSLD 20 %",null,914,13938200,null,null,null,null,null,"  IMPOSABLES",null,"COMPENSABLES","80 % ",{"$f":"F20","v":13938200}]
[null," 13",":  Cours de triage 40 %",null,915,null,"CFIL (chemin de fer d'intérêt local)",null,null,null,null,null,null,null,"60 % ",{"$f":"F21","v":0}]
[null," APPLICATION DU TNR QUAND TTVD",null,null,916,5228300,null,null,"(TTVD − TAUX DE BASE) x ",null,null,{"$f":"F22","v":5228300},null,{"$f":"G22","v":0}]
[null," ASSIETTES D'APPLICATION ",null,null,917,{"$f":"F71+F72","v":1529652563.0999999},null,null,{"$f":"H71+H72","v":241701840},null,"(TTVD) x ",76716400,null,58400,null,{"$f":"O71+O72","v":8447691867.8999996}]
[]
[null,"ASSIETTES D'APPLICATION DES TAUX RELATIFS AUX SOUS-CATÉGORIES DES IMMEUBLES NON RÉSIDENTIELS (si applicables)"]
[null,"DÉNOMINATION DE LA SOUS-CATÉGORIE",null,null,null,"TAUX SOUS-CATÉGORIE DE RÉFÉRENCE",null,"TAUX SOUS-CATÉGORIE 1",null,"TAUX SOUS-CATÉGORIE 2",null,"TAUX SOUS-CATÉGORIE 3",null,"TAUX SOUS-CATÉGORIE 4",null,"TAUX SOUS-CATÉGORIE 5",null,"TAUX SOUS-CATÉGORIE 6",null,"TAUX SOUS-CATÉGORIE 7",null,"TAUX SOUS-CATÉGORIE 8",null,"TAUX SOUS-CATÉGORIE 9",null,"TAUX SOUS-CATÉGORIE 10"]
[]
[null,"NOMBRE DE SECTEURS"]
[null,"POURCENTAGE DE TAXATION",null,null,null,"  IMPOSABLES","COMPENSABLES","  IMPOSABLES","COMPENSABLES","  IMPOSABLES","COMPENSABLES","  IMPOSABLES","COMPENSABLES","  IMPOSABLES","COMPENSABLES","  IMPOSABLES","COMPENSABLES","  IMPOSABLES","COMPENSABLES","  IMPOSABLES","COMPENSABLES","  IMPOSABLES","COMPENSABLES","  IMPOSABLES","COMPENSABLES","  IMPOSABLES","COMPENSABLES"]
[null," 1A","     0,1 %",null,{"$f":"E22+1","v":917}]
[null," 1B","     0,5 %",null,{"$f":"E30+1","v":918}]
[null," 1C","     1 %",null,919]
[null," 2","     3 %",null,920]
[null," 3","     6 %",null,921]
[null," 4","     12 %",null,922]
[null," 5","     22 %",null,923]
[null," 6","     40 %",null,924]
[null," 7","     60 %",null,925]
[null," 8","     85 %",null,926]
[null," 9","     100 %",null,927]
[null," 10","     100 %",null,928]
[null," 11","  Cours de triage 100 %",null,929]
[null," 12","  CHSLD 20 %",null,930]
[null," 13","  Cours de triage 40 %",null,931,null,"CFIL"]
[null," APPLICATION DU TNR QUAND TTVD",null,null,932]
[null," ASSIETTES D'APPLICATION ",null,null,933,{"$f":"F77+F78","v":0},null,{"$f":"G77+G78","v":0},null,{"$f":"H77+H78","v":0},null,{"$f":"I77+I78","v":0},null,{"$f":"J77+J78","v":0},null,{"$f":"K77+K78","v":0},null,{"$f":"L77+L78","v":0},null,{"$f":"M77+M78","v":0},null,{"$f":"N77+N78","v":0},null,{"$f":"O77+O78","v":0},null,{"$f":"P77+P78","v":0}]
[]
[null,"ASSIETTES D'APPLICATION DES TAUX RELATIFS AUX SOUS-CATÉGORIES DES IMMEUBLES RÉSIDENTIELS (si applicables)"]
[null,"DÉNOMINATION DE LA SOUS-CATÉGORIE",null,null,null,"TAUX SOUS-CATÉGORIE RÉSIDUELLE",null,"TAUX SOUS-CATÉGORIE 1",null,"TAUX SOUS-CATÉGORIE 2",null,"TAUX SOUS-CATÉGORIE 3",null,"TAUX SOUS-CATÉGORIE 4",null,"TAUX SOUS-CATÉGORIE 5",null,"TAUX SOUS-CATÉGORIE 6",null,"TAUX SOUS-CATÉGORIE 7",null,"TAUX SOUS-CATÉGORIE 8",null,"TAUX SOUS-CATÉGORIE 9",null,"TAUX SOUS-CATÉGORIE 10"]
[]
[null,"NOMBRE DE SECTEURS"]
[null,"POURCENTAGE DE TAXATION",null,null,null,"  IMPOSABLES","COMPENSABLES","  IMPOSABLES","COMPENSABLES","  IMPOSABLES","COMPENSABLES","  IMPOSABLES","COMPENSABLES","  IMPOSABLES","COMPENSABLES","  IMPOSABLES","COMPENSABLES","  IMPOSABLES","COMPENSABLES","  IMPOSABLES","COMPENSABLES","  IMPOSABLES","COMPENSABLES","  IMPOSABLES","COMPENSABLES","  IMPOSABLES","COMPENSABLES"]
[null," 1A","99,9 % ",null,935]
[null," 1B","99,5 % ",null,{"$f":"E53+1","v":936}]
[null," 1C","99 % ",null,937]
[null," 2","97 % ",null,938]
[null," 3","94 % ",null,939]
[null," 4","88 % ",null,940]
[null," 5","78 % ",null,941]
[null," 6","60 % ",null,942]
[null," 7","40 % ",null,943]
[null," 8","15 % ",null,944]
[null," 9","100% immeubles sans partie non résidentielle",null,945]
[null," 12","  CHSLD 80 %",null,946]
[null," 13","  Cours de triage 60 %",null,947]
[null," ASSIETTES D'APPLICATION ",null,null,948,{"$f":"F83+F84","v":0},null,{"$f":"G83+G84","v":0},null,{"$f":"H83+H84","v":0},null,{"$f":"I83+I84","v":0},null,{"$f":"J83+J84","v":0},null,{"$f":"K83+K84","v":0},null,{"$f":"L83+L84","v":0},null,{"$f":"M83+M84","v":0},null,{"$f":"N83+N84","v":0},null,{"$f":"O83+O84","v":0},null,{"$f":"P83+P84","v":0}]
[]
[]
[null,null,null,null,null,"TAUX NON RÉSIDENTIEL",null,"TAUX INDUSTRIEL ",null,null,null,"TAUX TERRAINS VAGUES \nDESSERVIS",null,null,"TAUX CATÉGORIE RÉSIDUELLE (TAUX DE BASE)"]
[]
[null,null,"Assiette imposable",null,null,{"$f":"'Détermination_sec_3 '!G23","v":1244467630.0999999},null,{"$f":"'Détermination_sec_3 '!G41+'Détermination_sec_3 '!G59","v":239376640},null,null,null,{"$f":"L23","v":76716400},null,null,{"$f":"'Détermination_sec_3 '!G78","v":8384901700.8999996}]
[null,null,"Assiette compensable",null,null,{"$f":"'Détermination_sec_3 '!H23","v":285184933},null,{"$f":"'Détermination_sec_3 '!H41+'Détermination_sec_3 '!H59","v":2325200},null,null,null,{"$f":"N23","v":58400},null,null,{"$f":"'Détermination_sec_3 '!H78","v":62790167}]
[]
[null,"Sous-catégorie des immeubles non résidentiels"]
[null,null,null,null,null,"TAUX SOUS-CATÉGORIE DE RÉFÉRENCE","Sous-catégorie 1","Sous-catégorie 2","Sous-catégorie 3","Sous-catégorie 4","Sous-catégorie 5","Sous-catégorie 6","Sous-catégorie 7","Sous-catégorie 8","Sous-catégorie 9","Sous-catégorie 10"]
[]
[null,null,"Assiette imposable",null,null,{"$f":"'Détermination_sec_3 '!G100","v":0},{"$f":"'Détermination_sec_3 '!G122","v":0},{"$f":"'Détermination_sec_3 '!R122","v":0},{"$f":"'Détermination_sec_3 '!AC122","v":0},{"$f":"'Détermination_sec_3 '!AN122","v":0},{"$f":"'Détermination_sec_3 '!AY122","v":0},{"$f":"'Détermination_sec_3 '!BJ122","v":0},{"$f":"'Détermination_sec_3 '!BU122","v":0},{"$f":"'Détermination_sec_3 '!CF122","v":0},{"$f":"'Détermination_sec_3 '!CQ122","v":0},{"$f":"'Détermination_sec_3 '!DB122","v":0}]
[null,null,"Assiette compensable",null,null,{"$f":"'Détermination_sec_3 '!H100","v":0},{"$f":"'Détermination_sec_3 '!H122","v":0},{"$f":"'Détermination_sec_3 '!S122","v":0},{"$f":"'Détermination_sec_3 '!AD122","v":0},{"$f":"'Détermination_sec_3 '!AO122","v":0},{"$f":"'Détermination_sec_3 '!AZ122","v":0},{"$f":"'Détermination_sec_3 '!BK122","v":0},{"$f":"'Détermination_sec_3 '!BV122","v":0},{"$f":"'Détermination_sec_3 '!CG122","v":0},{"$f":"'Détermination_sec_3 '!CR122","v":0},{"$f":"'Détermination_sec_3 '!DC122","v":0}]
[]
[null,"Sous-catégorie des immeubles résidentiels"]
[null,null,null,null,null,"TAUX SOUS-CATÉGORIE RÉSIDUELLE","Sous-catégorie 1","Sous-catégorie 2","Sous-catégorie 3","Sous-catégorie 4","Sous-catégorie 5","Sous-catégorie 6","Sous-catégorie 7","Sous-catégorie 8","Sous-catégorie 9","Sous-catégorie 10"]
[]
[null,null,"Assiette imposable",null,null,{"$f":"'Détermination_sec_3 '!G141","v":0},{"$f":"'Détermination_sec_3 '!G160","v":0},{"$f":"'Détermination_sec_3 '!R160","v":0},{"$f":"'Détermination_sec_3 '!AC160","v":0},{"$f":"'Détermination_sec_3 '!AN160","v":0},{"$f":"'Détermination_sec_3 '!AY160","v":0},{"$f":"'Détermination_sec_3 '!BJ160","v":0},{"$f":"'Détermination_sec_3 '!BU160","v":0},{"$f":"'Détermination_sec_3 '!CF160","v":0},{"$f":"'Détermination_sec_3 '!CQ160","v":0},{"$f":"'Détermination_sec_3 '!DB160","v":0}]
[null,null,"Assiette compensable",null,null,{"$f":"'Détermination_sec_3 '!H141","v":0},{"$f":"'Détermination_sec_3 '!H160","v":0},{"$f":"'Détermination_sec_3 '!S160","v":0},{"$f":"'Détermination_sec_3 '!AD160","v":0},{"$f":"'Détermination_sec_3 '!AO160","v":0},{"$f":"'Détermination_sec_3 '!AZ160","v":0},{"$f":"'Détermination_sec_3 '!BK160","v":0},{"$f":"'Détermination_sec_3 '!BV160","v":0},{"$f":"'Détermination_sec_3 '!CG160","v":0},{"$f":"'Détermination_sec_3 '!CR160","v":0},{"$f":"'Détermination_sec_3 '!DC160","v":0}]

{"sheet":"Détermination_sec_3 ","index":6,"n_rows":160,"n_cols":109,"rows_kept":160,"cut":false,"hidden":true,"merged":[[143,102,143,103],[143,66,144,66],[143,67,144,67],[143,69,143,70],[143,77,144,77],[143,78,144,78],[143,80,143,81],[143,88,144,88],[143,89,144,89],[143,91,143,92],[143,99,144,99],[143,100,144,100],[143,58,143,59],[143,22,144,22],[143,23,144,23],[143,25,143,26],[143,33,144,33],[143,34,144,34],[143,36,143,37],[143,44,144,44],[143,45,144,45],[143,47,143,48],[143,55,144,55],[143,56,144,56],[143,0,144,0],[143,1,144,1],[143,3,143,4],[143,11,144,11],[143,12,144,12],[143,14,143,15],[102,99,103,99],[102,100,103,100],[102,102,102,103],[124,0,125,0],[124,1,125,1],[124,3,124,4],[102,77,103,77],[102,78,103,78],[102,80,102,81],[102,88,103,88],[102,47,102,48],[102,89,103,89],[102,91,102,92],[102,55,103,55],[102,56,103,56],[102,58,102,59],[102,66,103,66],[102,67,103,67],[102,69,102,70],[102,33,103,33],[102,34,103,34],[102,36,102,37],[102,44,103,44],[102,45,103,45],[102,25,102,26],[80,0,81,0],[80,1,81,1],[80,3,80,4],[102,0,103,0],[102,1,103,1],[102,3,102,4],[102,11,103,11],[102,12,103,12],[102,14,102,15],[102,22,103,22],[102,23,103,23],[43,0,44,0],[43,1,44,1],[43,3,43,4],[61,0,62,0],[61,1,62,1],[61,3,61,4],[3,0,4,0],[3,1,4,1],[3,3,3,4],[25,0,26,0],[25,1,26,1],[25,3,25,4]]}
["DÉTERMINATION DES ASSIETTES "]
[]
["ASSIETTE AU TAUX NON RÉSIDENTIEL"]
["Classe non résidentielle","Pourcentage de taxation",null,"VAL. NR À 100 % ET IND. CL. 2 À 50 %"]
[null,null,null,"  Imposables","Compensables",null,"Imposables pondérées","Compensables pondérées",null,"Total"]
[null,"(1)",null,"(2)","(3)",null,"(4) = (1) X (2)","(5) = (1 ) X  (3)",null,"(6) = (4) + (5)"]
[" 1A",1E-3,null,{"$f":"'Sommaire du rôle_sec_3'!F7","v":76534150},{"$f":"'Sommaire du rôle_sec_3'!G7","v":0},null,{"$f":"B7*D7","v":76534.150000000009},{"$f":"B7*E7","v":0},null,{"$f":"G7+H7","v":76534.150000000009}]
[" 1B",5.0000000000000001E-3,null,{"$f":"'Sommaire du rôle_sec_3'!F8","v":34712370},{"$f":"'Sommaire du rôle_sec_3'!G8","v":0},null,173561.85,0,null,173561.85]
[" 1C",0.01,null,{"$f":"'Sommaire du rôle_sec_3'!F9","v":4894450},{"$f":"'Sommaire du rôle_sec_3'!G9","v":0},null,48944.5,0,null,48944.5]
[2,0.03,null,{"$f":"'Sommaire du rôle_sec_3'!F10","v":23616670},{"$f":"'Sommaire du rôle_sec_3'!G10","v":0},null,708500.1,0,null,708500.1]
[3,0.06,null,{"$f":"'Sommaire du rôle_sec_3'!F11","v":44153450},{"$f":"'Sommaire du rôle_sec_3'!G11","v":0},null,2649207,0,null,2649207]
[4,0.12,null,{"$f":"'Sommaire du rôle_sec_3'!F12","v":60256460},{"$f":"'Sommaire du rôle_sec_3'!G12","v":0},null,7230775.2000000002,0,null,7230775.2000000002]
[5,0.22,null,{"$f":"'Sommaire du rôle_sec_3'!F13","v":38643990},{"$f":"'Sommaire du rôle_sec_3'!G13","v":0},null,8501677.8000000007,0,null,8501677.8000000007]
[6,0.4,null,{"$f":"'Sommaire du rôle_sec_3'!F14","v":38532890},{"$f":"'Sommaire du rôle_sec_3'!G14","v":0},null,15413156,0,null,15413156]
[7,0.6,null,{"$f":"'Sommaire du rôle_sec_3'!F15","v":39569365},{"$f":"'Sommaire du rôle_sec_3'!G15","v":72376370},null,23741619,43425822,null,67167441]
[8,0.85,null,{"$f":"'Sommaire du rôle_sec_3'!F16","v":22323070},{"$f":"'Sommaire du rôle_sec_3'!G16","v":211592260},null,18974609.5,179853421,null,198828030.5]
[9,1,null,{"$f":"'Sommaire du rôle_sec_3'!F17","v":3177900},{"$f":"'Sommaire du rôle_sec_3'!G17","v":0},null,3177900,0,null,3177900]
[10,1,null,{"$f":"'Sommaire du rôle_sec_3'!F18","v":1155755205},{"$f":"'Sommaire du rôle_sec_3'!G18","v":61905690},null,1155755205,61905690,null,1217660895]
["11 Cours de triage","100%",null,{"$f":"'Sommaire du rôle_sec_3'!F19","v":0},{"$f":"'Sommaire du rôle_sec_3'!G19","v":0},null,0,0,null,0]
["12 CHSLD",0.2,null,{"$f":"'Sommaire du rôle_sec_3'!F20","v":13938200},null,null,2787640,null,null,2787640]
["13 Cours de triage 40 %","40%",null,{"$f":"'Sommaire du rôle_sec_3'!F21","v":0},null,null,0,null,null,0]
[" APPLICATION DU TNR QUAND TTVD",1,null,{"$f":"'Sommaire du rôle_sec_3'!F22","v":5228300},{"$f":"'Sommaire du rôle_sec_3'!G22","v":0},null,5228300,{"$f":"B22*E22","v":0},null,5228300]
["Total",null,null,null,null,null,{"$f":"SUM(G7:G22)","v":1244467630.0999999},{"$f":"SUM(H7:H22)","v":285184933},null,1529652563.0999999]
[]
["ASSIETTE AU TAUX INDUSTRIEL (CLASSE 2)"]
["Classe non résidentielle","Pourcentage de taxation",null,"VALEUR À 50 %"]
[null,null,null,"  Imposables","Compensables",null,"Imposables pondérées","Compensables pondérées",null,"Total"]
[null,"(1)",null,"(2)","(3)",null,"(4) = (1) X (2)","(5) = (1) X (3)",null,"(6) = (4) + (5)"]
[" 1A",1E-3,null,{"$f":"'Sommaire du rôle_sec_3'!H7","v":0},{"$f":"'Sommaire du rôle_sec_3'!I7","v":0},null,{"$f":"B29*D29","v":0},{"$f":"B29*E29","v":0},null,{"$f":"G29+H29","v":0}]
[" 1B",5.0000000000000001E-3,null,{"$f":"'Sommaire du rôle_sec_3'!H8","v":0},{"$f":"'Sommaire du rôle_sec_3'!I8","v":0},null,0,0,null,0]
[" 1C",0.01,null,{"$f":"'Sommaire du rôle_sec_3'!H9","v":0},{"$f":"'Sommaire du rôle_sec_3'!I9","v":0},null,0,0,null,0]
[2,0.03,null,{"$f":"'Sommaire du rôle_sec_3'!H10","v":0},{"$f":"'Sommaire du rôle_sec_3'!I10","v":0},null,0,0,null,0]
[3,0.06,null,{"$f":"'Sommaire du rôle_sec_3'!H11","v":0},{"$f":"'Sommaire du rôle_sec_3'!I11","v":0},null,0,0,null,0]
[4,0.12,null,{"$f":"'Sommaire du rôle_sec_3'!H12","v":0},{"$f":"'Sommaire du rôle_sec_3'!I12","v":0},null,0,0,null,0]
[5,0.22,null,{"$f":"'Sommaire du rôle_sec_3'!H13","v":0},{"$f":"'Sommaire du rôle_sec_3'!I13","v":0},null,0,0,null,0]
[6,0.4,null,{"$f":"'Sommaire du rôle_sec_3'!H14","v":290100},{"$f":"'Sommaire du rôle_sec_3'!I14","v":0},null,116040,0,null,116040]
[7,0.6,null,{"$f":"'Sommaire du rôle_sec_3'!H15","v":350350},{"$f":"'Sommaire du rôle_sec_3'!I15","v":0},null,210210,0,null,210210]
[8,0.85,null,{"$f":"'Sommaire du rôle_sec_3'!H16","v":0},{"$f":"'Sommaire du rôle_sec_3'!I16","v":0},null,0,0,null,0]
[9,1,null,{"$f":"'Sommaire du rôle_sec_3'!H17","v":0},{"$f":"'Sommaire du rôle_sec_3'!I17","v":0},null,0,0,null,0]
[10,1,null,{"$f":"'Sommaire du rôle_sec_3'!H18","v":10515650},{"$f":"'Sommaire du rôle_sec_3'!I18","v":0},null,10515650,0,null,10515650]
["Total",null,null,null,null,null,{"$f":"SUM(G29:G40)","v":10841900},{"$f":"SUM(H29:H40)","v":0},null,10841900]
[]
["ASSIETTE AU TAUX IND. (SAUF CL.1 ET 2)"]
["Classe non résidentielle","Pourcentage de taxation",null,"VALEUR À 100 %"]
[null,null,null,"  Imposables","Compensables",null,"Imposables pondérées","Compensables pondérées",null,"Total"]
[null,"(1)",null,"(2)","(3)",null,"(4) = (1) X (2)","(5) = (1) X (3)",null,"(6) = (4) + (5)"]
[" 1A",1E-3,null,{"$f":"'Sommaire du rôle_sec_3'!J7","v":0},{"$f":"'Sommaire du rôle_sec_3'!K7","v":0},null,{"$f":"B47*D47","v":0},{"$f":"B47*E47","v":0},null,{"$f":"G47+H47","v":0}]
[" 1B",5.0000000000000001E-3,null,{"$f":"'Sommaire du rôle_sec_3'!J8","v":0},{"$f":"'Sommaire du rôle_sec_3'!K8","v":0},null,0,0,null,0]
[" 1C",0.01,null,{"$f":"'Sommaire du rôle_sec_3'!J9","v":0},{"$f":"'Sommaire du rôle_sec_3'!K9","v":0},null,0,0,null,0]
[2,0.03,null,{"$f":"'Sommaire du rôle_sec_3'!J10","v":605900},{"$f":"'Sommaire du rôle_sec_3'!K10","v":0},null,18177,0,null,18177]
[3,0.06,null,{"$f":"'Sommaire du rôle_sec_3'!J11","v":181400},{"$f":"'Sommaire du rôle_sec_3'!K11","v":0},null,10884,0,null,10884]
[4,0.12,null,{"$f":"'Sommaire du rôle_sec_3'!J12","v":215700},{"$f":"'Sommaire du rôle_sec_3'!K12","v":0},null,25884,0,null,25884]
[5,0.22,null,{"$f":"'Sommaire du rôle_sec_3'!J13","v":0},{"$f":"'Sommaire du rôle_sec_3'!K13","v":0},null,0,0,null,0]
[6,0.4,null,{"$f":"'Sommaire du rôle_sec_3'!J14","v":2421200},{"$f":"'Sommaire du rôle_sec_3'!K14","v":0},null,968480,0,null,968480]
[7,0.6,null,{"$f":"'Sommaire du rôle_sec_3'!J15","v":354000},{"$f":"'Sommaire du rôle_sec_3'!K15","v":0},null,212400,0,null,212400]
[8,0.85,null,{"$f":"'Sommaire du rôle_sec_3'!J16","v":1875900},{"$f":"'Sommaire du rôle_sec_3'!K16","v":0},null,1594515,0,null,1594515]
[9,1,null,{"$f":"'Sommaire du rôle_sec_3'!J17","v":0},{"$f":"'Sommaire du rôle_sec_3'!K17","v":0},null,0,0,null,0]
[10,1,null,{"$f":"'Sommaire du rôle_sec_3'!J18","v":225704400},{"$f":"'Sommaire du rôle_sec_3'!K18","v":2325200},null,225704400,2325200,null,228029600]
["Total",null,null,null,null,null,{"$f":"SUM(G47:G58)","v":228534740},{"$f":"SUM(H47:H58)","v":2325200},null,230859940]
[]
["ASSIETTE AU TAUX DE BASE"]
["Classe non résidentielle","Pourcentage de taxation",null,"VALEUR À 100 %"]
[null,null,null,"  Imposables","Compensables",null,"Imposables pondérées","Compensables pondérées",null,"Total"]
[null,"(1)",null,"(2)","(3)",null,"(4) = (1) X (2)","(5) = (1) X (3)",null,"(6) = (4) + (5)"]
[" 1A",0.999,null,{"$f":"'Sommaire du rôle_sec_3'!P7","v":76534150},{"$f":"'Sommaire du rôle_sec_3'!Q7","v":0},null,{"$f":"D65*B65","v":76457615.849999994},{"$f":"B65*E65","v":0},null,{"$f":"G65+H65","v":76457615.849999994}]
[" 1B",0.995,null,{"$f":"'Sommaire du rôle_sec_3'!P8","v":34712370},{"$f":"'Sommaire du rôle_sec_3'!Q8","v":0},null,34538808.149999999,0,null,34538808.149999999]
[" 1C",0.99,null,{"$f":"'Sommaire du rôle_sec_3'!P9","v":4894450},{"$f":"'Sommaire du rôle_sec_3'!Q9","v":0},null,4845505.5,0,null,4845505.5]
[2,0.97,null,{"$f":"'Sommaire du rôle_sec_3'!P10","v":23616670},{"$f":"'Sommaire du rôle_sec_3'!Q10","v":0},null,22908169.899999999,0,null,22908169.899999999]
[3,0.94,null,{"$f":"'Sommaire du rôle_sec_3'!P11","v":44153450},{"$f":"'Sommaire du rôle_sec_3'!Q11","v":0},null,41504243,0,null,41504243]
[4,0.88,null,{"$f":"'Sommaire du rôle_sec_3'!P12","v":60256460},{"$f":"'Sommaire du rôle_sec_3'!Q12","v":0},null,53025684.799999997,0,null,53025684.799999997]
[5,0.78,null,{"$f":"'Sommaire du rôle_sec_3'!P13","v":38643990},{"$f":"'Sommaire du rôle_sec_3'!Q13","v":0},null,30142312.199999999,0,null,30142312.199999999]
[6,0.6,null,{"$f":"'Sommaire du rôle_sec_3'!P14","v":38532890},{"$f":"'Sommaire du rôle_sec_3'!Q14","v":0},null,23119734,0,null,23119734]
[7,0.4,null,{"$f":"'Sommaire du rôle_sec_3'!P15","v":39569365},{"$f":"'Sommaire du rôle_sec_3'!Q15","v":72376370},null,15827746,28950548,null,44778294]
[8,0.15000000000000002,null,{"$f":"'Sommaire du rôle_sec_3'!P16","v":22323070},{"$f":"'Sommaire du rôle_sec_3'!Q16","v":211592260},null,3348460.5000000005,31738839.000000004,null,35087299.500000007]
["IMMEUBLES SANS PARTIE NON RÉSIDENTIELLE",1,null,{"$f":"'Sommaire du rôle_sec_3'!P18","v":8068032861},{"$f":"'Sommaire du rôle_sec_3'!Q18","v":2100780},null,8068032861,2100780,null,8070133641]
["12  CHSLD",0.8,null,{"$f":"'Sommaire du rôle_sec_3'!P20","v":13938200},null,null,11150560]
["13 Cours de triage ",0.6,null,{"$f":"'Sommaire du rôle_sec_3'!P21","v":0},null,null,0]
["Total",null,null,null,null,null,{"$f":"SUM(G65:G77)","v":8384901700.8999996},{"$f":"SUM(H65:H75)","v":62790167},{"$f":"SUM(I65:I75)","v":0},{"$f":"G78+H78","v":8447691867.8999996}]
[]
["ASSIETTE AU TAUX NON RÉSIDENTIEL RÉFÉRENCE"]
["Classe non résidentielle","Pourcentage de taxation",null,"VAL. NR À 100 % ET IND. CL. 2 À 50 %"]
[null,null,null,"  Imposables","Compensables",null,"Imposables pondérées","Compensables pondérées",null,"Total"]
[null,"(1)",null,"(2)","(3)",null,"(4) = (1) X (2)","(5) = (1 ) X  (3)",null,"(6) = (4) + (5)"]
[" 1A",1E-3,null,{"$f":"'Sommaire du rôle_sec_3'!F30","v":0},{"$f":"'Sommaire du rôle_sec_3'!G30","v":0},null,{"$f":"B84*D84","v":0},{"$f":"B84*E84","v":0},null,{"$f":"G84+H84","v":0}]
[" 1B",5.0000000000000001E-3,null,{"$f":"'Sommaire du rôle_sec_3'!F31","v":0},{"$f":"'Sommaire du rôle_sec_3'!G31","v":0},null,0,0,null,0]
[" 1C",0.01,null,{"$f":"'Sommaire du rôle_sec_3'!F32","v":0},{"$f":"'Sommaire du rôle_sec_3'!G32","v":0},null,0,0,null,0]
[2,0.03,null,{"$f":"'Sommaire du rôle_sec_3'!F33","v":0},{"$f":"'Sommaire du rôle_sec_3'!G33","v":0},null,0,0,null,0]
[3,0.06,null,{"$f":"'Sommaire du rôle_sec_3'!F34","v":0},{"$f":"'Sommaire du rôle_sec_3'!G34","v":0},null,0,0,null,0]
[4,0.12,null,{"$f":"'Sommaire du rôle_sec_3'!F35","v":0},{"$f":"'Sommaire du rôle_sec_3'!G35","v":0},null,0,0,null,0]
[5,0.22,null,{"$f":"'Sommaire du rôle_sec_3'!F36","v":0},{"$f":"'Sommaire du rôle_sec_3'!G36","v":0},null,0,0,null,0]
[6,0.4,null,{"$f":"'Sommaire du rôle_sec_3'!F37","v":0},{"$f":"'Sommaire du rôle_sec_3'!G37","v":0},null,0,0,null,0]
[7,0.6,null,{"$f":"'Sommaire du rôle_sec_3'!F38","v":0},{"$f":"'Sommaire du rôle_sec_3'!G38","v":0},null,0,0,null,0]
[8,0.85,null,{"$f":"'Sommaire du rôle_sec_3'!F39","v":0},{"$f":"'Sommaire du rôle_sec_3'!G39","v":0},null,0,0,null,0]
[9,1,null,{"$f":"'Sommaire du rôle_sec_3'!F40","v":0},{"$f":"'Sommaire du rôle_sec_3'!G40","v":0},null,0,0,null,0]
[10,1,null,{"$f":"'Sommaire du rôle_sec_3'!F41","v":0},{"$f":"'Sommaire du rôle_sec_3'!G41","v":0},null,0,0,null,0]
["11 Cours de triage","100%",null,{"$f":"'Sommaire du rôle_sec_3'!F42","v":0},{"$f":"'Sommaire du rôle_sec_3'!G42","v":0},null,0,0,null,0]
["12 CHSLD",0.2,null,{"$f":"'Sommaire du rôle_sec_3'!F43","v":0},null,null,0,null,null,0]
["13 Cours de triage 40 %","40%",null,{"$f":"'Sommaire du rôle_sec_3'!F44","v":0},null,null,0,null,null,0]
[" APPLICATION DU TNR QUAND TTVD",1,null,{"$f":"'Sommaire du rôle_sec_3'!F45","v":0},{"$f":"'Sommaire du rôle_sec_3'!G45","v":0},null,0,{"$f":"B99*E99","v":0},null,0]
["Total",null,null,null,null,null,{"$f":"SUM(G84:G99)","v":0},{"$f":"SUM(H84:H99)","v":0},null,0]
[]
["ASSIETTE AU TAUX NON RÉSIDENTIEL SOUS-CATÉGORIE 1",null,null,null,null,null,null,null,null,null,null,"ASSIETTE AU TAUX NON RÉSIDENTIEL SOUS-CATÉGORIE 2",null,null,null,null,null,null,null,null,null,null,"ASSIETTE AU TAUX NON RÉSIDENTIEL SOUS-CATÉGORIE 3",null,null,null,null,null,null,null,null,null,null,"ASSIETTE AU TAUX NON RÉSIDENTIEL SOUS-CATÉGORIE 4",null,null,null,null,null,null,null,null,null,null,"ASSIETTE AU TAUX NON RÉSIDENTIEL SOUS-CATÉGORIE 5",null,null,null,null,null,null,null,null,null,null,"ASSIETTE AU TAUX NON RÉSIDENTIEL SOUS-CATÉGORIE 6",null,null,null,null,null,null,null,null,null,null,"ASSIETTE AU TAUX NON RÉSIDENTIEL SOUS-CATÉGORIE 7",null,null,null,null,null,null,null,null,null,null,"ASSIETTE AU TAUX NON RÉSIDENTIEL SOUS-CATÉGORIE 8",null,null,null,null,null,null,null,null,null,null,"ASSIETTE AU TAUX NON RÉSIDENTIEL SOUS-CATÉGORIE 9",null,null,null,null,null,null,null,null,null,null,"ASSIETTE AU TAUX NON RÉSIDENTIEL SOUS-CATÉGORIE 10"]
["Classe non résidentielle","Pourcentage de taxation",null,"VAL. NR À 100 % ET IND. CL. 2 À 50 %",null,null,null,null,null,null,null,"Classe non résidentielle","Pourcentage de taxation",null,"VAL. NR À 100 % ET IND. CL. 2 À 50 %",null,null,null,null,null,null,null,"Classe non résidentielle","Pourcentage de taxation",null,"VAL. NR À 100 % ET IND. CL. 2 À 50 %",null,null,null,null,null,null,null,"Classe non résidentielle","Pourcentage de taxation",null,"VAL. NR À 100 % ET IND. CL. 2 À 50 %",null,null,null,null,null,null,null,"Classe non résidentielle","Pourcentage de taxation",null,"VAL. NR À 100 % ET IND. CL. 2 À 50 %",null,null,null,null,null,null,null,"Classe non résidentielle","Pourcentage de taxation",null,"VAL. NR À 100 % ET IND. CL. 2 À 50 %",null,null,null,null,null,null,null,"Classe non résidentielle","Pourcentage de taxation",null,"VAL. NR À 100 % ET IND. CL. 2 À 50 %",null,null,null,null,null,null,null,"Classe non résidentielle","Pourcentage de taxation",null,"VAL. NR À 100 % ET IND. CL. 2 À 50 %",null,null,null,null,null,null,null,"Classe non résidentielle","Pourcentage de taxation",null,"VAL. NR À 100 % ET IND. CL. 2 À 50 %",null,null,null,null,null,null,null,"Classe non résidentielle","Pourcentage de taxation",null,"VAL. NR À 100 % ET IND. CL. 2 À 50 %"]
[null,null,null,"  Imposables","Compensables",null,"Imposables pondérées","Compensables pondérées",null,"Total",null,null,null,null,"  Imposables","Compensables",null,"Imposables pondérées","Compensables pondérées",null,"Total",null,null,null,null,"  Imposables","Compensables",null,"Imposables pondérées","Compensables pondérées",null,"Total",null,null,null,null,"  Imposables","Compensables",null,"Imposables pondérées","Compensables pondérées",null,"Total",null,null,null,null,"  Imposables","Compensables",null,"Imposables pondérées","Compensables pondérées",null,"Total",null,null,null,null,"  Imposables","Compensables",null,"Imposables pondérées","Compensables pondérées",null,"Total",null,null,null,null,"  Imposables","Compensables",null,"Imposables pondérées","Compensables pondérées",null,"Total",null,null,null,null,"  Imposables","Compensables",null,"Imposables pondérées","Compensables pondérées",null,"Total",null,null,null,null,"  Imposables","Compensables",null,"Imposables pondérées","Compensables pondérées",null,"Total",null,null,null,null,"  Imposables","Compensables",null,"Imposables pondérées","Compensables pondérées",null,"Total"]
[null,"(1)",null,"(2)","(3)",null,"(4) = (1) X (2)","(5) = (1 ) X  (3)",null,"(6) = (4) + (5)",null,null,"(1)",null,"(2)","(3)",null,"(4) = (1) X (2)","(5) = (1 ) X  (3)",null,"(6) = (4) + (5)",null,null,"(1)",null,"(2)","(3)",null,"(4) = (1) X (2)","(5) = (1 ) X  (3)",null,"(6) = (4) + (5)",null,null,"(1)",null,"(2)","(3)",null,"(4) = (1) X (2)","(5) = (1 ) X  (3)",null,"(6) = (4) + (5)",null,null,"(1)",null,"(2)","(3)",null,"(4) = (1) X (2)","(5) = (1 ) X  (3)",null,"(6) = (4) + (5)",null,null,"(1)",null,"(2)","(3)",null,"(4) = (1) X (2)","(5) = (1 ) X  (3)",null,"(6) = (4) + (5)",null,null,"(1)",null,"(2)","(3)",null,"(4) = (1) X (2)","(5) = (1 ) X  (3)",null,"(6) = (4) + (5)",null,null,"(1)",null,"(2)","(3)",null,"(4) = (1) X (2)","(5) = (1 ) X  (3)",null,"(6) = (4) + (5)",null,null,"(1)",null,"(2)","(3)",null,"(4) = (1) X (2)","(5) = (1 ) X  (3)",null,"(6) = (4) + (5)",null,null,"(1)",null,"(2)","(3)",null,"(4) = (1) X (2)","(5) = (1 ) X  (3)",null,"(6) = (4) + (5)"]
[" 1A",1E-3,null,{"$f":"'Sommaire du rôle_sec_3'!H30","v":0},{"$f":"'Sommaire du rôle_sec_3'!I30","v":0},null,{"$f":"B106*D106","v":0},{"$f":"B106*E106","v":0},null,{"$f":"G106+H106","v":0},null," 1A",1E-3,null,{"$f":"'Sommaire du rôle_sec_3'!J30","v":0},{"$f":"'Sommaire du rôle_sec_3'!K30","v":0},null,{"$f":"M106*O106","v":0},{"$f":"M106*P106","v":0},null,{"$f":"R106+S106","v":0},null," 1A",1E-3,null,{"$f":"'Sommaire du rôle_sec_3'!L30","v":0},{"$f":"'Sommaire du rôle_sec_3'!M30","v":0},null,{"$f":"X106*Z106","v":0},{"$f":"X106*AA106","v":0},null,{"$f":"AC106+AD106","v":0},null," 1A",1E-3,null,{"$f":"'Sommaire du rôle_sec_3'!N30","v":0},{"$f":"'Sommaire du rôle_sec_3'!O30","v":0},null,{"$f":"AI106*AK106","v":0},{"$f":"AI106*AL106","v":0},null,{"$f":"AN106+AO106","v":0},null," 1A",1E-3,null,{"$f":"'Sommaire du rôle_sec_3'!P30","v":0},{"$f":"'Sommaire du rôle_sec_3'!Q30","v":0},null,{"$f":"AT106*AV106","v":0},{"$f":"AT106*AW106","v":0},null,{"$f":"AY106+AZ106","v":0},null," 1A",1E-3,null,{"$f":"'Sommaire du rôle_sec_3'!R30","v":0},{"$f":"'Sommaire du rôle_sec_3'!S30","v":0},null,{"$f":"BE106*BG106","v":0},{"$f":"BE106*BH106","v":0},null,{"$f":"BJ106+BK106","v":0},null," 1A",1E-3,null,{"$f":"'Sommaire du rôle_sec_3'!T30","v":0},{"$f":"'Sommaire du rôle_sec_3'!U30","v":0},null,{"$f":"BP106*BR106","v":0},{"$f":"BP106*BS106","v":0},null,{"$f":"BU106+BV106","v":0},null," 1A",1E-3,null,{"$f":"'Sommaire du rôle_sec_3'!V30","v":0},{"$f":"'Sommaire du rôle_sec_3'!W30","v":0},null,{"$f":"CA106*CC106","v":0},{"$f":"CA106*CD106","v":0},null,{"$f":"CF106+CG106","v":0},null," 1A",1E-3,null,{"$f":"'Sommaire du rôle_sec_3'!X30","v":0},{"$f":"'Sommaire du rôle_sec_3'!Y30","v":0},null,{"$f":"CL106*CN106","v":0},{"$f":"CL106*CO106","v":0},null,{"$f":"CQ106+CR106","v":0},null," 1A",1E-3,null,{"$f":"'Sommaire du rôle_sec_3'!Z30","v":0},{"$f":"'Sommaire du rôle_sec_3'!AA30","v":0},null,{"$f":"CW106*CY106","v":0},{"$f":"CW106*CZ106","v":0},null,{"$f":"DB106+DC106","v":0}]
[" 1B",5.0000000000000001E-3,null,{"$f":"'Sommaire du rôle_sec_3'!H31","v":0},{"$f":"'Sommaire du rôle_sec_3'!I31","v":0},null,0,0,null,0,null," 1B",5.0000000000000001E-3,null,{"$f":"'Sommaire du rôle_sec_3'!J31","v":0},{"$f":"'Sommaire du rôle_sec_3'!K31","v":0},null,0,0,null,0,null," 1B",5.0000000000000001E-3,null,{"$f":"'Sommaire du rôle_sec_3'!L31","v":0},{"$f":"'Sommaire du rôle_sec_3'!M31","v":0},null,0,0,null,0,null," 1B",5.0000000000000001E-3,null,{"$f":"'Sommaire du rôle_sec_3'!N31","v":0},{"$f":"'Sommaire du rôle_sec_3'!O31","v":0},null,0,0,null,0,null," 1B",5.0000000000000001E-3,null,{"$f":"'Sommaire du rôle_sec_3'!P31","v":0},{"$f":"'Sommaire du rôle_sec_3'!Q31","v":0},null,0,0,null,0,null," 1B",5.0000000000000001E-3,null,{"$f":"'Sommaire du rôle_sec_3'!R31","v":0},{"$f":"'Sommaire du rôle_sec_3'!S31","v":0},null,0,0,null,0,null," 1B",5.0000000000000001E-3,null,{"$f":"'Sommaire du rôle_sec_3'!T31","v":0},{"$f":"'Sommaire du rôle_sec_3'!U31","v":0},null,0,0,null,0,null," 1B",5.0000000000000001E-3,null,{"$f":"'Sommaire du rôle_sec_3'!V31","v":0},{"$f":"'Sommaire du rôle_sec_3'!W31","v":0},null,0,0,null,0,null," 1B",5.0000000000000001E-3,null,{"$f":"'Sommaire du rôle_sec_3'!X31","v":0},{"$f":"'Sommaire du rôle_sec_3'!Y31","v":0},null,0,0,null,0,null," 1B",5.0000000000000001E-3,null,{"$f":"'Sommaire du rôle_sec_3'!Z31","v":0},{"$f":"'Sommaire du rôle_sec_3'!AA31","v":0},null,0,0,null,0]
[" 1C",0.01,null,{"$f":"'Sommaire du rôle_sec_3'!H32","v":0},{"$f":"'Sommaire du rôle_sec_3'!I32","v":0},null,0,0,null,0,null," 1C",0.01,null,{"$f":"'Sommaire du rôle_sec_3'!J32","v":0},{"$f":"'Sommaire du rôle_sec_3'!K32","v":0},null,0,0,null,0,null," 1C",0.01,null,{"$f":"'Sommaire du rôle_sec_3'!L32","v":0},{"$f":"'Sommaire du rôle_sec_3'!M32","v":0},null,0,0,null,0,null," 1C",0.01,null,{"$f":"'Sommaire du rôle_sec_3'!N32","v":0},{"$f":"'Sommaire du rôle_sec_3'!O32","v":0},null,0,0,null,0,null," 1C",0.01,null,{"$f":"'Sommaire du rôle_sec_3'!P32","v":0},{"$f":"'Sommaire du rôle_sec_3'!Q32","v":0},null,0,0,null,0,null," 1C",0.01,null,{"$f":"'Sommaire du rôle_sec_3'!R32","v":0},{"$f":"'Sommaire du rôle_sec_3'!S32","v":0},null,0,0,null,0,null," 1C",0.01,null,{"$f":"'Sommaire du rôle_sec_3'!T32","v":0},{"$f":"'Sommaire du rôle_sec_3'!U32","v":0},null,0,0,null,0,null," 1C",0.01,null,{"$f":"'Sommaire du rôle_sec_3'!V32","v":0},{"$f":"'Sommaire du rôle_sec_3'!W32","v":0},null,0,0,null,0,null," 1C",0.01,null,{"$f":"'Sommaire du rôle_sec_3'!X32","v":0},{"$f":"'Sommaire du rôle_sec_3'!Y32","v":0},null,0,0,null,0,null," 1C",0.01,null,{"$f":"'Sommaire du rôle_sec_3'!Z32","v":0},{"$f":"'Sommaire du rôle_sec_3'!AA32","v":0},null,0,0,null,0]
[2,0.03,null,{"$f":"'Sommaire du rôle_sec_3'!H33","v":0},{"$f":"'Sommaire du rôle_sec_3'!I33","v":0},null,0,0,null,0,null,2,0.03,null,{"$f":"'Sommaire du rôle_sec_3'!J33","v":0},{"$f":"'Sommaire du rôle_sec_3'!K33","v":0},null,0,0,null,0,null,2,0.03,null,{"$f":"'Sommaire du rôle_sec_3'!L33","v":0},{"$f":"'Sommaire du rôle_sec_3'!M33","v":0},null,0,0,null,0,null,2,0.03,null,{"$f":"'Sommaire du rôle_sec_3'!N33","v":0},{"$f":"'Sommaire du rôle_sec_3'!O33","v":0},null,0,0,null,0,null,2,0.03,null,{"$f":"'Sommaire du rôle_sec_3'!P33","v":0},{"$f":"'Sommaire du rôle_sec_3'!Q33","v":0},null,0,0,null,0,null,2,0.03,null,{"$f":"'Sommaire du rôle_sec_3'!R33","v":0},{"$f":"'Sommaire du rôle_sec_3'!S33","v":0},null,0,0,null,0,null,2,0.03,null,{"$f":"'Sommaire du rôle_sec_3'!T33","v":0},{"$f":"'Sommaire du rôle_sec_3'!U33","v":0},null,0,0,null,0,null,2,0.03,null,{"$f":"'Sommaire du rôle_sec_3'!V33","v":0},{"$f":"'Sommaire du rôle_sec_3'!W33","v":0},null,0,0,null,0,null,2,0.03,null,{"$f":"'Sommaire du rôle_sec_3'!X33","v":0},{"$f":"'Sommaire du rôle_sec_3'!Y33","v":0},null,0,0,null,0,null,2,0.03,null,{"$f":"'Sommaire du rôle_sec_3'!Z33","v":0},{"$f":"'Sommaire du rôle_sec_3'!AA33","v":0},null,0,0,null,0]
[3,0.06,null,{"$f":"'Sommaire du rôle_sec_3'!H34","v":0},{"$f":"'Sommaire du rôle_sec_3'!I34","v":0},null,0,0,null,0,null,3,0.06,null,{"$f":"'Sommaire du rôle_sec_3'!J34","v":0},{"$f":"'Sommaire du rôle_sec_3'!K34","v":0},null,0,0,null,0,null,3,0.06,null,{"$f":"'Sommaire du rôle_sec_3'!L34","v":0},{"$f":"'Sommaire du rôle_sec_3'!M34","v":0},null,0,0,null,0,null,3,0.06,null,{"$f":"'Sommaire du rôle_sec_3'!N34","v":0},{"$f":"'Sommaire du rôle_sec_3'!O34","v":0},null,0,0,null,0,null,3,0.06,null,{"$f":"'Sommaire du rôle_sec_3'!P34","v":0},{"$f":"'Sommaire du rôle_sec_3'!Q34","v":0},null,0,0,null,0,null,3,0.06,null,{"$f":"'Sommaire du rôle_sec_3'!R34","v":0},{"$f":"'Sommaire du rôle_sec_3'!S34","v":0},null,0,0,null,0,null,3,0.06,null,{"$f":"'Sommaire du rôle_sec_3'!T34","v":0},{"$f":"'Sommaire du rôle_sec_3'!U34","v":0},null,0,0,null,0,null,3,0.06,null,{"$f":"'Sommaire du rôle_sec_3'!V34","v":0},{"$f":"'Sommaire du rôle_sec_3'!W34","v":0},null,0,0,null,0,null,3,0.06,null,{"$f":"'Sommaire du rôle_sec_3'!X34","v":0},{"$f":"'Sommaire du rôle_sec_3'!Y34","v":0},null,0,0,null,0,null,3,0.06,null,{"$f":"'Sommaire du rôle_sec_3'!Z34","v":0},{"$f":"'Sommaire du rôle_sec_3'!AA34","v":0},null,0,0,null,0]
[4,0.12,null,{"$f":"'Sommaire du rôle_sec_3'!H35","v":0},{"$f":"'Sommaire du rôle_sec_3'!I35","v":0},null,0,0,null,0,null,4,0.12,null,{"$f":"'Sommaire du rôle_sec_3'!J35","v":0},{"$f":"'Sommaire du rôle_sec_3'!K35","v":0},null,0,0,null,0,null,4,0.12,null,{"$f":"'Sommaire du rôle_sec_3'!L35","v":0},{"$f":"'Sommaire du rôle_sec_3'!M35","v":0},null,0,0,null,0,null,4,0.12,null,{"$f":"'Sommaire du rôle_sec_3'!N35","v":0},{"$f":"'Sommaire du rôle_sec_3'!O35","v":0},null,0,0,null,0,null,4,0.12,null,{"$f":"'Sommaire du rôle_sec_3'!P35","v":0},{"$f":"'Sommaire du rôle_sec_3'!Q35","v":0},null,0,0,null,0,null,4,0.12,null,{"$f":"'Sommaire du rôle_sec_3'!R35","v":0},{"$f":"'Sommaire du rôle_sec_3'!S35","v":0},null,0,0,null,0,null,4,0.12,null,{"$f":"'Sommaire du rôle_sec_3'!T35","v":0},{"$f":"'Sommaire du rôle_sec_3'!U35","v":0},null,0,0,null,0,null,4,0.12,null,{"$f":"'Sommaire du rôle_sec_3'!V35","v":0},{"$f":"'Sommaire du rôle_sec_3'!W35","v":0},null,0,0,null,0,null,4,0.12,null,{"$f":"'Sommaire du rôle_sec_3'!X35","v":0},{"$f":"'Sommaire du rôle_sec_3'!Y35","v":0},null,0,0,null,0,null,4,0.12,null,{"$f":"'Sommaire du rôle_sec_3'!Z35","v":0},{"$f":"'Sommaire du rôle_sec_3'!AA35","v":0},null,0,0,null,0]
[5,0.22,null,{"$f":"'Sommaire du rôle_sec_3'!H36","v":0},{"$f":"'Sommaire du rôle_sec_3'!I36","v":0},null,0,0,null,0,null,5,0.22,null,{"$f":"'Sommaire du rôle_sec_3'!J36","v":0},{"$f":"'Sommaire du rôle_sec_3'!K36","v":0},null,0,0,null,0,null,5,0.22,null,{"$f":"'Sommaire du rôle_sec_3'!L36","v":0},{"$f":"'Sommaire du rôle_sec_3'!M36","v":0},null,0,0,null,0,null,5,0.22,null,{"$f":"'Sommaire du rôle_sec_3'!N36","v":0},{"$f":"'Sommaire du rôle_sec_3'!O36","v":0},null,0,0,null,0,null,5,0.22,null,{"$f":"'Sommaire du rôle_sec_3'!P36","v":0},{"$f":"'Sommaire du rôle_sec_3'!Q36","v":0},null,0,0,null,0,null,5,0.22,null,{"$f":"'Sommaire du rôle_sec_3'!R36","v":0},{"$f":"'Sommaire du rôle_sec_3'!S36","v":0},null,0,0,null,0,null,5,0.22,null,{"$f":"'Sommaire du rôle_sec_3'!T36","v":0},{"$f":"'Sommaire du rôle_sec_3'!U36","v":0},null,0,0,null,0,null,5,0.22,null,{"$f":"'Sommaire du rôle_sec_3'!V36","v":0},{"$f":"'Sommaire du rôle_sec_3'!W36","v":0},null,0,0,null,0,null,5,0.22,null,{"$f":"'Sommaire du rôle_sec_3'!X36","v":0},{"$f":"'Sommaire du rôle_sec_3'!Y36","v":0},null,0,0,null,0,null,5,0.22,null,{"$f":"'Sommaire du rôle_sec_3'!Z36","v":0},{"$f":"'Sommaire du rôle_sec_3'!AA36","v":0},null,0,0,null,0]
[6,0.4,null,{"$f":"'Sommaire du rôle_sec_3'!H37","v":0},{"$f":"'Sommaire du rôle_sec_3'!I37","v":0},null,0,0,null,0,null,6,0.4,null,{"$f":"'Sommaire du rôle_sec_3'!J37","v":0},{"$f":"'Sommaire du rôle_sec_3'!K37","v":0},null,0,0,null,0,null,6,0.4,null,{"$f":"'Sommaire du rôle_sec_3'!L37","v":0},{"$f":"'Sommaire du rôle_sec_3'!M37","v":0},null,0,0,null,0,null,6,0.4,null,{"$f":"'Sommaire du rôle_sec_3'!N37","v":0},{"$f":"'Sommaire du rôle_sec_3'!O37","v":0},null,0,0,null,0,null,6,0.4,null,{"$f":"'Sommaire du rôle_sec_3'!P37","v":0},{"$f":"'Sommaire du rôle_sec_3'!Q37","v":0},null,0,0,null,0,null,6,0.4,null,{"$f":"'Sommaire du rôle_sec_3'!R37","v":0},{"$f":"'Sommaire du rôle_sec_3'!S37","v":0},null,0,0,null,0,null,6,0.4,null,{"$f":"'Sommaire du rôle_sec_3'!T37","v":0},{"$f":"'Sommaire du rôle_sec_3'!U37","v":0},null,0,0,null,0,null,6,0.4,null,{"$f":"'Sommaire du rôle_sec_3'!V37","v":0},{"$f":"'Sommaire du rôle_sec_3'!W37","v":0},null,0,0,null,0,null,6,0.4,null,{"$f":"'Sommaire du rôle_sec_3'!X37","v":0},{"$f":"'Sommaire du rôle_sec_3'!Y37","v":0},null,0,0,null,0,null,6,0.4,null,{"$f":"'Sommaire du rôle_sec_3'!Z37","v":0},{"$f":"'Sommaire du rôle_sec_3'!AA37","v":0},null,0,0,null,0]
[7,0.6,null,{"$f":"'Sommaire du rôle_sec_3'!H38","v":0},{"$f":"'Sommaire du rôle_sec_3'!I38","v":0},null,0,0,null,0,null,7,0.6,null,{"$f":"'Sommaire du rôle_sec_3'!J38","v":0},{"$f":"'Sommaire du rôle_sec_3'!K38","v":0},null,0,0,null,0,null,7,0.6,null,{"$f":"'Sommaire du rôle_sec_3'!L38","v":0},{"$f":"'Sommaire du rôle_sec_3'!M38","v":0},null,0,0,null,0,null,7,0.6,null,{"$f":"'Sommaire du rôle_sec_3'!N38","v":0},{"$f":"'Sommaire du rôle_sec_3'!O38","v":0},null,0,0,null,0,null,7,0.6,null,{"$f":"'Sommaire du rôle_sec_3'!P38","v":0},{"$f":"'Sommaire du rôle_sec_3'!Q38","v":0},null,0,0,null,0,null,7,0.6,null,{"$f":"'Sommaire du rôle_sec_3'!R38","v":0},{"$f":"'Sommaire du rôle_sec_3'!S38","v":0},null,0,0,null,0,null,7,0.6,null,{"$f":"'Sommaire du rôle_sec_3'!T38","v":0},{"$f":"'Sommaire du rôle_sec_3'!U38","v":0},null,0,0,null,0,null,7,0.6,null,{"$f":"'Sommaire du rôle_sec_3'!V38","v":0},{"$f":"'Sommaire du rôle_sec_3'!W38","v":0},null,0,0,null,0,null,7,0.6,null,{"$f":"'Sommaire du rôle_sec_3'!X38","v":0},{"$f":"'Sommaire du rôle_sec_3'!Y38","v":0},null,0,0,null,0,null,7,0.6,null,{"$f":"'Sommaire du rôle_sec_3'!Z38","v":0},{"$f":"'Sommaire du rôle_sec_3'!AA38","v":0},null,0,0,null,0]
[8,0.85,null,{"$f":"'Sommaire du rôle_sec_3'!H39","v":0},{"$f":"'Sommaire du rôle_sec_3'!I39","v":0},null,0,0,null,0,null,8,0.85,null,{"$f":"'Sommaire du rôle_sec_3'!J39","v":0},{"$f":"'Sommaire du rôle_sec_3'!K39","v":0},null,0,0,null,0,null,8,0.85,null,{"$f":"'Sommaire du rôle_sec_3'!L39","v":0},{"$f":"'Sommaire du rôle_sec_3'!M39","v":0},null,0,0,null,0,null,8,0.85,null,{"$f":"'Sommaire du rôle_sec_3'!N39","v":0},{"$f":"'Sommaire du rôle_sec_3'!O39","v":0},null,0,0,null,0,null,8,0.85,null,{"$f":"'Sommaire du rôle_sec_3'!P39","v":0},{"$f":"'Sommaire du rôle_sec_3'!Q39","v":0},null,0,0,null,0,null,8,0.85,null,{"$f":"'Sommaire du rôle_sec_3'!R39","v":0},{"$f":"'Sommaire du rôle_sec_3'!S39","v":0},null,0,0,null,0,null,8,0.85,null,{"$f":"'Sommaire du rôle_sec_3'!T39","v":0},{"$f":"'Sommaire du rôle_sec_3'!U39","v":0},null,0,0,null,0,null,8,0.85,null,{"$f":"'Sommaire du rôle_sec_3'!V39","v":0},{"$f":"'Sommaire du rôle_sec_3'!W39","v":0},null,0,0,null,0,null,8,0.85,null,{"$f":"'Sommaire du rôle_sec_3'!X39","v":0},{"$f":"'Sommaire du rôle_sec_3'!Y39","v":0},null,0,0,null,0,null,8,0.85,null,{"$f":"'Sommaire du rôle_sec_3'!Z39","v":0},{"$f":"'Sommaire du rôle_sec_3'!AA39","v":0},null,0,0,null,0]
[9,1,null,{"$f":"'Sommaire du rôle_sec_3'!H40","v":0},{"$f":"'Sommaire du rôle_sec_3'!I40","v":0},null,0,0,null,0,null,9,1,null,{"$f":"'Sommaire du rôle_sec_3'!J40","v":0},{"$f":"'Sommaire du rôle_sec_3'!K40","v":0},null,0,0,null,0,null,9,1,null,{"$f":"'Sommaire du rôle_sec_3'!L40","v":0},{"$f":"'Sommaire du rôle_sec_3'!M40","v":0},null,0,0,null,0,null,9,1,null,{"$f":"'Sommaire du rôle_sec_3'!N40","v":0},{"$f":"'Sommaire du rôle_sec_3'!O40","v":0},null,0,0,null,0,null,9,1,null,{"$f":"'Sommaire du rôle_sec_3'!P40","v":0},{"$f":"'Sommaire du rôle_sec_3'!Q40","v":0},null,0,0,null,0,null,9,1,null,{"$f":"'Sommaire du rôle_sec_3'!R40","v":0},{"$f":"'Sommaire du rôle_sec_3'!S40","v":0},null,0,0,null,0,null,9,1,null,{"$f":"'Sommaire du rôle_sec_3'!T40","v":0},{"$f":"'Sommaire du rôle_sec_3'!U40","v":0},null,0,0,null,0,null,9,1,null,{"$f":"'Sommaire du rôle_sec_3'!V40","v":0},{"$f":"'Sommaire du rôle_sec_3'!W40","v":0},null,0,0,null,0,null,9,1,null,{"$f":"'Sommaire du rôle_sec_3'!X40","v":0},{"$f":"'Sommaire du rôle_sec_3'!Y40","v":0},null,0,0,null,0,null,9,1,null,{"$f":"'Sommaire du rôle_sec_3'!Z40","v":0},{"$f":"'Sommaire du rôle_sec_3'!AA40","v":0},null,0,0,null,0]
[10,1,null,{"$f":"'Sommaire du rôle_sec_3'!H41","v":0},{"$f":"'Sommaire du rôle_sec_3'!I41","v":0},null,0,0,null,0,null,10,1,null,{"$f":"'Sommaire du rôle_sec_3'!J41","v":0},{"$f":"'Sommaire du rôle_sec_3'!K41","v":0},null,0,0,null,0,null,10,1,null,{"$f":"'Sommaire du rôle_sec_3'!L41","v":0},{"$f":"'Sommaire du rôle_sec_3'!M41","v":0},null,0,0,null,0,null,10,1,null,{"$f":"'Sommaire du rôle_sec_3'!N41","v":0},{"$f":"'Sommaire du rôle_sec_3'!O41","v":0},null,0,0,null,0,null,10,1,null,{"$f":"'Sommaire du rôle_sec_3'!P41","v":0},{"$f":"'Sommaire du rôle_sec_3'!Q41","v":0},null,0,0,null,0,null,10,1,null,{"$f":"'Sommaire du rôle_sec_3'!R41","v":0},{"$f":"'Sommaire du rôle_sec_3'!S41","v":0},null,0,0,null,0,null,10,1,null,{"$f":"'Sommaire du rôle_sec_3'!T41","v":0},{"$f":"'Sommaire du rôle_sec_3'!U41","v":0},null,0,0,null,0,null,10,1,null,{"$f":"'Sommaire du rôle_sec_3'!V41","v":0},{"$f":"'Sommaire du rôle_sec_3'!W41","v":0},null,0,0,null,0,null,10,1,null,{"$f":"'Sommaire du rôle_sec_3'!X41","v":0},{"$f":"'Sommaire du rôle_sec_3'!Y41","v":0},null,0,0,null,0,null,10,1,null,{"$f":"'Sommaire du rôle_sec_3'!Z41","v":0},{"$f":"'Sommaire du rôle_sec_3'!AA41","v":0},null,0,0,null,0]
["11 Cours de triage","100%",null,{"$f":"'Sommaire du rôle_sec_3'!H42","v":0},{"$f":"'Sommaire du rôle_sec_3'!I42","v":0},null,0,0,null,0,null,"11 Cours de triage","100%",null,{"$f":"'Sommaire du rôle_sec_3'!J42","v":0},{"$f":"'Sommaire du rôle_sec_3'!K42","v":0},null,0,0,null,0,null,"11 Cours de triage","100%",null,{"$f":"'Sommaire du rôle_sec_3'!L42","v":0},{"$f":"'Sommaire du rôle_sec_3'!M42","v":0},null,0,0,null,0,null,"11 Cours de triage","100%",null,{"$f":"'Sommaire du rôle_sec_3'!N42","v":0},{"$f":"'Sommaire du rôle_sec_3'!O42","v":0},null,0,0,null,0,null,"11 Cours de triage","100%",null,{"$f":"'Sommaire du rôle_sec_3'!P42","v":0},{"$f":"'Sommaire du rôle_sec_3'!Q42","v":0},null,0,0,null,0,null,"11 Cours de triage","100%",null,{"$f":"'Sommaire du rôle_sec_3'!R42","v":0},{"$f":"'Sommaire du rôle_sec_3'!S42","v":0},null,0,0,null,0,null,"11 Cours de triage","100%",null,{"$f":"'Sommaire du rôle_sec_3'!T42","v":0},{"$f":"'Sommaire du rôle_sec_3'!U42","v":0},null,0,0,null,0,null,"11 Cours de triage","100%",null,{"$f":"'Sommaire du rôle_sec_3'!V42","v":0},{"$f":"'Sommaire du rôle_sec_3'!W42","v":0},null,0,0,null,0,null,"11 Cours de triage","100%",null,{"$f":"'Sommaire du rôle_sec_3'!X42","v":0},{"$f":"'Sommaire du rôle_sec_3'!Y42","v":0},null,0,0,null,0,null,"11 Cours de triage","100%",null,{"$f":"'Sommaire du rôle_sec_3'!Z42","v":0},{"$f":"'Sommaire du rôle_sec_3'!AA42","v":0},null,0,0,null,0]
["12 CHSLD",0.2,null,{"$f":"'Sommaire du rôle_sec_3'!H43","v":0},null,null,0,null,null,0,null,"12 CHSLD",0.2,null,{"$f":"'Sommaire du rôle_sec_3'!J43","v":0},null,null,0,null,null,0,null,"12 CHSLD",0.2,null,{"$f":"'Sommaire du rôle_sec_3'!L43","v":0},null,null,0,null,null,0,null,"12 CHSLD",0.2,null,{"$f":"'Sommaire du rôle_sec_3'!N43","v":0},null,null,0,null,null,0,null,"12 CHSLD",0.2,null,{"$f":"'Sommaire du rôle_sec_3'!P43","v":0},null,null,0,null,null,0,null,"12 CHSLD",0.2,null,{"$f":"'Sommaire du rôle_sec_3'!R43","v":0},null,null,0,null,null,0,null,"12 CHSLD",0.2,null,{"$f":"'Sommaire du rôle_sec_3'!T43","v":0},null,null,0,null,null,0,null,"12 CHSLD",0.2,null,{"$f":"'Sommaire du rôle_sec_3'!V43","v":0},null,null,0,null,null,0,null,"12 CHSLD",0.2,null,{"$f":"'Sommaire du rôle_sec_3'!X43","v":0},null,null,0,null,null,0,null,"12 CHSLD",0.2,null,{"$f":"'Sommaire du rôle_sec_3'!Z43","v":0},null,null,0,null,null,0]
["13 Cours de triage 40 %","40%",null,{"$f":"'Sommaire du rôle_sec_3'!H44","v":0},null,null,0,null,null,0,null,"13 Cours de triage 40 %","40%",null,{"$f":"'Sommaire du rôle_sec_3'!J44","v":0},null,null,0,null,null,0,null,"13 Cours de triage 40 %","40%",null,{"$f":"'Sommaire du rôle_sec_3'!L44","v":0},null,null,0,null,null,0,null,"13 Cours de triage 40 %","40%",null,{"$f":"'Sommaire du rôle_sec_3'!N44","v":0},null,null,0,null,null,0,null,"13 Cours de triage 40 %","40%",null,{"$f":"'Sommaire du rôle_sec_3'!P44","v":0},null,null,0,null,null,0,null,"13 Cours de triage 40 %","40%",null,{"$f":"'Sommaire du rôle_sec_3'!R44","v":0},null,null,0,null,null,0,null,"13 Cours de triage 40 %","40%",null,{"$f":"'Sommaire du rôle_sec_3'!T44","v":0},null,null,0,null,null,0,null,"13 Cours de triage 40 %","40%",null,{"$f":"'Sommaire du rôle_sec_3'!V44","v":0},null,null,0,null,null,0,null,"13 Cours de triage 40 %","40%",null,{"$f":"'Sommaire du rôle_sec_3'!X44","v":0},null,null,0,null,null,0,null,"13 Cours de triage 40 %","40%",null,{"$f":"'Sommaire du rôle_sec_3'!Z44","v":0},null,null,0,null,null,0]
[" APPLICATION DU TNR QUAND TTVD",1,null,{"$f":"'Sommaire du rôle_sec_3'!H45","v":0},{"$f":"'Sommaire du rôle_sec_3'!I45","v":0},null,0,{"$f":"B121*E121","v":0},null,0,null," APPLICATION DU TNR QUAND TTVD",1,null,{"$f":"'Sommaire du rôle_sec_3'!J45","v":0},{"$f":"'Sommaire du rôle_sec_3'!K45","v":0},null,0,{"$f":"M121*P121","v":0},null,0,null," APPLICATION DU TNR QUAND TTVD",1,null,{"$f":"'Sommaire du rôle_sec_3'!L45","v":0},{"$f":"'Sommaire du rôle_sec_3'!M45","v":0},null,0,{"$f":"X121*AA121","v":0},null,0,null," APPLICATION DU TNR QUAND TTVD",1,null,{"$f":"'Sommaire du rôle_sec_3'!N45","v":0},{"$f":"'Sommaire du rôle_sec_3'!O45","v":0},null,0,{"$f":"AI121*AL121","v":0},null,0,null," APPLICATION DU TNR QUAND TTVD",1,null,{"$f":"'Sommaire du rôle_sec_3'!P45","v":0},{"$f":"'Sommaire du rôle_sec_3'!Q45","v":0},null,0,{"$f":"AT121*AW121","v":0},null,0,null," APPLICATION DU TNR QUAND TTVD",1,null,{"$f":"'Sommaire du rôle_sec_3'!R45","v":0},{"$f":"'Sommaire du rôle_sec_3'!S45","v":0},null,0,{"$f":"BE121*BH121","v":0},null,0,null," APPLICATION DU TNR QUAND TTVD",1,null,{"$f":"'Sommaire du rôle_sec_3'!T45","v":0},{"$f":"'Sommaire du rôle_sec_3'!U45","v":0},null,0,{"$f":"BP121*BS121","v":0},null,0,null," APPLICATION DU TNR QUAND TTVD",1,null,{"$f":"'Sommaire du rôle_sec_3'!AE45","v":0},{"$f":"'Sommaire du rôle_sec_3'!AF45","v":0},null,0,{"$f":"CA121*CD121","v":0},null,0,null," APPLICATION DU TNR QUAND TTVD",1,null,{"$f":"'Sommaire du rôle_sec_3'!X45","v":0},{"$f":"'Sommaire du rôle_sec_3'!Y45","v":0},null,0,{"$f":"CL121*CO121","v":0},null,0,null," APPLICATION DU TNR QUAND TTVD",1,null,{"$f":"'Sommaire du rôle_sec_3'!Z45","v":0},{"$f":"'Sommaire du rôle_sec_3'!AA45","v":0},null,0,{"$f":"CW121*CZ121","v":0},null,0]
["Total",null,null,null,null,null,{"$f":"SUM(G106:G121)","v":0},{"$f":"SUM(H106:H121)","v":0},null,0,null,"Total",null,null,null,null,null,{"$f":"SUM(R106:R121)","v":0},{"$f":"SUM(S106:S121)","v":0},null,0,null,"Total",null,null,null,null,null,{"$f":"SUM(AC106:AC121)","v":0},{"$f":"SUM(AD106:AD121)","v":0},null,0,null,"Total",null,null,null,null,null,{"$f":"SUM(AN106:AN121)","v":0},{"$f":"SUM(AO106:AO121)","v":0},null,0,null,"Total",null,null,null,null,null,{"$f":"SUM(AY106:AY121)","v":0},{"$f":"SUM(AZ106:AZ121)","v":0},null,0,null,"Total",null,null,null,null,null,{"$f":"SUM(BJ106:BJ121)","v":0},{"$f":"SUM(BK106:BK121)","v":0},null,0,null,"Total",null,null,null,null,null,{"$f":"SUM(BU106:BU121)","v":0},{"$f":"SUM(BV106:BV121)","v":0},null,0,null,"Total",null,null,null,null,null,{"$f":"SUM(CF106:CF121)","v":0},{"$f":"SUM(CG106:CG121)","v":0},null,0,null,"Total",null,null,null,null,null,{"$f":"SUM(CQ106:CQ121)","v":0},{"$f":"SUM(CR106:CR121)","v":0},null,0,null,"Total",null,null,null,null,null,{"$f":"SUM(DB106:DB121)","v":0},{"$f":"SUM(DC106:DC121)","v":0},null,0]
[]
["ASSIETTE SOUS-CATÉGORIE RÉSIDUELLE"]
["Classe non résidentielle","Pourcentage de taxation",null,"VALEUR À 100 %"]
[null,null,null,"  Imposables","Compensables",null,"Imposables pondérées","Compensables pondérées",null,"Total"]
[null,"(1)",null,"(2)","(3)",null,"(4) = (1) X (2)","(5) = (1) X (3)",null,"(6) = (4) + (5)"]
[" 1A",0.999,null,{"$f":"'Sommaire du rôle_sec_3'!F53","v":0},{"$f":"'Sommaire du rôle_sec_3'!G53","v":0},null,{"$f":"D128*B128","v":0},{"$f":"B128*E128","v":0},null,{"$f":"G128+H128","v":0},2359638]
[" 1B",0.995,null,{"$f":"'Sommaire du rôle_sec_3'!F54","v":0},{"$f":"'Sommaire du rôle_sec_3'!G54","v":0},null,0,0,null,0,670132.5]
[" 1C",0.99,null,{"$f":"'Sommaire du rôle_sec_3'!F55","v":0},{"$f":"'Sommaire du rôle_sec_3'!G55","v":0},null,0,0,null,0,4405005]
[2,0.97,null,{"$f":"'Sommaire du rôle_sec_3'!F56","v":0},{"$f":"'Sommaire du rôle_sec_3'!G56","v":0},null,0,0,null,0,21413332]
[3,0.94,null,{"$f":"'Sommaire du rôle_sec_3'!F57","v":0},{"$f":"'Sommaire du rôle_sec_3'!G57","v":0},null,0,0,null,0,36190282]
[4,0.88,null,{"$f":"'Sommaire du rôle_sec_3'!F58","v":0},{"$f":"'Sommaire du rôle_sec_3'!G58","v":0},null,0,0,null,0,27846104]
[5,0.78,null,{"$f":"'Sommaire du rôle_sec_3'!F59","v":0},{"$f":"'Sommaire du rôle_sec_3'!G59","v":0},null,0,0,null,0,22550424]
[6,0.6,null,{"$f":"'Sommaire du rôle_sec_3'!F60","v":0},{"$f":"'Sommaire du rôle_sec_3'!G60","v":0},null,0,0,null,0,19039560]
[7,0.4,null,{"$f":"'Sommaire du rôle_sec_3'!F61","v":0},{"$f":"'Sommaire du rôle_sec_3'!G61","v":0},null,0,0,null,0,37782600]
[8,0.15000000000000002,null,{"$f":"'Sommaire du rôle_sec_3'!F62","v":0},{"$f":"'Sommaire du rôle_sec_3'!G62","v":0},null,0,0,null,0,32037030.000000004]
["IMMEUBLES SANS PARTIE NON RÉSIDENTIELLE",1,null,{"$f":"'Sommaire du rôle_sec_3'!F63","v":0},{"$f":"'Sommaire du rôle_sec_3'!G63","v":0},null,0,0,null,0,7336485128]
["12  CHSLD",0.8,null,{"$f":"'Sommaire du rôle_sec_3'!F64","v":0},{"$f":"'Sommaire du rôle_sec_3'!G64","v":0},null,0]
["13 Cours de triage ",0.6,null,{"$f":"'Sommaire du rôle_sec_3'!F65","v":0},{"$f":"'Sommaire du rôle_sec_3'!G65","v":0},null,0]
["Total",null,null,null,null,null,{"$f":"SUM(G128:G140)","v":0},{"$f":"SUM(H128:H138)","v":0},{"$f":"SUM(I128:I138)","v":0},{"$f":"G141+H141","v":0}]
[]
["ASSIETTE AU TAUX RÉSIDENTIEL SOUS-CATÉGORIE 1",null,null,null,null,null,null,null,null,null,null,"ASSIETTE AU TAUX RÉSIDENTIEL SOUS-CATÉGORIE 2",null,null,null,null,null,null,null,null,null,null,"ASSIETTE AU TAUX RÉSIDENTIEL SOUS-CATÉGORIE 3",null,null,null,null,null,null,null,null,null,null,"ASSIETTE AU TAUX RÉSIDENTIEL SOUS-CATÉGORIE 4",null,null,null,null,null,null,null,null,null,null,"ASSIETTE AU TAUX RÉSIDENTIEL SOUS-CATÉGORIE 5",null,null,null,null,null,null,null,null,null,null,"ASSIETTE AU TAUX RÉSIDENTIEL SOUS-CATÉGORIE 6",null,null,null,null,null,null,null,null,null,null,"ASSIETTE AU TAUX RÉSIDENTIEL SOUS-CATÉGORIE 7",null,null,null,null,null,null,null,null,null,null,"ASSIETTE AU TAUX RÉSIDENTIEL SOUS-CATÉGORIE 8",null,null,null,null,null,null,null,null,null,null,"ASSIETTE AU TAUX RÉSIDENTIEL SOUS-CATÉGORIE 9",null,null,null,null,null,null,null,null,null,null,"ASSIETTE AU TAUX RÉSIDENTIEL SOUS-CATÉGORIE 10"]
["Classe non résidentielle","Pourcentage de taxation",null,"VALEUR À 100 %",null,null,null,null,null,null,null,"Classe non résidentielle","Pourcentage de taxation",null,"VALEUR À 100 %",null,null,null,null,null,null,null,"Classe non résidentielle","Pourcentage de taxation",null,"VALEUR À 100 %",null,null,null,null,null,null,null,"Classe non résidentielle","Pourcentage de taxation",null,"VALEUR À 100 %",null,null,null,null,null,null,null,"Classe non résidentielle","Pourcentage de taxation",null,"VALEUR À 100 %",null,null,null,null,null,null,null,"Classe non résidentielle","Pourcentage de taxation",null,"VALEUR À 100 %",null,null,null,null,null,null,null,"Classe non résidentielle","Pourcentage de taxation",null,"VALEUR À 100 %",null,null,null,null,null,null,null,"Classe non résidentielle","Pourcentage de taxation",null,"VALEUR À 100 %",null,null,null,null,null,null,null,"Classe non résidentielle","Pourcentage de taxation",null,"VALEUR À 100 %",null,null,null,null,null,null,null,"Classe non résidentielle","Pourcentage de taxation",null,"VALEUR À 100 %"]
[null,null,null,"  Imposables","Compensables",null,"Imposables pondérées","Compensables pondérées",null,"Total",null,null,null,null,"  Imposables","Compensables",null,"Imposables pondérées","Compensables pondérées",null,"Total",null,null,null,null,"  Imposables","Compensables",null,"Imposables pondérées","Compensables pondérées",null,"Total",null,null,null,null,"  Imposables","Compensables",null,"Imposables pondérées","Compensables pondérées",null,"Total",null,null,null,null,"  Imposables","Compensables",null,"Imposables pondérées","Compensables pondérées",null,"Total",null,null,null,null,"  Imposables","Compensables",null,"Imposables pondérées","Compensables pondérées",null,"Total",null,null,null,null,"  Imposables","Compensables",null,"Imposables pondérées","Compensables pondérées",null,"Total",null,null,null,null,"  Imposables","Compensables",null,"Imposables pondérées","Compensables pondérées",null,"Total",null,null,null,null,"  Imposables","Compensables",null,"Imposables pondérées","Compensables pondérées",null,"Total",null,null,null,null,"  Imposables","Compensables",null,"Imposables pondérées","Compensables pondérées",null,"Total"]
[null,"(1)",null,"(2)","(3)",null,"(4) = (1) X (2)","(5) = (1) X (3)",null,"(6) = (4) + (5)",null,null,"(1)",null,"(2)","(3)",null,"(4) = (1) X (2)","(5) = (1) X (3)",null,"(6) = (4) + (5)",null,null,"(1)",null,"(2)","(3)",null,"(4) = (1) X (2)","(5) = (1) X (3)",null,"(6) = (4) + (5)",null,null,"(1)",null,"(2)","(3)",null,"(4) = (1) X (2)","(5) = (1) X (3)",null,"(6) = (4) + (5)",null,null,"(1)",null,"(2)","(3)",null,"(4) = (1) X (2)","(5) = (1) X (3)",null,"(6) = (4) + (5)",null,null,"(1)",null,"(2)","(3)",null,"(4) = (1) X (2)","(5) = (1) X (3)",null,"(6) = (4) + (5)",null,null,"(1)",null,"(2)","(3)",null,"(4) = (1) X (2)","(5) = (1) X (3)",null,"(6) = (4) + (5)",null,null,"(1)",null,"(2)","(3)",null,"(4) = (1) X (2)","(5) = (1) X (3)",null,"(6) = (4) + (5)",null,null,"(1)",null,"(2)","(3)",null,"(4) = (1) X (2)","(5) = (1) X (3)",null,"(6) = (4) + (5)",null,null,"(1)",null,"(2)","(3)",null,"(4) = (1) X (2)","(5) = (1) X (3)",null,"(6) = (4) + (5)"]
[" 1A",0.999,null,{"$f":"'Sommaire du rôle_sec_3'!H53","v":0},{"$f":"'Sommaire du rôle_sec_3'!I53","v":0},null,{"$f":"D147*B147","v":0},{"$f":"B147*E147","v":0},null,{"$f":"G147+H147","v":0},null," 1A",0.999,null,{"$f":"'Sommaire du rôle_sec_3'!J53","v":0},{"$f":"'Sommaire du rôle_sec_3'!K53","v":0},null,{"$f":"O147*M147","v":0},{"$f":"M147*P147","v":0},null,{"$f":"R147+S147","v":0},null," 1A",0.999,null,{"$f":"'Sommaire du rôle_sec_3'!L53","v":0},{"$f":"'Sommaire du rôle_sec_3'!M53","v":0},null,{"$f":"Z147*X147","v":0},{"$f":"X147*AA147","v":0},null,{"$f":"AC147+AD147","v":0},null," 1A",0.999,null,{"$f":"'Sommaire du rôle_sec_3'!N53","v":0},{"$f":"'Sommaire du rôle_sec_3'!O53","v":0},null,{"$f":"AK147*AI147","v":0},{"$f":"AI147*AL147","v":0},null,{"$f":"AN147+AO147","v":0},null," 1A",0.999,null,{"$f":"'Sommaire du rôle_sec_3'!P53","v":0},{"$f":"'Sommaire du rôle_sec_3'!Q53","v":0},null,{"$f":"AV147*AT147","v":0},{"$f":"AT147*AW147","v":0},null,{"$f":"AY147+AZ147","v":0},null," 1A",0.999,null,{"$f":"'Sommaire du rôle_sec_3'!R53","v":0},{"$f":"'Sommaire du rôle_sec_3'!S53","v":0},null,{"$f":"BG147*BE147","v":0},{"$f":"BE147*BH147","v":0},null,{"$f":"BJ147+BK147","v":0},null," 1A",0.999,null,{"$f":"'Sommaire du rôle_sec_3'!T53","v":0},{"$f":"'Sommaire du rôle_sec_3'!U53","v":0},null,{"$f":"BR147*BP147","v":0},{"$f":"BP147*BS147","v":0},null,{"$f":"BU147+BV147","v":0},null," 1A",0.999,null,{"$f":"'Sommaire du rôle_sec_3'!V53","v":0},{"$f":"'Sommaire du rôle_sec_3'!W53","v":0},null,{"$f":"CC147*CA147","v":0},{"$f":"CA147*CD147","v":0},null,{"$f":"CF147+CG147","v":0},null," 1A",0.999,null,{"$f":"'Sommaire du rôle_sec_3'!X53","v":0},{"$f":"'Sommaire du rôle_sec_3'!Y53","v":0},null,{"$f":"CN147*CL147","v":0},{"$f":"CL147*CO147","v":0},null,{"$f":"CQ147+CR147","v":0},null," 1A",0.999,null,{"$f":"'Sommaire du rôle_sec_3'!Z53","v":0},{"$f":"'Sommaire du rôle_sec_3'!AA53","v":0},null,{"$f":"CY147*CW147","v":0},{"$f":"CW147*CZ147","v":0},null,{"$f":"DB147+DC147","v":0}]
[" 1B",0.995,null,{"$f":"'Sommaire du rôle_sec_3'!H54","v":0},{"$f":"'Sommaire du rôle_sec_3'!I54","v":0},null,0,0,null,0,null," 1B",0.995,null,{"$f":"'Sommaire du rôle_sec_3'!J54","v":0},{"$f":"'Sommaire du rôle_sec_3'!K54","v":0},null,0,0,null,0,null," 1B",0.995,null,{"$f":"'Sommaire du rôle_sec_3'!L54","v":0},{"$f":"'Sommaire du rôle_sec_3'!M54","v":0},null,0,0,null,0,null," 1B",0.995,null,{"$f":"'Sommaire du rôle_sec_3'!N54","v":0},{"$f":"'Sommaire du rôle_sec_3'!O54","v":0},null,0,0,null,0,null," 1B",0.995,null,{"$f":"'Sommaire du rôle_sec_3'!P54","v":0},{"$f":"'Sommaire du rôle_sec_3'!Q54","v":0},null,0,0,null,0,null," 1B",0.995,null,{"$f":"'Sommaire du rôle_sec_3'!R54","v":0},{"$f":"'Sommaire du rôle_sec_3'!S54","v":0},null,0,0,null,0,null," 1B",0.995,null,{"$f":"'Sommaire du rôle_sec_3'!T54","v":0},{"$f":"'Sommaire du rôle_sec_3'!U54","v":0},null,0,0,null,0,null," 1B",0.995,null,{"$f":"'Sommaire du rôle_sec_3'!V54","v":0},{"$f":"'Sommaire du rôle_sec_3'!W54","v":0},null,0,0,null,0,null," 1B",0.995,null,{"$f":"'Sommaire du rôle_sec_3'!X54","v":0},{"$f":"'Sommaire du rôle_sec_3'!Y54","v":0},null,0,0,null,0,null," 1B",0.995,null,{"$f":"'Sommaire du rôle_sec_3'!Z54","v":0},{"$f":"'Sommaire du rôle_sec_3'!AA54","v":0},null,0,0,null,0]
[" 1C",0.99,null,{"$f":"'Sommaire du rôle_sec_3'!H55","v":0},{"$f":"'Sommaire du rôle_sec_3'!I55","v":0},null,0,0,null,0,null," 1C",0.99,null,{"$f":"'Sommaire du rôle_sec_3'!J55","v":0},{"$f":"'Sommaire du rôle_sec_3'!K55","v":0},null,0,0,null,0,null," 1C",0.99,null,{"$f":"'Sommaire du rôle_sec_3'!L55","v":0},{"$f":"'Sommaire du rôle_sec_3'!M55","v":0},null,0,0,null,0,null," 1C",0.99,null,{"$f":"'Sommaire du rôle_sec_3'!N55","v":0},{"$f":"'Sommaire du rôle_sec_3'!O55","v":0},null,0,0,null,0,null," 1C",0.99,null,{"$f":"'Sommaire du rôle_sec_3'!P55","v":0},{"$f":"'Sommaire du rôle_sec_3'!Q55","v":0},null,0,0,null,0,null," 1C",0.99,null,{"$f":"'Sommaire du rôle_sec_3'!R55","v":0},{"$f":"'Sommaire du rôle_sec_3'!S55","v":0},null,0,0,null,0,null," 1C",0.99,null,{"$f":"'Sommaire du rôle_sec_3'!T55","v":0},{"$f":"'Sommaire du rôle_sec_3'!U55","v":0},null,0,0,null,0,null," 1C",0.99,null,{"$f":"'Sommaire du rôle_sec_3'!V55","v":0},{"$f":"'Sommaire du rôle_sec_3'!W55","v":0},null,0,0,null,0,null," 1C",0.99,null,{"$f":"'Sommaire du rôle_sec_3'!X55","v":0},{"$f":"'Sommaire du rôle_sec_3'!Y55","v":0},null,0,0,null,0,null," 1C",0.99,null,{"$f":"'Sommaire du rôle_sec_3'!Z55","v":0},{"$f":"'Sommaire du rôle_sec_3'!AA55","v":0},null,0,0,null,0]
[2,0.97,null,{"$f":"'Sommaire du rôle_sec_3'!H56","v":0},{"$f":"'Sommaire du rôle_sec_3'!I56","v":0},null,0,0,null,0,null,2,0.97,null,{"$f":"'Sommaire du rôle_sec_3'!J56","v":0},{"$f":"'Sommaire du rôle_sec_3'!K56","v":0},null,0,0,null,0,null,2,0.97,null,{"$f":"'Sommaire du rôle_sec_3'!L56","v":0},{"$f":"'Sommaire du rôle_sec_3'!M56","v":0},null,0,0,null,0,null,2,0.97,null,{"$f":"'Sommaire du rôle_sec_3'!N56","v":0},{"$f":"'Sommaire du rôle_sec_3'!O56","v":0},null,0,0,null,0,null,2,0.97,null,{"$f":"'Sommaire du rôle_sec_3'!P56","v":0},{"$f":"'Sommaire du rôle_sec_3'!Q56","v":0},null,0,0,null,0,null,2,0.97,null,{"$f":"'Sommaire du rôle_sec_3'!R56","v":0},{"$f":"'Sommaire du rôle_sec_3'!S56","v":0},null,0,0,null,0,null,2,0.97,null,{"$f":"'Sommaire du rôle_sec_3'!T56","v":0},{"$f":"'Sommaire du rôle_sec_3'!U56","v":0},null,0,0,null,0,null,2,0.97,null,{"$f":"'Sommaire du rôle_sec_3'!V56","v":0},{"$f":"'Sommaire du rôle_sec_3'!W56","v":0},null,0,0,null,0,null,2,0.97,null,{"$f":"'Sommaire du rôle_sec_3'!X56","v":0},{"$f":"'Sommaire du rôle_sec_3'!Y56","v":0},null,0,0,null,0,null,2,0.97,null,{"$f":"'Sommaire du rôle_sec_3'!Z56","v":0},{"$f":"'Sommaire du rôle_sec_3'!AA56","v":0},null,0,0,null,0]
[3,0.94,null,{"$f":"'Sommaire du rôle_sec_3'!H57","v":0},{"$f":"'Sommaire du rôle_sec_3'!I57","v":0},null,0,0,null,0,null,3,0.94,null,{"$f":"'Sommaire du rôle_sec_3'!J57","v":0},{"$f":"'Sommaire du rôle_sec_3'!K57","v":0},null,0,0,null,0,null,3,0.94,null,{"$f":"'Sommaire du rôle_sec_3'!L57","v":0},{"$f":"'Sommaire du rôle_sec_3'!M57","v":0},null,0,0,null,0,null,3,0.94,null,{"$f":"'Sommaire du rôle_sec_3'!N57","v":0},{"$f":"'Sommaire du rôle_sec_3'!O57","v":0},null,0,0,null,0,null,3,0.94,null,{"$f":"'Sommaire du rôle_sec_3'!P57","v":0},{"$f":"'Sommaire du rôle_sec_3'!Q57","v":0},null,0,0,null,0,null,3,0.94,null,{"$f":"'Sommaire du rôle_sec_3'!R57","v":0},{"$f":"'Sommaire du rôle_sec_3'!S57","v":0},null,0,0,null,0,null,3,0.94,null,{"$f":"'Sommaire du rôle_sec_3'!T57","v":0},{"$f":"'Sommaire du rôle_sec_3'!U57","v":0},null,0,0,null,0,null,3,0.94,null,{"$f":"'Sommaire du rôle_sec_3'!V57","v":0},{"$f":"'Sommaire du rôle_sec_3'!W57","v":0},null,0,0,null,0,null,3,0.94,null,{"$f":"'Sommaire du rôle_sec_3'!X57","v":0},{"$f":"'Sommaire du rôle_sec_3'!Y57","v":0},null,0,0,null,0,null,3,0.94,null,{"$f":"'Sommaire du rôle_sec_3'!Z57","v":0},{"$f":"'Sommaire du rôle_sec_3'!AA57","v":0},null,0,0,null,0]
[4,0.88,null,{"$f":"'Sommaire du rôle_sec_3'!H58","v":0},{"$f":"'Sommaire du rôle_sec_3'!I58","v":0},null,0,0,null,0,null,4,0.88,null,{"$f":"'Sommaire du rôle_sec_3'!J58","v":0},{"$f":"'Sommaire du rôle_sec_3'!K58","v":0},null,0,0,null,0,null,4,0.88,null,{"$f":"'Sommaire du rôle_sec_3'!L58","v":0},{"$f":"'Sommaire du rôle_sec_3'!M58","v":0},null,0,0,null,0,null,4,0.88,null,{"$f":"'Sommaire du rôle_sec_3'!N58","v":0},{"$f":"'Sommaire du rôle_sec_3'!O58","v":0},null,0,0,null,0,null,4,0.88,null,{"$f":"'Sommaire du rôle_sec_3'!P58","v":0},{"$f":"'Sommaire du rôle_sec_3'!Q58","v":0},null,0,0,null,0,null,4,0.88,null,{"$f":"'Sommaire du rôle_sec_3'!R58","v":0},{"$f":"'Sommaire du rôle_sec_3'!S58","v":0},null,0,0,null,0,null,4,0.88,null,{"$f":"'Sommaire du rôle_sec_3'!T58","v":0},{"$f":"'Sommaire du rôle_sec_3'!U58","v":0},null,0,0,null,0,null,4,0.88,null,{"$f":"'Sommaire du rôle_sec_3'!V58","v":0},{"$f":"'Sommaire du rôle_sec_3'!W58","v":0},null,0,0,null,0,null,4,0.88,null,{"$f":"'Sommaire du rôle_sec_3'!X58","v":0},{"$f":"'Sommaire du rôle_sec_3'!Y58","v":0},null,0,0,null,0,null,4,0.88,null,{"$f":"'Sommaire du rôle_sec_3'!Z58","v":0},{"$f":"'Sommaire du rôle_sec_3'!AA58","v":0},null,0,0,null,0]
[5,0.78,null,{"$f":"'Sommaire du rôle_sec_3'!H59","v":0},{"$f":"'Sommaire du rôle_sec_3'!I59","v":0},null,0,0,null,0,null,5,0.78,null,{"$f":"'Sommaire du rôle_sec_3'!J59","v":0},{"$f":"'Sommaire du rôle_sec_3'!K59","v":0},null,0,0,null,0,null,5,0.78,null,{"$f":"'Sommaire du rôle_sec_3'!L59","v":0},{"$f":"'Sommaire du rôle_sec_3'!M59","v":0},null,0,0,null,0,null,5,0.78,null,{"$f":"'Sommaire du rôle_sec_3'!N59","v":0},{"$f":"'Sommaire du rôle_sec_3'!O59","v":0},null,0,0,null,0,null,5,0.78,null,{"$f":"'Sommaire du rôle_sec_3'!P59","v":0},{"$f":"'Sommaire du rôle_sec_3'!Q59","v":0},null,0,0,null,0,null,5,0.78,null,{"$f":"'Sommaire du rôle_sec_3'!R59","v":0},{"$f":"'Sommaire du rôle_sec_3'!S59","v":0},null,0,0,null,0,null,5,0.78,null,{"$f":"'Sommaire du rôle_sec_3'!T59","v":0},{"$f":"'Sommaire du rôle_sec_3'!U59","v":0},null,0,0,null,0,null,5,0.78,null,{"$f":"'Sommaire du rôle_sec_3'!V59","v":0},{"$f":"'Sommaire du rôle_sec_3'!W59","v":0},null,0,0,null,0,null,5,0.78,null,{"$f":"'Sommaire du rôle_sec_3'!X59","v":0},{"$f":"'Sommaire du rôle_sec_3'!Y59","v":0},null,0,0,null,0,null,5,0.78,null,{"$f":"'Sommaire du rôle_sec_3'!Z59","v":0},{"$f":"'Sommaire du rôle_sec_3'!AA59","v":0},null,0,0,null,0]
[6,0.6,null,{"$f":"'Sommaire du rôle_sec_3'!H60","v":0},{"$f":"'Sommaire du rôle_sec_3'!I60","v":0},null,0,0,null,0,null,6,0.6,null,{"$f":"'Sommaire du rôle_sec_3'!J60","v":0},{"$f":"'Sommaire du rôle_sec_3'!K60","v":0},null,0,0,null,0,null,6,0.6,null,{"$f":"'Sommaire du rôle_sec_3'!L60","v":0},{"$f":"'Sommaire du rôle_sec_3'!M60","v":0},null,0,0,null,0,null,6,0.6,null,{"$f":"'Sommaire du rôle_sec_3'!N60","v":0},{"$f":"'Sommaire du rôle_sec_3'!O60","v":0},null,0,0,null,0,null,6,0.6,null,{"$f":"'Sommaire du rôle_sec_3'!P60","v":0},{"$f":"'Sommaire du rôle_sec_3'!Q60","v":0},null,0,0,null,0,null,6,0.6,null,{"$f":"'Sommaire du rôle_sec_3'!R60","v":0},{"$f":"'Sommaire du rôle_sec_3'!S60","v":0},null,0,0,null,0,null,6,0.6,null,{"$f":"'Sommaire du rôle_sec_3'!T60","v":0},{"$f":"'Sommaire du rôle_sec_3'!U60","v":0},null,0,0,null,0,null,6,0.6,null,{"$f":"'Sommaire du rôle_sec_3'!V60","v":0},{"$f":"'Sommaire du rôle_sec_3'!W60","v":0},null,0,0,null,0,null,6,0.6,null,{"$f":"'Sommaire du rôle_sec_3'!X60","v":0},{"$f":"'Sommaire du rôle_sec_3'!Y60","v":0},null,0,0,null,0,null,6,0.6,null,{"$f":"'Sommaire du rôle_sec_3'!Z60","v":0},{"$f":"'Sommaire du rôle_sec_3'!AA60","v":0},null,0,0,null,0]
[7,0.4,null,{"$f":"'Sommaire du rôle_sec_3'!H61","v":0},{"$f":"'Sommaire du rôle_sec_3'!I61","v":0},null,0,0,null,0,null,7,0.4,null,{"$f":"'Sommaire du rôle_sec_3'!J61","v":0},{"$f":"'Sommaire du rôle_sec_3'!K61","v":0},null,0,0,null,0,null,7,0.4,null,{"$f":"'Sommaire du rôle_sec_3'!L61","v":0},{"$f":"'Sommaire du rôle_sec_3'!M61","v":0},null,0,0,null,0,null,7,0.4,null,{"$f":"'Sommaire du rôle_sec_3'!N61","v":0},{"$f":"'Sommaire du rôle_sec_3'!O61","v":0},null,0,0,null,0,null,7,0.4,null,{"$f":"'Sommaire du rôle_sec_3'!P61","v":0},{"$f":"'Sommaire du rôle_sec_3'!Q61","v":0},null,0,0,null,0,null,7,0.4,null,{"$f":"'Sommaire du rôle_sec_3'!R61","v":0},{"$f":"'Sommaire du rôle_sec_3'!S61","v":0},null,0,0,null,0,null,7,0.4,null,{"$f":"'Sommaire du rôle_sec_3'!T61","v":0},{"$f":"'Sommaire du rôle_sec_3'!U61","v":0},null,0,0,null,0,null,7,0.4,null,{"$f":"'Sommaire du rôle_sec_3'!V61","v":0},{"$f":"'Sommaire du rôle_sec_3'!W61","v":0},null,0,0,null,0,null,7,0.4,null,{"$f":"'Sommaire du rôle_sec_3'!X61","v":0},{"$f":"'Sommaire du rôle_sec_3'!Y61","v":0},null,0,0,null,0,null,7,0.4,null,{"$f":"'Sommaire du rôle_sec_3'!Z61","v":0},{"$f":"'Sommaire du rôle_sec_3'!AA61","v":0},null,0,0,null,0]
[8,0.15000000000000002,null,{"$f":"'Sommaire du rôle_sec_3'!H62","v":0},{"$f":"'Sommaire du rôle_sec_3'!I62","v":0},null,0,0,null,0,null,8,0.15000000000000002,null,{"$f":"'Sommaire du rôle_sec_3'!J62","v":0},{"$f":"'Sommaire du rôle_sec_3'!K62","v":0},null,0,0,null,0,null,8,0.15000000000000002,null,{"$f":"'Sommaire du rôle_sec_3'!L62","v":0},{"$f":"'Sommaire du rôle_sec_3'!M62","v":0},null,0,0,null,0,null,8,0.15000000000000002,null,{"$f":"'Sommaire du rôle_sec_3'!N62","v":0},{"$f":"'Sommaire du rôle_sec_3'!O62","v":0},null,0,0,null,0,null,8,0.15000000000000002,null,{"$f":"'Sommaire du rôle_sec_3'!P62","v":0},{"$f":"'Sommaire du rôle_sec_3'!Q62","v":0},null,0,0,null,0,null,8,0.15000000000000002,null,{"$f":"'Sommaire du rôle_sec_3'!R62","v":0},{"$f":"'Sommaire du rôle_sec_3'!S62","v":0},null,0,0,null,0,null,8,0.15000000000000002,null,{"$f":"'Sommaire du rôle_sec_3'!T62","v":0},{"$f":"'Sommaire du rôle_sec_3'!U62","v":0},null,0,0,null,0,null,8,0.15000000000000002,null,{"$f":"'Sommaire du rôle_sec_3'!V62","v":0},{"$f":"'Sommaire du rôle_sec_3'!W62","v":0},null,0,0,null,0,null,8,0.15000000000000002,null,{"$f":"'Sommaire du rôle_sec_3'!X62","v":0},{"$f":"'Sommaire du rôle_sec_3'!Y62","v":0},null,0,0,null,0,null,8,0.15000000000000002,null,{"$f":"'Sommaire du rôle_sec_3'!Z62","v":0},{"$f":"'Sommaire du rôle_sec_3'!AA62","v":0},null,0,0,null,0]
["IMMEUBLES SANS PARTIE NON RÉSIDENTIELLE",1,null,{"$f":"'Sommaire du rôle_sec_3'!H63","v":0},{"$f":"'Sommaire du rôle_sec_3'!I63","v":0},null,0,0,null,0,null,"IMMEUBLES SANS PARTIE NON RÉSIDENTIELLE",1,null,{"$f":"'Sommaire du rôle_sec_3'!J63","v":0},{"$f":"'Sommaire du rôle_sec_3'!K63","v":0},null,0,0,null,0,null,"IMMEUBLES SANS PARTIE NON RÉSIDENTIELLE",1,null,{"$f":"'Sommaire du rôle_sec_3'!L63","v":0},{"$f":"'Sommaire du rôle_sec_3'!M63","v":0},null,0,0,null,0,null,"IMMEUBLES SANS PARTIE NON RÉSIDENTIELLE",1,null,{"$f":"'Sommaire du rôle_sec_3'!N63","v":0},{"$f":"'Sommaire du rôle_sec_3'!O63","v":0},null,0,0,null,0,null,"IMMEUBLES SANS PARTIE NON RÉSIDENTIELLE",1,null,{"$f":"'Sommaire du rôle_sec_3'!P63","v":0},{"$f":"'Sommaire du rôle_sec_3'!Q63","v":0},null,0,0,null,0,null,"IMMEUBLES SANS PARTIE NON RÉSIDENTIELLE",1,null,{"$f":"'Sommaire du rôle_sec_3'!R63","v":0},{"$f":"'Sommaire du rôle_sec_3'!S63","v":0},null,0,0,null,0,null,"IMMEUBLES SANS PARTIE NON RÉSIDENTIELLE",1,null,{"$f":"'Sommaire du rôle_sec_3'!T63","v":0},{"$f":"'Sommaire du rôle_sec_3'!U63","v":0},null,0,0,null,0,null,"IMMEUBLES SANS PARTIE NON RÉSIDENTIELLE",1,null,{"$f":"'Sommaire du rôle_sec_3'!V63","v":0},{"$f":"'Sommaire du rôle_sec_3'!W63","v":0},null,0,0,null,0,null,"IMMEUBLES SANS PARTIE NON RÉSIDENTIELLE",1,null,{"$f":"'Sommaire du rôle_sec_3'!X63","v":0},{"$f":"'Sommaire du rôle_sec_3'!Y63","v":0},null,0,0,null,0,null,"IMMEUBLES SANS PARTIE NON RÉSIDENTIELLE",1,null,{"$f":"'Sommaire du rôle_sec_3'!Z63","v":0},{"$f":"'Sommaire du rôle_sec_3'!AA63","v":0},null,0,0,null,0]
["12  CHSLD",0.8,null,null,null,null,0,null,null,null,null,"12  CHSLD",0.8,null,null,null,null,0,null,null,null,null,"12  CHSLD",0.8,null,null,null,null,0,null,null,null,null,"12  CHSLD",0.8,null,null,null,null,0,null,null,null,null,"12  CHSLD",0.8,null,null,null,null,0,null,null,null,null,"12  CHSLD",0.8,null,null,null,null,0,null,null,null,null,"12  CHSLD",0.8,null,null,null,null,0,null,null,null,null,"12  CHSLD",0.8,null,null,null,null,0,null,null,null,null,"12  CHSLD",0.8,null,null,null,null,null,null,null,null,null,"12  CHSLD",0.8]
["13 Cours de triage ",0.6,null,null,null,null,0,null,null,null,null,"13 Cours de triage ",0.6,null,null,null,null,0,null,null,null,null,"13 Cours de triage ",0.6,null,null,null,null,0,null,null,null,null,"13 Cours de triage ",0.6,null,null,null,null,0,null,null,null,null,"13 Cours de triage ",0.6,null,null,null,null,0,null,null,null,null,"13 Cours de triage ",0.6,null,null,null,null,0,null,null,null,null,"13 Cours de triage ",0.6,null,null,null,null,0,null,null,null,null,"13 Cours de triage ",0.6,null,null,null,null,0,null,null,null,null,"13 Cours de triage ",0.6,null,null,null,null,null,null,null,null,null,"13 Cours de triage ",0.6]
["Total",null,null,null,null,null,{"$f":"SUM(G147:G159)","v":0},{"$f":"SUM(H147:H157)","v":0},{"$f":"SUM(I147:I157)","v":0},{"$f":"G160+H160","v":0},null,"Total",null,null,null,null,null,{"$f":"SUM(R147:R159)","v":0},{"$f":"SUM(S147:S157)","v":0},null,{"$f":"R160+S160","v":0},null,"Total",null,null,null,null,null,{"$f":"SUM(AC147:AC159)","v":0},{"$f":"SUM(AD147:AD157)","v":0},null,{"$f":"AC160+AD160","v":0},null,"Total",null,null,null,null,null,{"$f":"SUM(AN147:AN159)","v":0},{"$f":"SUM(AO147:AO157)","v":0},null,{"$f":"AN160+AO160","v":0},null,"Total",null,null,null,null,null,{"$f":"SUM(AY147:AY159)","v":0},{"$f":"SUM(AZ147:AZ157)","v":0},null,{"$f":"AY160+AZ160","v":0},null,"Total",null,null,null,null,null,{"$f":"SUM(BJ147:BJ159)","v":0},{"$f":"SUM(BK147:BK157)","v":0},null,{"$f":"BJ160+BK160","v":0},null,"Total",null,null,null,null,null,{"$f":"SUM(BU147:BU159)","v":0},{"$f":"SUM(BV147:BV157)","v":0},null,{"$f":"BU160+BV160","v":0},null,"Total",null,null,null,null,null,{"$f":"SUM(CF147:CF159)","v":0},{"$f":"SUM(CG147:CG157)","v":0},null,{"$f":"CF160+CG160","v":0},null,"Total",null,null,null,null,null,{"$f":"SUM(CQ147:CQ159)","v":0},{"$f":"SUM(CR147:CR157)","v":0},null,{"$f":"CQ160+CR160","v":0},null,"Total",null,null,null,null,null,{"$f":"SUM(DB147:DB159)","v":0},{"$f":"SUM(DC147:DC157)","v":0},null,{"$f":"DB160+DC160","v":0}]

{"sheet":"Sommaire du rôle_sec_4","index":7,"n_rows":84,"n_cols":27,"rows_kept":84,"cut":false,"hidden":false,"merged":[[80,5,81,5],[80,6,81,6],[80,7,81,7],[80,8,81,8],[74,12,75,12],[74,13,75,13],[71,5,71,6],[71,7,71,10],[71,11,71,13],[80,9,81,9],[80,10,81,10],[80,11,81,11],[80,12,81,12],[80,13,81,13],[71,14,71,15],[74,5,75,5],[74,6,75,6],[74,7,75,7],[74,8,75,8],[74,9,75,9],[74,10,75,10],[74,14,75,14],[74,15,75,15],[70,5,70,6],[70,7,70,10],[70,11,70,13],[70,14,70,15],[51,1,51,4],[65,5,65,6],[65,7,65,8],[65,9,65,10],[65,11,65,12],[65,13,65,14],[68,5,69,6],[68,7,69,10],[68,11,69,13],[68,14,68,15],[69,14,69,15],[65,15,65,16],[80,14,81,14],[80,15,81,15],[74,11,75,11],[65,21,65,22],[65,23,65,24],[65,25,65,26],[50,19,50,20],[50,21,50,22],[27,23,27,24],[27,25,27,26],[47,1,47,26],[48,1,49,4],[48,7,48,8],[49,23,49,24],[49,25,49,26],[50,1,50,4],[50,5,50,6],[50,7,50,8],[50,9,50,10],[50,11,50,12],[50,13,50,14],[50,15,50,16],[50,17,50,18],[50,23,50,24],[50,25,50,26],[65,17,65,18],[65,19,65,20],[45,11,45,12],[45,13,45,14],[45,15,45,16],[45,17,45,18],[45,19,45,20],[48,23,48,24],[48,25,48,26],[49,21,49,22],[48,21,48,22],[45,21,45,22],[45,23,45,24],[45,25,45,26],[49,7,49,8],[49,9,49,10],[49,11,49,12],[49,13,49,14],[49,15,49,16],[49,17,49,18],[49,19,49,20],[48,9,48,10],[48,11,48,12],[48,13,48,14],[48,15,48,16],[48,17,48,18],[48,19,48,20],[27,19,27,20],[27,21,27,22],[24,1,24,26],[25,1,26,4],[25,7,25,8],[25,9,25,10],[25,11,25,12],[26,23,26,24],[26,25,26,26],[27,1,27,4],[27,5,27,6],[27,7,27,8],[27,9,27,10],[27,11,27,12],[27,13,27,14],[27,15,27,16],[27,17,27,18],[25,25,25,26],[26,17,26,18],[26,19,26,20],[26,21,26,22],[25,17,25,18],[25,19,25,20],[25,21,25,22],[28,1,28,4],[45,5,45,6],[45,7,45,8],[45,9,45,10],[18,11,18,13],[19,11,19,12],[21,8,21,10],[21,11,21,12],[21,15,21,16],[22,11,22,12],[22,15,22,16],[26,7,26,8],[26,9,26,10],[26,11,26,12],[26,13,26,14],[26,15,26,16],[25,13,25,14],[25,15,25,16],[25,23,25,24],[4,5,4,6],[4,7,4,8],[4,9,4,10],[4,15,4,16],[5,11,5,12],[5,13,5,14],[6,11,15,11],[16,11,17,13],[16,14,16,16],[1,1,1,16],[2,5,2,6],[2,7,2,8],[2,9,2,10],[2,15,2,16],[3,1,3,4],[3,5,3,6],[3,7,3,8],[3,9,3,10],[3,11,3,12],[3,13,3,14],[3,15,3,16]]}
[]
[null,"  ASSIETTES D'APPLICATION DES TAUX DE LA TAXE FONCIÈRE GÉNÉRALE 9"]
[null,"TAUX APPLICABLES",null,null,null,"TAUX NON RÉSIDENTIEL",null,"TAUX INDUSTRIEL (CLASSE 2)",null,"TAUX IND. (SAUF CL.1 ET 2)",null,"TAUX AGRICOLE",null,"TAUX FORESTIER",null,"TAUX CATÉGORIE RÉSIDUELLE"]
[null,"NOMBRE DE SECTEURS",null,null,null,null,null,null,null,null,null,null,null,null,null,null,null,null,{"$f":"IF(OR(F4>0,H4>0,J4>0,L4>0,N4>0,P4>0),\"UTILISER LE SIMULATEUR POUR LA TAXATION DE SECTEUR\",\"-\")","v":"-"}]
[null,"CLASSE NON RÉSIDENTIELLE ET",null,null,null,"VAL. NR À 100 % ET IND. CL. 2 À 50 %",null,"VALEUR À 50 %",null,"VALEUR À 100 %",null,"VALEURS À 100 % IMPOSABLES",null,"VALEURS À 100 % IMPOSABLES",null,"VALEUR À 100 %"]
[null,"POURCENTAGE DE TAXATION",null,null,null,"  IMPOSABLES","COMPENSABLES","  IMPOSABLES","COMPENSABLES","  IMPOSABLES","COMPENSABLES",null,null,null,null,"  IMPOSABLES","COMPENSABLES"]
[null," 1A",":     0,1 %",null,901,76534150,0,null,null,null,null,null,null,null,"99,9 % ",76534150,0]
[null," 1B",":     0,5 %",null,902,34712370,0,null,null,null,null,null,null,null,"99,5 % ",34712370,0]
[null," 1C",":     1 %",null,903,4894450,0,null,null,null,null,null,null,null,"99 % ",4894450,0]
[null," 2",":     3 %",null,904,23616670,0,null,null,605900,null,null,null,null,"97 % ",23616670,0]
[null," 3",":     6 %",null,905,44153450,0,null,null,181400,null,null,null,null,"94 % ",44153450,0]
[null," 4",":     12 %",null,906,60256460,0,null,null,215700,null,null,null,null,"88 % ",60256460,0]
[null," 5",":     22 %",null,907,38643990,0,null,null,null,null,null,null,null,"78 % ",38643990,0]
[null," 6",":     40 %",null,908,38532890,0,290100,null,2421200,null,null,null,null,"60 % ",38532890,0]
[null," 7",":     60 %",null,909,39569365,72376370,350350,null,354000,null,null,null,null,"40 % ",39569365,72376370]
[null," 8",":     85 %",null,910,22323070,211592260,null,null,1875900,null,null,null,null,"15 % ",22323070,211592260]
[null," 9",":     100 %",null,911,3177900,0,null,null,null,null,"TAUX TERRAINS VAGUES \nDESSERVIS"]
[null," 10",":     100 %",null,912,1155755205,61905690,10515650,null,225704400,2325200,null,null,null,null,8068032861,2100780]
[null," 11",":  Cours de triage 100 %",null,913,null,null,null,null,null,null,"VALEURS À 100 %"]
[null," 12",":  CHSLD 20 %",null,914,13938200,null,null,null,null,null,"  IMPOSABLES",null,"COMPENSABLES","80 % ",{"$f":"F20","v":13938200}]
[null," 13",":  Cours de triage 40 %",null,915,null,"CFIL (chemin de fer d'intérêt local)",null,null,null,null,null,null,null,"60 % ",{"$f":"F21","v":0}]
[null," APPLICATION DU TNR QUAND TTVD",null,null,916,5228300,null,null,"(TTVD − TAUX DE BASE) x ",null,null,{"$f":"F22","v":5228300},null,{"$f":"G22","v":0}]
[null," ASSIETTES D'APPLICATION ",null,null,917,{"$f":"F71+F72","v":1529652563.0999999},null,null,{"$f":"H71+H72","v":241701840},null,"(TTVD) x ",76716400,null,58400,null,{"$f":"O71+O72","v":8447691867.8999996}]
[]
[null,"ASSIETTES D'APPLICATION DES TAUX RELATIFS AUX SOUS-CATÉGORIES DES IMMEUBLES NON RÉSIDENTIELS (si applicables)"]
[null,"DÉNOMINATION DE LA SOUS-CATÉGORIE",null,null,null,"TAUX SOUS-CATÉGORIE DE RÉFÉRENCE",null,"TAUX SOUS-CATÉGORIE 1",null,"TAUX SOUS-CATÉGORIE 2",null,"TAUX SOUS-CATÉGORIE 3",null,"TAUX SOUS-CATÉGORIE 4",null,"TAUX SOUS-CATÉGORIE 5",null,"TAUX SOUS-CATÉGORIE 6",null,"TAUX SOUS-CATÉGORIE 7",null,"TAUX SOUS-CATÉGORIE 8",null,"TAUX SOUS-CATÉGORIE 9",null,"TAUX SOUS-CATÉGORIE 10"]
[]
[null,"NOMBRE DE SECTEURS"]
[null,"POURCENTAGE DE TAXATION",null,null,null,"  IMPOSABLES","COMPENSABLES","  IMPOSABLES","COMPENSABLES","  IMPOSABLES","COMPENSABLES","  IMPOSABLES","COMPENSABLES","  IMPOSABLES","COMPENSABLES","  IMPOSABLES","COMPENSABLES","  IMPOSABLES","COMPENSABLES","  IMPOSABLES","COMPENSABLES","  IMPOSABLES","COMPENSABLES","  IMPOSABLES","COMPENSABLES","  IMPOSABLES","COMPENSABLES"]
[null," 1A","     0,1 %",null,{"$f":"E22+1","v":917}]
[null," 1B","     0,5 %",null,{"$f":"E30+1","v":918}]
[null," 1C","     1 %",null,919]
[null," 2","     3 %",null,920]
[null," 3","     6 %",null,921]
[null," 4","     12 %",null,922]
[null," 5","     22 %",null,923]
[null," 6","     40 %",null,924]
[null," 7","     60 %",null,925]
[null," 8","     85 %",null,926]
[null," 9","     100 %",null,927]
[null," 10","     100 %",null,928]
[null," 11","  Cours de triage 100 %",null,929]
[null," 12","  CHSLD 20 %",null,930]
[null," 13","  Cours de triage 40 %",null,931,null,"CFIL"]
[null," APPLICATION DU TNR QUAND TTVD",null,null,932]
[null," ASSIETTES D'APPLICATION ",null,null,933,{"$f":"F77+F78","v":0},null,{"$f":"G77+G78","v":0},null,{"$f":"H77+H78","v":0},null,{"$f":"I77+I78","v":0},null,{"$f":"J77+J78","v":0},null,{"$f":"K77+K78","v":0},null,{"$f":"L77+L78","v":0},null,{"$f":"M77+M78","v":0},null,{"$f":"N77+N78","v":0},null,{"$f":"O77+O78","v":0},null,{"$f":"P77+P78","v":0}]
[]
[null,"ASSIETTES D'APPLICATION DES TAUX RELATIFS AUX SOUS-CATÉGORIES DES IMMEUBLES RÉSIDENTIELS (si applicables)"]
[null,"DÉNOMINATION DE LA SOUS-CATÉGORIE",null,null,null,"TAUX SOUS-CATÉGORIE RÉSIDUELLE",null,"TAUX SOUS-CATÉGORIE 1",null,"TAUX SOUS-CATÉGORIE 2",null,"TAUX SOUS-CATÉGORIE 3",null,"TAUX SOUS-CATÉGORIE 4",null,"TAUX SOUS-CATÉGORIE 5",null,"TAUX SOUS-CATÉGORIE 6",null,"TAUX SOUS-CATÉGORIE 7",null,"TAUX SOUS-CATÉGORIE 8",null,"TAUX SOUS-CATÉGORIE 9",null,"TAUX SOUS-CATÉGORIE 10"]
[]
[null,"NOMBRE DE SECTEURS"]
[null,"POURCENTAGE DE TAXATION",null,null,null,"  IMPOSABLES","COMPENSABLES","  IMPOSABLES","COMPENSABLES","  IMPOSABLES","COMPENSABLES","  IMPOSABLES","COMPENSABLES","  IMPOSABLES","COMPENSABLES","  IMPOSABLES","COMPENSABLES","  IMPOSABLES","COMPENSABLES","  IMPOSABLES","COMPENSABLES","  IMPOSABLES","COMPENSABLES","  IMPOSABLES","COMPENSABLES","  IMPOSABLES","COMPENSABLES"]
[null," 1A","99,9 % ",null,935]
[null," 1B","99,5 % ",null,{"$f":"E53+1","v":936}]
[null," 1C","99 % ",null,937]
[null," 2","97 % ",null,938]
[null," 3","94 % ",null,939]
[null," 4","88 % ",null,940]
[null," 5","78 % ",null,941]
[null," 6","60 % ",null,942]
[null," 7","40 % ",null,943]
[null," 8","15 % ",null,944]
[null," 9","100% immeubles sans partie non résidentielle",null,945]
[null," 12","  CHSLD 80 %",null,946]
[null," 13","  Cours de triage 60 %",null,947]
[null," ASSIETTES D'APPLICATION ",null,null,948,{"$f":"F83+F84","v":0},null,{"$f":"G83+G84","v":0},null,{"$f":"H83+H84","v":0},null,{"$f":"I83+I84","v":0},null,{"$f":"J83+J84","v":0},null,{"$f":"K83+K84","v":0},null,{"$f":"L83+L84","v":0},null,{"$f":"M83+M84","v":0},null,{"$f":"N83+N84","v":0},null,{"$f":"O83+O84","v":0},null,{"$f":"P83+P84","v":0}]
[]
[]
[null,null,null,null,null,"TAUX NON RÉSIDENTIEL",null,"TAUX INDUSTRIEL ",null,null,null,"TAUX TERRAINS VAGUES \nDESSERVIS",null,null,"TAUX CATÉGORIE RÉSIDUELLE (TAUX DE BASE)"]
[]
[null,null,"Assiette imposable",null,null,{"$f":"Détermination_sec_4!G23","v":1244467630.0999999},null,{"$f":"Détermination_sec_4!G41+Détermination_sec_4!G59","v":239376640},null,null,null,{"$f":"L23","v":76716400},null,null,{"$f":"Détermination_sec_4!G78","v":8384901700.8999996}]
[null,null,"Assiette compensable",null,null,{"$f":"Détermination_sec_4!H23","v":285184933},null,{"$f":"Détermination_sec_4!H41+Détermination_sec_4!H59","v":2325200},null,null,null,{"$f":"N23","v":58400},null,null,{"$f":"Détermination_sec_4!H78","v":62790167}]
[]
[null,"Sous-catégorie des immeubles non résidentiels"]
[null,null,null,null,null,"TAUX SOUS-CATÉGORIE DE RÉFÉRENCE","Sous-catégorie 1","Sous-catégorie 2","Sous-catégorie 3","Sous-catégorie 4","Sous-catégorie 5","Sous-catégorie 6","Sous-catégorie 7","Sous-catégorie 8","Sous-catégorie 9","Sous-catégorie 10"]
[]
[null,null,"Assiette imposable",null,null,{"$f":"Détermination_sec_4!G100","v":0},{"$f":"Détermination_sec_4!G122","v":0},{"$f":"Détermination_sec_4!R122","v":0},{"$f":"Détermination_sec_4!AC122","v":0},{"$f":"Détermination_sec_4!AN122","v":0},{"$f":"Détermination_sec_4!AY122","v":0},{"$f":"Détermination_sec_4!BJ122","v":0},{"$f":"Détermination_sec_4!BU122","v":0},{"$f":"Détermination_sec_4!CF122","v":0},{"$f":"Détermination_sec_4!CQ122","v":0},{"$f":"Détermination_sec_4!DB122","v":0}]
[null,null,"Assiette compensable",null,null,{"$f":"Détermination_sec_4!H100","v":0},{"$f":"Détermination_sec_4!H122","v":0},{"$f":"Détermination_sec_4!S122","v":0},{"$f":"Détermination_sec_4!AD122","v":0},{"$f":"Détermination_sec_4!AO122","v":0},{"$f":"Détermination_sec_4!AZ122","v":0},{"$f":"Détermination_sec_4!BK122","v":0},{"$f":"Détermination_sec_4!BV122","v":0},{"$f":"Détermination_sec_4!CG122","v":0},{"$f":"Détermination_sec_4!CR122","v":0},{"$f":"Détermination_sec_4!DC122","v":0}]
[]
[null,"Sous-catégorie des immeubles résidentiels"]
[null,null,null,null,null,"TAUX SOUS-CATÉGORIE RÉSIDUELLE","Sous-catégorie 1","Sous-catégorie 2","Sous-catégorie 3","Sous-catégorie 4","Sous-catégorie 5","Sous-catégorie 6","Sous-catégorie 7","Sous-catégorie 8","Sous-catégorie 9","Sous-catégorie 10"]
[]
[null,null,"Assiette imposable",null,null,{"$f":"Détermination_sec_4!G141","v":0},{"$f":"Détermination_sec_4!G160","v":0},{"$f":"Détermination_sec_4!R160","v":0},{"$f":"Détermination_sec_4!AC160","v":0},{"$f":"Détermination_sec_4!AN160","v":0},{"$f":"Détermination_sec_4!AY160","v":0},{"$f":"Détermination_sec_4!BJ160","v":0},{"$f":"Détermination_sec_4!BU160","v":0},{"$f":"Détermination_sec_4!CF160","v":0},{"$f":"Détermination_sec_4!CQ160","v":0},{"$f":"Détermination_sec_4!DB160","v":0}]
[null,null,"Assiette compensable",null,null,{"$f":"Détermination_sec_4!H141","v":0},{"$f":"Détermination_sec_4!H160","v":0},{"$f":"Détermination_sec_4!S160","v":0},{"$f":"Détermination_sec_4!AD160","v":0},{"$f":"Détermination_sec_4!AO160","v":0},{"$f":"Détermination_sec_4!AZ160","v":0},{"$f":"Détermination_sec_4!BK160","v":0},{"$f":"Détermination_sec_4!BV160","v":0},{"$f":"Détermination_sec_4!CG160","v":0},{"$f":"Détermination_sec_4!CR160","v":0},{"$f":"Détermination_sec_4!DC160","v":0}]

{"sheet":"Sommaire du rôle_sec_5","index":8,"n_rows":84,"n_cols":27,"rows_kept":84,"cut":false,"hidden":false,"merged":[[80,5,81,5],[80,6,81,6],[80,7,81,7],[80,8,81,8],[74,12,75,12],[74,13,75,13],[71,5,71,6],[71,7,71,10],[71,11,71,13],[80,9,81,9],[80,10,81,10],[80,11,81,11],[80,12,81,12],[80,13,81,13],[71,14,71,15],[74,5,75,5],[74,6,75,6],[74,7,75,7],[74,8,75,8],[74,9,75,9],[74,10,75,10],[74,14,75,14],[74,15,75,15],[70,5,70,6],[70,7,70,10],[70,11,70,13],[70,14,70,15],[51,1,51,4],[65,5,65,6],[65,7,65,8],[65,9,65,10],[65,11,65,12],[65,13,65,14],[68,5,69,6],[68,7,69,10],[68,11,69,13],[68,14,68,15],[69,14,69,15],[65,15,65,16],[80,14,81,14],[80,15,81,15],[74,11,75,11],[65,21,65,22],[65,23,65,24],[65,25,65,26],[50,19,50,20],[50,21,50,22],[27,23,27,24],[27,25,27,26],[47,1,47,26],[48,1,49,4],[48,7,48,8],[49,23,49,24],[49,25,49,26],[50,1,50,4],[50,5,50,6],[50,7,50,8],[50,9,50,10],[50,11,50,12],[50,13,50,14],[50,15,50,16],[50,17,50,18],[50,23,50,24],[50,25,50,26],[65,17,65,18],[65,19,65,20],[45,11,45,12],[45,13,45,14],[45,15,45,16],[45,17,45,18],[45,19,45,20],[48,23,48,24],[48,25,48,26],[49,21,49,22],[48,21,48,22],[45,21,45,22],[45,23,45,24],[45,25,45,26],[49,7,49,8],[49,9,49,10],[49,11,49,12],[49,13,49,14],[49,15,49,16],[49,17,49,18],[49,19,49,20],[48,9,48,10],[48,11,48,12],[48,13,48,14],[48,15,48,16],[48,17,48,18],[48,19,48,20],[27,19,27,20],[27,21,27,22],[24,1,24,26],[25,1,26,4],[25,7,25,8],[25,9,25,10],[25,11,25,12],[26,23,26,24],[26,25,26,26],[27,1,27,4],[27,5,27,6],[27,7,27,8],[27,9,27,10],[27,11,27,12],[27,13,27,14],[27,15,27,16],[27,17,27,18],[25,25,25,26],[26,17,26,18],[26,19,26,20],[26,21,26,22],[25,17,25,18],[25,19,25,20],[25,21,25,22],[28,1,28,4],[45,5,45,6],[45,7,45,8],[45,9,45,10],[18,11,18,13],[19,11,19,12],[21,8,21,10],[21,11,21,12],[21,15,21,16],[22,11,22,12],[22,15,22,16],[26,7,26,8],[26,9,26,10],[26,11,26,12],[26,13,26,14],[26,15,26,16],[25,13,25,14],[25,15,25,16],[25,23,25,24],[4,5,4,6],[4,7,4,8],[4,9,4,10],[4,15,4,16],[5,11,5,12],[5,13,5,14],[6,11,15,11],[16,11,17,13],[16,14,16,16],[1,1,1,16],[2,5,2,6],[2,7,2,8],[2,9,2,10],[2,15,2,16],[3,1,3,4],[3,5,3,6],[3,7,3,8],[3,9,3,10],[3,11,3,12],[3,13,3,14],[3,15,3,16]]}
[]
[null,"  ASSIETTES D'APPLICATION DES TAUX DE LA TAXE FONCIÈRE GÉNÉRALE 9"]
[null,"TAUX APPLICABLES",null,null,null,"TAUX NON RÉSIDENTIEL",null,"TAUX INDUSTRIEL (CLASSE 2)",null,"TAUX IND. (SAUF CL.1 ET 2)",null,"TAUX AGRICOLE",null,"TAUX FORESTIER",null,"TAUX CATÉGORIE RÉSIDUELLE"]
[null,"NOMBRE DE SECTEURS",null,null,null,null,null,null,null,null,null,null,null,null,null,null,null,null,{"$f":"IF(OR(F4>0,H4>0,J4>0,L4>0,N4>0,P4>0),\"UTILISER LE SIMULATEUR POUR LA TAXATION DE SECTEUR\",\"-\")","v":"-"}]
[null,"CLASSE NON RÉSIDENTIELLE ET",null,null,null,"VAL. NR À 100 % ET IND. CL. 2 À 50 %",null,"VALEUR À 50 %",null,"VALEUR À 100 %",null,"VALEURS À 100 % IMPOSABLES",null,"VALEURS À 100 % IMPOSABLES",null,"VALEUR À 100 %"]
[null,"POURCENTAGE DE TAXATION",null,null,null,"  IMPOSABLES","COMPENSABLES","  IMPOSABLES","COMPENSABLES","  IMPOSABLES","COMPENSABLES",null,null,null,null,"  IMPOSABLES","COMPENSABLES"]
[null," 1A",":     0,1 %",null,901,76534150,0,null,null,null,null,null,null,null,"99,9 % ",76534150,0]
[null," 1B",":     0,5 %",null,902,34712370,0,null,null,null,null,null,null,null,"99,5 % ",34712370,0]
[null," 1C",":     1 %",null,903,4894450,0,null,null,null,null,null,null,null,"99 % ",4894450,0]
[null," 2",":     3 %",null,904,23616670,0,null,null,605900,null,null,null,null,"97 % ",23616670,0]
[null," 3",":     6 %",null,905,44153450,0,null,null,181400,null,null,null,null,"94 % ",44153450,0]
[null," 4",":     12 %",null,906,60256460,0,null,null,215700,null,null,null,null,"88 % ",60256460,0]
[null," 5",":     22 %",null,907,38643990,0,null,null,null,null,null,null,null,"78 % ",38643990,0]
[null," 6",":     40 %",null,908,38532890,0,290100,null,2421200,null,null,null,null,"60 % ",38532890,0]
[null," 7",":     60 %",null,909,39569365,72376370,350350,null,354000,null,null,null,null,"40 % ",39569365,72376370]
[null," 8",":     85 %",null,910,22323070,211592260,null,null,1875900,null,null,null,null,"15 % ",22323070,211592260]
[null," 9",":     100 %",null,911,3177900,0,null,null,null,null,"TAUX TERRAINS VAGUES \nDESSERVIS"]
[null," 10",":     100 %",null,912,1155755205,61905690,10515650,null,225704400,2325200,null,null,null,null,8068032861,2100780]
[null," 11",":  Cours de triage 100 %",null,913,null,null,null,null,null,null,"VALEURS À 100 %"]
[null," 12",":  CHSLD 20 %",null,914,13938200,null,null,null,null,null,"  IMPOSABLES",null,"COMPENSABLES","80 % ",{"$f":"F20","v":13938200}]
[null," 13",":  Cours de triage 40 %",null,915,null,"CFIL (chemin de fer d'intérêt local)",null,null,null,null,null,null,null,"60 % ",{"$f":"F21","v":0}]
[null," APPLICATION DU TNR QUAND TTVD",null,null,916,5228300,null,null,"(TTVD − TAUX DE BASE) x ",null,null,{"$f":"F22","v":5228300},null,{"$f":"G22","v":0}]
[null," ASSIETTES D'APPLICATION ",null,null,917,{"$f":"F71+F72","v":1529652563.0999999},null,null,{"$f":"H71+H72","v":241701840},null,"(TTVD) x ",76716400,null,58400,null,{"$f":"O71+O72","v":8447691867.8999996}]
[]
[null,"ASSIETTES D'APPLICATION DES TAUX RELATIFS AUX SOUS-CATÉGORIES DES IMMEUBLES NON RÉSIDENTIELS (si applicables)"]
[null,"DÉNOMINATION DE LA SOUS-CATÉGORIE",null,null,null,"TAUX SOUS-CATÉGORIE DE RÉFÉRENCE",null,"TAUX SOUS-CATÉGORIE 1",null,"TAUX SOUS-CATÉGORIE 2",null,"TAUX SOUS-CATÉGORIE 3",null,"TAUX SOUS-CATÉGORIE 4",null,"TAUX SOUS-CATÉGORIE 5",null,"TAUX SOUS-CATÉGORIE 6",null,"TAUX SOUS-CATÉGORIE 7",null,"TAUX SOUS-CATÉGORIE 8",null,"TAUX SOUS-CATÉGORIE 9",null,"TAUX SOUS-CATÉGORIE 10"]
[]
[null,"NOMBRE DE SECTEURS"]
[null,"POURCENTAGE DE TAXATION",null,null,null,"  IMPOSABLES","COMPENSABLES","  IMPOSABLES","COMPENSABLES","  IMPOSABLES","COMPENSABLES","  IMPOSABLES","COMPENSABLES","  IMPOSABLES","COMPENSABLES","  IMPOSABLES","COMPENSABLES","  IMPOSABLES","COMPENSABLES","  IMPOSABLES","COMPENSABLES","  IMPOSABLES","COMPENSABLES","  IMPOSABLES","COMPENSABLES","  IMPOSABLES","COMPENSABLES"]
[null," 1A","     0,1 %",null,{"$f":"E22+1","v":917}]
[null," 1B","     0,5 %",null,{"$f":"E30+1","v":918}]
[null," 1C","     1 %",null,919]
[null," 2","     3 %",null,920]
[null," 3","     6 %",null,921]
[null," 4","     12 %",null,922]
[null," 5","     22 %",null,923]
[null," 6","     40 %",null,924]
[null," 7","     60 %",null,925]
[null," 8","     85 %",null,926]
[null," 9","     100 %",null,927]
[null," 10","     100 %",null,928]
[null," 11","  Cours de triage 100 %",null,929]
[null," 12","  CHSLD 20 %",null,930]
[null," 13","  Cours de triage 40 %",null,931,null,"CFIL"]
[null," APPLICATION DU TNR QUAND TTVD",null,null,932]
[null," ASSIETTES D'APPLICATION ",null,null,933,{"$f":"F77+F78","v":0},null,{"$f":"G77+G78","v":0},null,{"$f":"H77+H78","v":0},null,{"$f":"I77+I78","v":0},null,{"$f":"J77+J78","v":0},null,{"$f":"K77+K78","v":0},null,{"$f":"L77+L78","v":0},null,{"$f":"M77+M78","v":0},null,{"$f":"N77+N78","v":0},null,{"$f":"O77+O78","v":0},null,{"$f":"P77+P78","v":0}]
[]
[null,"ASSIETTES D'APPLICATION DES TAUX RELATIFS AUX SOUS-CATÉGORIES DES IMMEUBLES RÉSIDENTIELS (si applicables)"]
[null,"DÉNOMINATION DE LA SOUS-CATÉGORIE",null,null,null,"TAUX SOUS-CATÉGORIE RÉSIDUELLE",null,"TAUX SOUS-CATÉGORIE 1",null,"TAUX SOUS-CATÉGORIE 2",null,"TAUX SOUS-CATÉGORIE 3",null,"TAUX SOUS-CATÉGORIE 4",null,"TAUX SOUS-CATÉGORIE 5",null,"TAUX SOUS-CATÉGORIE 6",null,"TAUX SOUS-CATÉGORIE 7",null,"TAUX SOUS-CATÉGORIE 8",null,"TAUX SOUS-CATÉGORIE 9",null,"TAUX SOUS-CATÉGORIE 10"]
[]
[null,"NOMBRE DE SECTEURS"]
[null,"POURCENTAGE DE TAXATION",null,null,null,"  IMPOSABLES","COMPENSABLES","  IMPOSABLES","COMPENSABLES","  IMPOSABLES","COMPENSABLES","  IMPOSABLES","COMPENSABLES","  IMPOSABLES","COMPENSABLES","  IMPOSABLES","COMPENSABLES","  IMPOSABLES","COMPENSABLES","  IMPOSABLES","COMPENSABLES","  IMPOSABLES","COMPENSABLES","  IMPOSABLES","COMPENSABLES","  IMPOSABLES","COMPENSABLES"]
[null," 1A","99,9 % ",null,935]
[null," 1B","99,5 % ",null,{"$f":"E53+1","v":936}]
[null," 1C","99 % ",null,937]
[null," 2","97 % ",null,938]
[null," 3","94 % ",null,939]
[null," 4","88 % ",null,940]
[null," 5","78 % ",null,941]
[null," 6","60 % ",null,942]
[null," 7","40 % ",null,943]
[null," 8","15 % ",null,944]
[null," 9","100% immeubles sans partie non résidentielle",null,945]
[null," 12","  CHSLD 80 %",null,946]
[null," 13","  Cours de triage 60 %",null,947]
[null," ASSIETTES D'APPLICATION ",null,null,948,{"$f":"F83+F84","v":0},null,{"$f":"G83+G84","v":0},null,{"$f":"H83+H84","v":0},null,{"$f":"I83+I84","v":0},null,{"$f":"J83+J84","v":0},null,{"$f":"K83+K84","v":0},null,{"$f":"L83+L84","v":0},null,{"$f":"M83+M84","v":0},null,{"$f":"N83+N84","v":0},null,{"$f":"O83+O84","v":0},null,{"$f":"P83+P84","v":0}]
[]
[]
[null,null,null,null,null,"TAUX NON RÉSIDENTIEL",null,"TAUX INDUSTRIEL ",null,null,null,"TAUX TERRAINS VAGUES \nDESSERVIS",null,null,"TAUX CATÉGORIE RÉSIDUELLE (TAUX DE BASE)"]
[]
[null,null,"Assiette imposable",null,null,{"$f":"Détermination_sec_5!G23","v":1244467630.0999999},null,{"$f":"Détermination_sec_5!G41+Détermination_sec_5!G59","v":239376640},null,null,null,{"$f":"L23","v":76716400},null,null,{"$f":"Détermination_sec_5!G78","v":8384901700.8999996}]
[null,null,"Assiette compensable",null,null,{"$f":"Détermination_sec_5!H23","v":285184933},null,{"$f":"Détermination_sec_5!H41+Détermination_sec_5!H59","v":2325200},null,null,null,{"$f":"N23","v":58400},null,null,{"$f":"Détermination_sec_5!H78","v":62790167}]
[]
[null,"Sous-catégorie des immeubles non résidentiels"]
[null,null,null,null,null,"TAUX SOUS-CATÉGORIE DE RÉFÉRENCE","Sous-catégorie 1","Sous-catégorie 2","Sous-catégorie 3","Sous-catégorie 4","Sous-catégorie 5","Sous-catégorie 6","Sous-catégorie 7","Sous-catégorie 8","Sous-catégorie 9","Sous-catégorie 10"]
[]
[null,null,"Assiette imposable",null,null,{"$f":"Détermination_sec_5!G100","v":0},{"$f":"Détermination_sec_5!G122","v":0},{"$f":"Détermination_sec_5!R122","v":0},{"$f":"Détermination_sec_5!AC122","v":0},{"$f":"Détermination_sec_5!AN122","v":0},{"$f":"Détermination_sec_5!AY122","v":0},{"$f":"Détermination_sec_5!BJ122","v":0},{"$f":"Détermination_sec_5!BU122","v":0},{"$f":"Détermination_sec_5!CF122","v":0},{"$f":"Détermination_sec_5!CQ122","v":0},{"$f":"Détermination_sec_5!DB122","v":0}]
[null,null,"Assiette compensable",null,null,{"$f":"Détermination_sec_5!H100","v":0},{"$f":"Détermination_sec_5!H122","v":0},{"$f":"Détermination_sec_5!S122","v":0},{"$f":"Détermination_sec_5!AD122","v":0},{"$f":"Détermination_sec_5!AO122","v":0},{"$f":"Détermination_sec_5!AZ122","v":0},{"$f":"Détermination_sec_5!BK122","v":0},{"$f":"Détermination_sec_5!BV122","v":0},{"$f":"Détermination_sec_5!CG122","v":0},{"$f":"Détermination_sec_5!CR122","v":0},{"$f":"Détermination_sec_5!DC122","v":0}]
[]
[null,"Sous-catégorie des immeubles résidentiels"]
[null,null,null,null,null,"TAUX SOUS-CATÉGORIE RÉSIDUELLE","Sous-catégorie 1","Sous-catégorie 2","Sous-catégorie 3","Sous-catégorie 4","Sous-catégorie 5","Sous-catégorie 6","Sous-catégorie 7","Sous-catégorie 8","Sous-catégorie 9","Sous-catégorie 10"]
[]
[null,null,"Assiette imposable",null,null,{"$f":"Détermination_sec_5!G141","v":0},{"$f":"Détermination_sec_5!G160","v":0},{"$f":"Détermination_sec_5!R160","v":0},{"$f":"Détermination_sec_5!AC160","v":0},{"$f":"Détermination_sec_5!AN160","v":0},{"$f":"Détermination_sec_5!AY160","v":0},{"$f":"Détermination_sec_5!BJ160","v":0},{"$f":"Détermination_sec_5!BU160","v":0},{"$f":"Détermination_sec_5!CF160","v":0},{"$f":"Détermination_sec_5!CQ160","v":0},{"$f":"Détermination_sec_5!DB160","v":0}]
[null,null,"Assiette compensable",null,null,{"$f":"Détermination_sec_5!H141","v":0},{"$f":"Détermination_sec_5!H160","v":0},{"$f":"Détermination_sec_5!S160","v":0},{"$f":"Détermination_sec_5!AD160","v":0},{"$f":"Détermination_sec_5!AO160","v":0},{"$f":"Détermination_sec_5!AZ160","v":0},{"$f":"Détermination_sec_5!BK160","v":0},{"$f":"Détermination_sec_5!BV160","v":0},{"$f":"Détermination_sec_5!CG160","v":0},{"$f":"Détermination_sec_5!CR160","v":0},{"$f":"Détermination_sec_5!DC160","v":0}]

{"sheet":"Détermination_sec_4","index":9,"n_rows":160,"n_cols":109,"rows_kept":160,"cut":false,"hidden":true,"merged":[[143,102,143,103],[143,66,144,66],[143,67,144,67],[143,69,143,70],[143,77,144,77],[143,78,144,78],[143,80,143,81],[143,88,144,88],[143,89,144,89],[143,91,143,92],[143,99,144,99],[143,100,144,100],[143,58,143,59],[143,22,144,22],[143,23,144,23],[143,25,143,26],[143,33,144,33],[143,34,144,34],[143,36,143,37],[143,44,144,44],[143,45,144,45],[143,47,143,48],[143,55,144,55],[143,56,144,56],[143,0,144,0],[143,1,144,1],[143,3,143,4],[143,11,144,11],[143,12,144,12],[143,14,143,15],[102,99,103,99],[102,100,103,100],[102,102,102,103],[124,0,125,0],[124,1,125,1],[124,3,124,4],[102,77,103,77],[102,78,103,78],[102,80,102,81],[102,88,103,88],[102,47,102,48],[102,89,103,89],[102,91,102,92],[102,55,103,55],[102,56,103,56],[102,58,102,59],[102,66,103,66],[102,67,103,67],[102,69,102,70],[102,33,103,33],[102,34,103,34],[102,36,102,37],[102,44,103,44],[102,45,103,45],[102,25,102,26],[80,0,81,0],[80,1,81,1],[80,3,80,4],[102,0,103,0],[102,1,103,1],[102,3,102,4],[102,11,103,11],[102,12,103,12],[102,14,102,15],[102,22,103,22],[102,23,103,23],[43,0,44,0],[43,1,44,1],[43,3,43,4],[61,0,62,0],[61,1,62,1],[61,3,61,4],[3,0,4,0],[3,1,4,1],[3,3,3,4],[25,0,26,0],[25,1,26,1],[25,3,25,4]]}
["DÉTERMINATION DES ASSIETTES "]
[]
["ASSIETTE AU TAUX NON RÉSIDENTIEL"]
["Classe non résidentielle","Pourcentage de taxation",null,"VAL. NR À 100 % ET IND. CL. 2 À 50 %"]
[null,null,null,"  Imposables","Compensables",null,"Imposables pondérées","Compensables pondérées",null,"Total"]
[null,"(1)",null,"(2)","(3)",null,"(4) = (1) X (2)","(5) = (1 ) X  (3)",null,"(6) = (4) + (5)"]
[" 1A",1E-3,null,{"$f":"'Sommaire du rôle_sec_4'!F7","v":76534150},{"$f":"'Sommaire du rôle_sec_4'!G7","v":0},null,{"$f":"B7*D7","v":76534.150000000009},{"$f":"B7*E7","v":0},null,{"$f":"G7+H7","v":76534.150000000009}]
[" 1B",5.0000000000000001E-3,null,{"$f":"'Sommaire du rôle_sec_4'!F8","v":34712370},{"$f":"'Sommaire du rôle_sec_4'!G8","v":0},null,173561.85,0,null,173561.85]
[" 1C",0.01,null,{"$f":"'Sommaire du rôle_sec_4'!F9","v":4894450},{"$f":"'Sommaire du rôle_sec_4'!G9","v":0},null,48944.5,0,null,48944.5]
[2,0.03,null,{"$f":"'Sommaire du rôle_sec_4'!F10","v":23616670},{"$f":"'Sommaire du rôle_sec_4'!G10","v":0},null,708500.1,0,null,708500.1]
[3,0.06,null,{"$f":"'Sommaire du rôle_sec_4'!F11","v":44153450},{"$f":"'Sommaire du rôle_sec_4'!G11","v":0},null,2649207,0,null,2649207]
[4,0.12,null,{"$f":"'Sommaire du rôle_sec_4'!F12","v":60256460},{"$f":"'Sommaire du rôle_sec_4'!G12","v":0},null,7230775.2000000002,0,null,7230775.2000000002]
[5,0.22,null,{"$f":"'Sommaire du rôle_sec_4'!F13","v":38643990},{"$f":"'Sommaire du rôle_sec_4'!G13","v":0},null,8501677.8000000007,0,null,8501677.8000000007]
[6,0.4,null,{"$f":"'Sommaire du rôle_sec_4'!F14","v":38532890},{"$f":"'Sommaire du rôle_sec_4'!G14","v":0},null,15413156,0,null,15413156]
[7,0.6,null,{"$f":"'Sommaire du rôle_sec_4'!F15","v":39569365},{"$f":"'Sommaire du rôle_sec_4'!G15","v":72376370},null,23741619,43425822,null,67167441]
[8,0.85,null,{"$f":"'Sommaire du rôle_sec_4'!F16","v":22323070},{"$f":"'Sommaire du rôle_sec_4'!G16","v":211592260},null,18974609.5,179853421,null,198828030.5]
[9,1,null,{"$f":"'Sommaire du rôle_sec_4'!F17","v":3177900},{"$f":"'Sommaire du rôle_sec_4'!G17","v":0},null,3177900,0,null,3177900]
[10,1,null,{"$f":"'Sommaire du rôle_sec_4'!F18","v":1155755205},{"$f":"'Sommaire du rôle_sec_4'!G18","v":61905690},null,1155755205,61905690,null,1217660895]
["11 Cours de triage","100%",null,{"$f":"'Sommaire du rôle_sec_4'!F19","v":0},{"$f":"'Sommaire du rôle_sec_4'!G19","v":0},null,0,0,null,0]
["12 CHSLD",0.2,null,{"$f":"'Sommaire du rôle_sec_4'!F20","v":13938200},null,null,2787640,null,null,2787640]
["13 Cours de triage 40 %","40%",null,{"$f":"'Sommaire du rôle_sec_4'!F21","v":0},null,null,0,null,null,0]
[" APPLICATION DU TNR QUAND TTVD",1,null,{"$f":"'Sommaire du rôle_sec_4'!F22","v":5228300},{"$f":"'Sommaire du rôle_sec_4'!G22","v":0},null,5228300,{"$f":"B22*E22","v":0},null,5228300]
["Total",null,null,null,null,null,{"$f":"SUM(G7:G22)","v":1244467630.0999999},{"$f":"SUM(H7:H22)","v":285184933},null,1529652563.0999999]
[]
["ASSIETTE AU TAUX INDUSTRIEL (CLASSE 2)"]
["Classe non résidentielle","Pourcentage de taxation",null,"VALEUR À 50 %"]
[null,null,null,"  Imposables","Compensables",null,"Imposables pondérées","Compensables pondérées",null,"Total"]
[null,"(1)",null,"(2)","(3)",null,"(4) = (1) X (2)","(5) = (1) X (3)",null,"(6) = (4) + (5)"]
[" 1A",1E-3,null,{"$f":"'Sommaire du rôle_sec_4'!H7","v":0},{"$f":"'Sommaire du rôle_sec_4'!I7","v":0},null,{"$f":"B29*D29","v":0},{"$f":"B29*E29","v":0},null,{"$f":"G29+H29","v":0}]
[" 1B",5.0000000000000001E-3,null,{"$f":"'Sommaire du rôle_sec_4'!H8","v":0},{"$f":"'Sommaire du rôle_sec_4'!I8","v":0},null,0,0,null,0]
[" 1C",0.01,null,{"$f":"'Sommaire du rôle_sec_4'!H9","v":0},{"$f":"'Sommaire du rôle_sec_4'!I9","v":0},null,0,0,null,0]
[2,0.03,null,{"$f":"'Sommaire du rôle_sec_4'!H10","v":0},{"$f":"'Sommaire du rôle_sec_4'!I10","v":0},null,0,0,null,0]
[3,0.06,null,{"$f":"'Sommaire du rôle_sec_4'!H11","v":0},{"$f":"'Sommaire du rôle_sec_4'!I11","v":0},null,0,0,null,0]
[4,0.12,null,{"$f":"'Sommaire du rôle_sec_4'!H12","v":0},{"$f":"'Sommaire du rôle_sec_4'!I12","v":0},null,0,0,null,0]
[5,0.22,null,{"$f":"'Sommaire du rôle_sec_4'!H13","v":0},{"$f":"'Sommaire du rôle_sec_4'!I13","v":0},null,0,0,null,0]
[6,0.4,null,{"$f":"'Sommaire du rôle_sec_4'!H14","v":290100},{"$f":"'Sommaire du rôle_sec_4'!I14","v":0},null,116040,0,null,116040]
[7,0.6,null,{"$f":"'Sommaire du rôle_sec_4'!H15","v":350350},{"$f":"'Sommaire du rôle_sec_4'!I15","v":0},null,210210,0,null,210210]
[8,0.85,null,{"$f":"'Sommaire du rôle_sec_4'!H16","v":0},{"$f":"'Sommaire du rôle_sec_4'!I16","v":0},null,0,0,null,0]
[9,1,null,{"$f":"'Sommaire du rôle_sec_4'!H17","v":0},{"$f":"'Sommaire du rôle_sec_4'!I17","v":0},null,0,0,null,0]
[10,1,null,{"$f":"'Sommaire du rôle_sec_4'!H18","v":10515650},{"$f":"'Sommaire du rôle_sec_4'!I18","v":0},null,10515650,0,null,10515650]
["Total",null,null,null,null,null,{"$f":"SUM(G29:G40)","v":10841900},{"$f":"SUM(H29:H40)","v":0},null,10841900]
[]
["ASSIETTE AU TAUX IND. (SAUF CL.1 ET 2)"]
["Classe non résidentielle","Pourcentage de taxation",null,"VALEUR À 100 %"]
[null,null,null,"  Imposables","Compensables",null,"Imposables pondérées","Compensables pondérées",null,"Total"]
[null,"(1)",null,"(2)","(3)",null,"(4) = (1) X (2)","(5) = (1) X (3)",null,"(6) = (4) + (5)"]
[" 1A",1E-3,null,{"$f":"'Sommaire du rôle_sec_4'!J7","v":0},{"$f":"'Sommaire du rôle_sec_4'!K7","v":0},null,{"$f":"B47*D47","v":0},{"$f":"B47*E47","v":0},null,{"$f":"G47+H47","v":0}]
[" 1B",5.0000000000000001E-3,null,{"$f":"'Sommaire du rôle_sec_4'!J8","v":0},{"$f":"'Sommaire du rôle_sec_4'!K8","v":0},null,0,0,null,0]
[" 1C",0.01,null,{"$f":"'Sommaire du rôle_sec_4'!J9","v":0},{"$f":"'Sommaire du rôle_sec_4'!K9","v":0},null,0,0,null,0]
[2,0.03,null,{"$f":"'Sommaire du rôle_sec_4'!J10","v":605900},{"$f":"'Sommaire du rôle_sec_4'!K10","v":0},null,18177,0,null,18177]
[3,0.06,null,{"$f":"'Sommaire du rôle_sec_4'!J11","v":181400},{"$f":"'Sommaire du rôle_sec_4'!K11","v":0},null,10884,0,null,10884]
[4,0.12,null,{"$f":"'Sommaire du rôle_sec_4'!J12","v":215700},{"$f":"'Sommaire du rôle_sec_4'!K12","v":0},null,25884,0,null,25884]
[5,0.22,null,{"$f":"'Sommaire du rôle_sec_4'!J13","v":0},{"$f":"'Sommaire du rôle_sec_4'!K13","v":0},null,0,0,null,0]
[6,0.4,null,{"$f":"'Sommaire du rôle_sec_4'!J14","v":2421200},{"$f":"'Sommaire du rôle_sec_4'!K14","v":0},null,968480,0,null,968480]
[7,0.6,null,{"$f":"'Sommaire du rôle_sec_4'!J15","v":354000},{"$f":"'Sommaire du rôle_sec_4'!K15","v":0},null,212400,0,null,212400]
[8,0.85,null,{"$f":"'Sommaire du rôle_sec_4'!J16","v":1875900},{"$f":"'Sommaire du rôle_sec_4'!K16","v":0},null,1594515,0,null,1594515]
[9,1,null,{"$f":"'Sommaire du rôle_sec_4'!J17","v":0},{"$f":"'Sommaire du rôle_sec_4'!K17","v":0},null,0,0,null,0]
[10,1,null,{"$f":"'Sommaire du rôle_sec_4'!J18","v":225704400},{"$f":"'Sommaire du rôle_sec_4'!K18","v":2325200},null,225704400,2325200,null,228029600]
["Total",null,null,null,null,null,{"$f":"SUM(G47:G58)","v":228534740},{"$f":"SUM(H47:H58)","v":2325200},null,230859940]
[]
["ASSIETTE AU TAUX DE BASE"]
["Classe non résidentielle","Pourcentage de taxation",null,"VALEUR À 100 %"]
[null,null,null,"  Imposables","Compensables",null,"Imposables pondérées","Compensables pondérées",null,"Total"]
[null,"(1)",null,"(2)","(3)",null,"(4) = (1) X (2)","(5) = (1) X (3)",null,"(6) = (4) + (5)"]
[" 1A",0.999,null,{"$f":"'Sommaire du rôle_sec_4'!P7","v":76534150},{"$f":"'Sommaire du rôle_sec_4'!Q7","v":0},null,{"$f":"D65*B65","v":76457615.849999994},{"$f":"B65*E65","v":0},null,{"$f":"G65+H65","v":76457615.849999994}]
[" 1B",0.995,null,{"$f":"'Sommaire du rôle_sec_4'!P8","v":34712370},{"$f":"'Sommaire du rôle_sec_4'!Q8","v":0},null,34538808.149999999,0,null,34538808.149999999]
[" 1C",0.99,null,{"$f":"'Sommaire du rôle_sec_4'!P9","v":4894450},{"$f":"'Sommaire du rôle_sec_4'!Q9","v":0},null,4845505.5,0,null,4845505.5]
[2,0.97,null,{"$f":"'Sommaire du rôle_sec_4'!P10","v":23616670},{"$f":"'Sommaire du rôle_sec_4'!Q10","v":0},null,22908169.899999999,0,null,22908169.899999999]
[3,0.94,null,{"$f":"'Sommaire du rôle_sec_4'!P11","v":44153450},{"$f":"'Sommaire du rôle_sec_4'!Q11","v":0},null,41504243,0,null,41504243]
[4,0.88,null,{"$f":"'Sommaire du rôle_sec_4'!P12","v":60256460},{"$f":"'Sommaire du rôle_sec_4'!Q12","v":0},null,53025684.799999997,0,null,53025684.799999997]
[5,0.78,null,{"$f":"'Sommaire du rôle_sec_4'!P13","v":38643990},{"$f":"'Sommaire du rôle_sec_4'!Q13","v":0},null,30142312.199999999,0,null,30142312.199999999]
[6,0.6,null,{"$f":"'Sommaire du rôle_sec_4'!P14","v":38532890},{"$f":"'Sommaire du rôle_sec_4'!Q14","v":0},null,23119734,0,null,23119734]
[7,0.4,null,{"$f":"'Sommaire du rôle_sec_4'!P15","v":39569365},{"$f":"'Sommaire du rôle_sec_4'!Q15","v":72376370},null,15827746,28950548,null,44778294]
[8,0.15000000000000002,null,{"$f":"'Sommaire du rôle_sec_4'!P16","v":22323070},{"$f":"'Sommaire du rôle_sec_4'!Q16","v":211592260},null,3348460.5000000005,31738839.000000004,null,35087299.500000007]
["IMMEUBLES SANS PARTIE NON RÉSIDENTIELLE",1,null,{"$f":"'Sommaire du rôle_sec_4'!P18","v":8068032861},{"$f":"'Sommaire du rôle_sec_4'!Q18","v":2100780},null,8068032861,2100780,null,8070133641]
["12  CHSLD",0.8,null,{"$f":"'Sommaire du rôle_sec_4'!P20","v":13938200},null,null,11150560]
["13 Cours de triage ",0.6,null,{"$f":"'Sommaire du rôle_sec_4'!P21","v":0},null,null,0]
["Total",null,null,null,null,null,{"$f":"SUM(G65:G77)","v":8384901700.8999996},{"$f":"SUM(H65:H75)","v":62790167},{"$f":"SUM(I65:I75)","v":0},{"$f":"G78+H78","v":8447691867.8999996}]
[]
["ASSIETTE AU TAUX NON RÉSIDENTIEL RÉFÉRENCE"]
["Classe non résidentielle","Pourcentage de taxation",null,"VAL. NR À 100 % ET IND. CL. 2 À 50 %"]
[null,null,null,"  Imposables","Compensables",null,"Imposables pondérées","Compensables pondérées",null,"Total"]
[null,"(1)",null,"(2)","(3)",null,"(4) = (1) X (2)","(5) = (1 ) X  (3)",null,"(6) = (4) + (5)"]
[" 1A",1E-3,null,{"$f":"'Sommaire du rôle_sec_4'!F30","v":0},{"$f":"'Sommaire du rôle_sec_4'!G30","v":0},null,{"$f":"B84*D84","v":0},{"$f":"B84*E84","v":0},null,{"$f":"G84+H84","v":0}]
[" 1B",5.0000000000000001E-3,null,{"$f":"'Sommaire du rôle_sec_4'!F31","v":0},{"$f":"'Sommaire du rôle_sec_4'!G31","v":0},null,0,0,null,0]
[" 1C",0.01,null,{"$f":"'Sommaire du rôle_sec_4'!F32","v":0},{"$f":"'Sommaire du rôle_sec_4'!G32","v":0},null,0,0,null,0]
[2,0.03,null,{"$f":"'Sommaire du rôle_sec_4'!F33","v":0},{"$f":"'Sommaire du rôle_sec_4'!G33","v":0},null,0,0,null,0]
[3,0.06,null,{"$f":"'Sommaire du rôle_sec_4'!F34","v":0},{"$f":"'Sommaire du rôle_sec_4'!G34","v":0},null,0,0,null,0]
[4,0.12,null,{"$f":"'Sommaire du rôle_sec_4'!F35","v":0},{"$f":"'Sommaire du rôle_sec_4'!G35","v":0},null,0,0,null,0]
[5,0.22,null,{"$f":"'Sommaire du rôle_sec_4'!F36","v":0},{"$f":"'Sommaire du rôle_sec_4'!G36","v":0},null,0,0,null,0]
[6,0.4,null,{"$f":"'Sommaire du rôle_sec_4'!F37","v":0},{"$f":"'Sommaire du rôle_sec_4'!G37","v":0},null,0,0,null,0]
[7,0.6,null,{"$f":"'Sommaire du rôle_sec_4'!F38","v":0},{"$f":"'Sommaire du rôle_sec_4'!G38","v":0},null,0,0,null,0]
[8,0.85,null,{"$f":"'Sommaire du rôle_sec_4'!F39","v":0},{"$f":"'Sommaire du rôle_sec_4'!G39","v":0},null,0,0,null,0]
[9,1,null,{"$f":"'Sommaire du rôle_sec_4'!F40","v":0},{"$f":"'Sommaire du rôle_sec_4'!G40","v":0},null,0,0,null,0]
[10,1,null,{"$f":"'Sommaire du rôle_sec_4'!F41","v":0},{"$f":"'Sommaire du rôle_sec_4'!G41","v":0},null,0,0,null,0]
["11 Cours de triage","100%",null,{"$f":"'Sommaire du rôle_sec_4'!F42","v":0},{"$f":"'Sommaire du rôle_sec_4'!G42","v":0},null,0,0,null,0]
["12 CHSLD",0.2,null,{"$f":"'Sommaire du rôle_sec_4'!F43","v":0},null,null,0,null,null,0]
["13 Cours de triage 40 %","40%",null,{"$f":"'Sommaire du rôle_sec_4'!F44","v":0},null,null,0,null,null,0]
[" APPLICATION DU TNR QUAND TTVD",1,null,{"$f":"'Sommaire du rôle_sec_4'!F45","v":0},{"$f":"'Sommaire du rôle_sec_4'!G45","v":0},null,0,{"$f":"B99*E99","v":0},null,0]
["Total",null,null,null,null,null,{"$f":"SUM(G84:G99)","v":0},{"$f":"SUM(H84:H99)","v":0},null,0]
[]
["ASSIETTE AU TAUX NON RÉSIDENTIEL SOUS-CATÉGORIE 1",null,null,null,null,null,null,null,null,null,null,"ASSIETTE AU TAUX NON RÉSIDENTIEL SOUS-CATÉGORIE 2",null,null,null,null,null,null,null,null,null,null,"ASSIETTE AU TAUX NON RÉSIDENTIEL SOUS-CATÉGORIE 3",null,null,null,null,null,null,null,null,null,null,"ASSIETTE AU TAUX NON RÉSIDENTIEL SOUS-CATÉGORIE 4",null,null,null,null,null,null,null,null,null,null,"ASSIETTE AU TAUX NON RÉSIDENTIEL SOUS-CATÉGORIE 5",null,null,null,null,null,null,null,null,null,null,"ASSIETTE AU TAUX NON RÉSIDENTIEL SOUS-CATÉGORIE 6",null,null,null,null,null,null,null,null,null,null,"ASSIETTE AU TAUX NON RÉSIDENTIEL SOUS-CATÉGORIE 7",null,null,null,null,null,null,null,null,null,null,"ASSIETTE AU TAUX NON RÉSIDENTIEL SOUS-CATÉGORIE 8",null,null,null,null,null,null,null,null,null,null,"ASSIETTE AU TAUX NON RÉSIDENTIEL SOUS-CATÉGORIE 9",null,null,null,null,null,null,null,null,null,null,"ASSIETTE AU TAUX NON RÉSIDENTIEL SOUS-CATÉGORIE 10"]
["Classe non résidentielle","Pourcentage de taxation",null,"VAL. NR À 100 % ET IND. CL. 2 À 50 %",null,null,null,null,null,null,null,"Classe non résidentielle","Pourcentage de taxation",null,"VAL. NR À 100 % ET IND. CL. 2 À 50 %",null,null,null,null,null,null,null,"Classe non résidentielle","Pourcentage de taxation",null,"VAL. NR À 100 % ET IND. CL. 2 À 50 %",null,null,null,null,null,null,null,"Classe non résidentielle","Pourcentage de taxation",null,"VAL. NR À 100 % ET IND. CL. 2 À 50 %",null,null,null,null,null,null,null,"Classe non résidentielle","Pourcentage de taxation",null,"VAL. NR À 100 % ET IND. CL. 2 À 50 %",null,null,null,null,null,null,null,"Classe non résidentielle","Pourcentage de taxation",null,"VAL. NR À 100 % ET IND. CL. 2 À 50 %",null,null,null,null,null,null,null,"Classe non résidentielle","Pourcentage de taxation",null,"VAL. NR À 100 % ET IND. CL. 2 À 50 %",null,null,null,null,null,null,null,"Classe non résidentielle","Pourcentage de taxation",null,"VAL. NR À 100 % ET IND. CL. 2 À 50 %",null,null,null,null,null,null,null,"Classe non résidentielle","Pourcentage de taxation",null,"VAL. NR À 100 % ET IND. CL. 2 À 50 %",null,null,null,null,null,null,null,"Classe non résidentielle","Pourcentage de taxation",null,"VAL. NR À 100 % ET IND. CL. 2 À 50 %"]
[null,null,null,"  Imposables","Compensables",null,"Imposables pondérées","Compensables pondérées",null,"Total",null,null,null,null,"  Imposables","Compensables",null,"Imposables pondérées","Compensables pondérées",null,"Total",null,null,null,null,"  Imposables","Compensables",null,"Imposables pondérées","Compensables pondérées",null,"Total",null,null,null,null,"  Imposables","Compensables",null,"Imposables pondérées","Compensables pondérées",null,"Total",null,null,null,null,"  Imposables","Compensables",null,"Imposables pondérées","Compensables pondérées",null,"Total",null,null,null,null,"  Imposables","Compensables",null,"Imposables pondérées","Compensables pondérées",null,"Total",null,null,null,null,"  Imposables","Compensables",null,"Imposables pondérées","Compensables pondérées",null,"Total",null,null,null,null,"  Imposables","Compensables",null,"Imposables pondérées","Compensables pondérées",null,"Total",null,null,null,null,"  Imposables","Compensables",null,"Imposables pondérées","Compensables pondérées",null,"Total",null,null,null,null,"  Imposables","Compensables",null,"Imposables pondérées","Compensables pondérées",null,"Total"]
[null,"(1)",null,"(2)","(3)",null,"(4) = (1) X (2)","(5) = (1 ) X  (3)",null,"(6) = (4) + (5)",null,null,"(1)",null,"(2)","(3)",null,"(4) = (1) X (2)","(5) = (1 ) X  (3)",null,"(6) = (4) + (5)",null,null,"(1)",null,"(2)","(3)",null,"(4) = (1) X (2)","(5) = (1 ) X  (3)",null,"(6) = (4) + (5)",null,null,"(1)",null,"(2)","(3)",null,"(4) = (1) X (2)","(5) = (1 ) X  (3)",null,"(6) = (4) + (5)",null,null,"(1)",null,"(2)","(3)",null,"(4) = (1) X (2)","(5) = (1 ) X  (3)",null,"(6) = (4) + (5)",null,null,"(1)",null,"(2)","(3)",null,"(4) = (1) X (2)","(5) = (1 ) X  (3)",null,"(6) = (4) + (5)",null,null,"(1)",null,"(2)","(3)",null,"(4) = (1) X (2)","(5) = (1 ) X  (3)",null,"(6) = (4) + (5)",null,null,"(1)",null,"(2)","(3)",null,"(4) = (1) X (2)","(5) = (1 ) X  (3)",null,"(6) = (4) + (5)",null,null,"(1)",null,"(2)","(3)",null,"(4) = (1) X (2)","(5) = (1 ) X  (3)",null,"(6) = (4) + (5)",null,null,"(1)",null,"(2)","(3)",null,"(4) = (1) X (2)","(5) = (1 ) X  (3)",null,"(6) = (4) + (5)"]
[" 1A",1E-3,null,{"$f":"'Sommaire du rôle_sec_4'!H30","v":0},{"$f":"'Sommaire du rôle_sec_4'!I30","v":0},null,{"$f":"B106*D106","v":0},{"$f":"B106*E106","v":0},null,{"$f":"G106+H106","v":0},null," 1A",1E-3,null,{"$f":"'Sommaire du rôle_sec_4'!J30","v":0},{"$f":"'Sommaire du rôle_sec_4'!K30","v":0},null,{"$f":"M106*O106","v":0},{"$f":"M106*P106","v":0},null,{"$f":"R106+S106","v":0},null," 1A",1E-3,null,{"$f":"'Sommaire du rôle_sec_4'!L30","v":0},{"$f":"'Sommaire du rôle_sec_4'!M30","v":0},null,{"$f":"X106*Z106","v":0},{"$f":"X106*AA106","v":0},null,{"$f":"AC106+AD106","v":0},null," 1A",1E-3,null,{"$f":"'Sommaire du rôle_sec_4'!N30","v":0},{"$f":"'Sommaire du rôle_sec_4'!O30","v":0},null,{"$f":"AI106*AK106","v":0},{"$f":"AI106*AL106","v":0},null,{"$f":"AN106+AO106","v":0},null," 1A",1E-3,null,{"$f":"'Sommaire du rôle_sec_4'!P30","v":0},{"$f":"'Sommaire du rôle_sec_4'!Q30","v":0},null,{"$f":"AT106*AV106","v":0},{"$f":"AT106*AW106","v":0},null,{"$f":"AY106+AZ106","v":0},null," 1A",1E-3,null,{"$f":"'Sommaire du rôle_sec_4'!R30","v":0},{"$f":"'Sommaire du rôle_sec_4'!S30","v":0},null,{"$f":"BE106*BG106","v":0},{"$f":"BE106*BH106","v":0},null,{"$f":"BJ106+BK106","v":0},null," 1A",1E-3,null,{"$f":"'Sommaire du rôle_sec_4'!T30","v":0},{"$f":"'Sommaire du rôle_sec_4'!U30","v":0},null,{"$f":"BP106*BR106","v":0},{"$f":"BP106*BS106","v":0},null,{"$f":"BU106+BV106","v":0},null," 1A",1E-3,null,{"$f":"'Sommaire du rôle_sec_4'!V30","v":0},{"$f":"'Sommaire du rôle_sec_4'!W30","v":0},null,{"$f":"CA106*CC106","v":0},{"$f":"CA106*CD106","v":0},null,{"$f":"CF106+CG106","v":0},null," 1A",1E-3,null,{"$f":"'Sommaire du rôle_sec_4'!X30","v":0},{"$f":"'Sommaire du rôle_sec_4'!Y30","v":0},null,{"$f":"CL106*CN106","v":0},{"$f":"CL106*CO106","v":0},null,{"$f":"CQ106+CR106","v":0},null," 1A",1E-3,null,{"$f":"'Sommaire du rôle_sec_4'!Z30","v":0},{"$f":"'Sommaire du rôle_sec_4'!AA30","v":0},null,{"$f":"CW106*CY106","v":0},{"$f":"CW106*CZ106","v":0},null,{"$f":"DB106+DC106","v":0}]
[" 1B",5.0000000000000001E-3,null,{"$f":"'Sommaire du rôle_sec_4'!H31","v":0},{"$f":"'Sommaire du rôle_sec_4'!I31","v":0},null,0,0,null,0,null," 1B",5.0000000000000001E-3,null,{"$f":"'Sommaire du rôle_sec_4'!J31","v":0},{"$f":"'Sommaire du rôle_sec_4'!K31","v":0},null,0,0,null,0,null," 1B",5.0000000000000001E-3,null,{"$f":"'Sommaire du rôle_sec_4'!L31","v":0},{"$f":"'Sommaire du rôle_sec_4'!M31","v":0},null,0,0,null,0,null," 1B",5.0000000000000001E-3,null,{"$f":"'Sommaire du rôle_sec_4'!N31","v":0},{"$f":"'Sommaire du rôle_sec_4'!O31","v":0},null,0,0,null,0,null," 1B",5.0000000000000001E-3,null,{"$f":"'Sommaire du rôle_sec_4'!P31","v":0},{"$f":"'Sommaire du rôle_sec_4'!Q31","v":0},null,0,0,null,0,null," 1B",5.0000000000000001E-3,null,{"$f":"'Sommaire du rôle_sec_4'!R31","v":0},{"$f":"'Sommaire du rôle_sec_4'!S31","v":0},null,0,0,null,0,null," 1B",5.0000000000000001E-3,null,{"$f":"'Sommaire du rôle_sec_4'!T31","v":0},{"$f":"'Sommaire du rôle_sec_4'!U31","v":0},null,0,0,null,0,null," 1B",5.0000000000000001E-3,null,{"$f":"'Sommaire du rôle_sec_4'!V31","v":0},{"$f":"'Sommaire du rôle_sec_4'!W31","v":0},null,0,0,null,0,null," 1B",5.0000000000000001E-3,null,{"$f":"'Sommaire du rôle_sec_4'!X31","v":0},{"$f":"'Sommaire du rôle_sec_4'!Y31","v":0},null,0,0,null,0,null," 1B",5.0000000000000001E-3,null,{"$f":"'Sommaire du rôle_sec_4'!Z31","v":0},{"$f":"'Sommaire du rôle_sec_4'!AA31","v":0},null,0,0,null,0]
[" 1C",0.01,null,{"$f":"'Sommaire du rôle_sec_4'!H32","v":0},{"$f":"'Sommaire du rôle_sec_4'!I32","v":0},null,0,0,null,0,null," 1C",0.01,null,{"$f":"'Sommaire du rôle_sec_4'!J32","v":0},{"$f":"'Sommaire du rôle_sec_4'!K32","v":0},null,0,0,null,0,null," 1C",0.01,null,{"$f":"'Sommaire du rôle_sec_4'!L32","v":0},{"$f":"'Sommaire du rôle_sec_4'!M32","v":0},null,0,0,null,0,null," 1C",0.01,null,{"$f":"'Sommaire du rôle_sec_4'!N32","v":0},{"$f":"'Sommaire du rôle_sec_4'!O32","v":0},null,0,0,null,0,null," 1C",0.01,null,{"$f":"'Sommaire du rôle_sec_4'!P32","v":0},{"$f":"'Sommaire du rôle_sec_4'!Q32","v":0},null,0,0,null,0,null," 1C",0.01,null,{"$f":"'Sommaire du rôle_sec_4'!R32","v":0},{"$f":"'Sommaire du rôle_sec_4'!S32","v":0},null,0,0,null,0,null," 1C",0.01,null,{"$f":"'Sommaire du rôle_sec_4'!T32","v":0},{"$f":"'Sommaire du rôle_sec_4'!U32","v":0},null,0,0,null,0,null," 1C",0.01,null,{"$f":"'Sommaire du rôle_sec_4'!V32","v":0},{"$f":"'Sommaire du rôle_sec_4'!W32","v":0},null,0,0,null,0,null," 1C",0.01,null,{"$f":"'Sommaire du rôle_sec_4'!X32","v":0},{"$f":"'Sommaire du rôle_sec_4'!Y32","v":0},null,0,0,null,0,null," 1C",0.01,null,{"$f":"'Sommaire du rôle_sec_4'!Z32","v":0},{"$f":"'Sommaire du rôle_sec_4'!AA32","v":0},null,0,0,null,0]
[2,0.03,null,{"$f":"'Sommaire du rôle_sec_4'!H33","v":0},{"$f":"'Sommaire du rôle_sec_4'!I33","v":0},null,0,0,null,0,null,2,0.03,null,{"$f":"'Sommaire du rôle_sec_4'!J33","v":0},{"$f":"'Sommaire du rôle_sec_4'!K33","v":0},null,0,0,null,0,null,2,0.03,null,{"$f":"'Sommaire du rôle_sec_4'!L33","v":0},{"$f":"'Sommaire du rôle_sec_4'!M33","v":0},null,0,0,null,0,null,2,0.03,null,{"$f":"'Sommaire du rôle_sec_4'!N33","v":0},{"$f":"'Sommaire du rôle_sec_4'!O33","v":0},null,0,0,null,0,null,2,0.03,null,{"$f":"'Sommaire du rôle_sec_4'!P33","v":0},{"$f":"'Sommaire du rôle_sec_4'!Q33","v":0},null,0,0,null,0,null,2,0.03,null,{"$f":"'Sommaire du rôle_sec_4'!R33","v":0},{"$f":"'Sommaire du rôle_sec_4'!S33","v":0},null,0,0,null,0,null,2,0.03,null,{"$f":"'Sommaire du rôle_sec_4'!T33","v":0},{"$f":"'Sommaire du rôle_sec_4'!U33","v":0},null,0,0,null,0,null,2,0.03,null,{"$f":"'Sommaire du rôle_sec_4'!V33","v":0},{"$f":"'Sommaire du rôle_sec_4'!W33","v":0},null,0,0,null,0,null,2,0.03,null,{"$f":"'Sommaire du rôle_sec_4'!X33","v":0},{"$f":"'Sommaire du rôle_sec_4'!Y33","v":0},null,0,0,null,0,null,2,0.03,null,{"$f":"'Sommaire du rôle_sec_4'!Z33","v":0},{"$f":"'Sommaire du rôle_sec_4'!AA33","v":0},null,0,0,null,0]
[3,0.06,null,{"$f":"'Sommaire du rôle_sec_4'!H34","v":0},{"$f":"'Sommaire du rôle_sec_4'!I34","v":0},null,0,0,null,0,null,3,0.06,null,{"$f":"'Sommaire du rôle_sec_4'!J34","v":0},{"$f":"'Sommaire du rôle_sec_4'!K34","v":0},null,0,0,null,0,null,3,0.06,null,{"$f":"'Sommaire du rôle_sec_4'!L34","v":0},{"$f":"'Sommaire du rôle_sec_4'!M34","v":0},null,0,0,null,0,null,3,0.06,null,{"$f":"'Sommaire du rôle_sec_4'!N34","v":0},{"$f":"'Sommaire du rôle_sec_4'!O34","v":0},null,0,0,null,0,null,3,0.06,null,{"$f":"'Sommaire du rôle_sec_4'!P34","v":0},{"$f":"'Sommaire du rôle_sec_4'!Q34","v":0},null,0,0,null,0,null,3,0.06,null,{"$f":"'Sommaire du rôle_sec_4'!R34","v":0},{"$f":"'Sommaire du rôle_sec_4'!S34","v":0},null,0,0,null,0,null,3,0.06,null,{"$f":"'Sommaire du rôle_sec_4'!T34","v":0},{"$f":"'Sommaire du rôle_sec_4'!U34","v":0},null,0,0,null,0,null,3,0.06,null,{"$f":"'Sommaire du rôle_sec_4'!V34","v":0},{"$f":"'Sommaire du rôle_sec_4'!W34","v":0},null,0,0,null,0,null,3,0.06,null,{"$f":"'Sommaire du rôle_sec_4'!X34","v":0},{"$f":"'Sommaire du rôle_sec_4'!Y34","v":0},null,0,0,null,0,null,3,0.06,null,{"$f":"'Sommaire du rôle_sec_4'!Z34","v":0},{"$f":"'Sommaire du rôle_sec_4'!AA34","v":0},null,0,0,null,0]
[4,0.12,null,{"$f":"'Sommaire du rôle_sec_4'!H35","v":0},{"$f":"'Sommaire du rôle_sec_4'!I35","v":0},null,0,0,null,0,null,4,0.12,null,{"$f":"'Sommaire du rôle_sec_4'!J35","v":0},{"$f":"'Sommaire du rôle_sec_4'!K35","v":0},null,0,0,null,0,null,4,0.12,null,{"$f":"'Sommaire du rôle_sec_4'!L35","v":0},{"$f":"'Sommaire du rôle_sec_4'!M35","v":0},null,0,0,null,0,null,4,0.12,null,{"$f":"'Sommaire du rôle_sec_4'!N35","v":0},{"$f":"'Sommaire du rôle_sec_4'!O35","v":0},null,0,0,null,0,null,4,0.12,null,{"$f":"'Sommaire du rôle_sec_4'!P35","v":0},{"$f":"'Sommaire du rôle_sec_4'!Q35","v":0},null,0,0,null,0,null,4,0.12,null,{"$f":"'Sommaire du rôle_sec_4'!R35","v":0},{"$f":"'Sommaire du rôle_sec_4'!S35","v":0},null,0,0,null,0,null,4,0.12,null,{"$f":"'Sommaire du rôle_sec_4'!T35","v":0},{"$f":"'Sommaire du rôle_sec_4'!U35","v":0},null,0,0,null,0,null,4,0.12,null,{"$f":"'Sommaire du rôle_sec_4'!V35","v":0},{"$f":"'Sommaire du rôle_sec_4'!W35","v":0},null,0,0,null,0,null,4,0.12,null,{"$f":"'Sommaire du rôle_sec_4'!X35","v":0},{"$f":"'Sommaire du rôle_sec_4'!Y35","v":0},null,0,0,null,0,null,4,0.12,null,{"$f":"'Sommaire du rôle_sec_4'!Z35","v":0},{"$f":"'Sommaire du rôle_sec_4'!AA35","v":0},null,0,0,null,0]
[5,0.22,null,{"$f":"'Sommaire du rôle_sec_4'!H36","v":0},{"$f":"'Sommaire du rôle_sec_4'!I36","v":0},null,0,0,null,0,null,5,0.22,null,{"$f":"'Sommaire du rôle_sec_4'!J36","v":0},{"$f":"'Sommaire du rôle_sec_4'!K36","v":0},null,0,0,null,0,null,5,0.22,null,{"$f":"'Sommaire du rôle_sec_4'!L36","v":0},{"$f":"'Sommaire du rôle_sec_4'!M36","v":0},null,0,0,null,0,null,5,0.22,null,{"$f":"'Sommaire du rôle_sec_4'!N36","v":0},{"$f":"'Sommaire du rôle_sec_4'!O36","v":0},null,0,0,null,0,null,5,0.22,null,{"$f":"'Sommaire du rôle_sec_4'!P36","v":0},{"$f":"'Sommaire du rôle_sec_4'!Q36","v":0},null,0,0,null,0,null,5,0.22,null,{"$f":"'Sommaire du rôle_sec_4'!R36","v":0},{"$f":"'Sommaire du rôle_sec_4'!S36","v":0},null,0,0,null,0,null,5,0.22,null,{"$f":"'Sommaire du rôle_sec_4'!T36","v":0},{"$f":"'Sommaire du rôle_sec_4'!U36","v":0},null,0,0,null,0,null,5,0.22,null,{"$f":"'Sommaire du rôle_sec_4'!V36","v":0},{"$f":"'Sommaire du rôle_sec_4'!W36","v":0},null,0,0,null,0,null,5,0.22,null,{"$f":"'Sommaire du rôle_sec_4'!X36","v":0},{"$f":"'Sommaire du rôle_sec_4'!Y36","v":0},null,0,0,null,0,null,5,0.22,null,{"$f":"'Sommaire du rôle_sec_4'!Z36","v":0},{"$f":"'Sommaire du rôle_sec_4'!AA36","v":0},null,0,0,null,0]
[6,0.4,null,{"$f":"'Sommaire du rôle_sec_4'!H37","v":0},{"$f":"'Sommaire du rôle_sec_4'!I37","v":0},null,0,0,null,0,null,6,0.4,null,{"$f":"'Sommaire du rôle_sec_4'!J37","v":0},{"$f":"'Sommaire du rôle_sec_4'!K37","v":0},null,0,0,null,0,null,6,0.4,null,{"$f":"'Sommaire du rôle_sec_4'!L37","v":0},{"$f":"'Sommaire du rôle_sec_4'!M37","v":0},null,0,0,null,0,null,6,0.4,null,{"$f":"'Sommaire du rôle_sec_4'!N37","v":0},{"$f":"'Sommaire du rôle_sec_4'!O37","v":0},null,0,0,null,0,null,6,0.4,null,{"$f":"'Sommaire du rôle_sec_4'!P37","v":0},{"$f":"'Sommaire du rôle_sec_4'!Q37","v":0},null,0,0,null,0,null,6,0.4,null,{"$f":"'Sommaire du rôle_sec_4'!R37","v":0},{"$f":"'Sommaire du rôle_sec_4'!S37","v":0},null,0,0,null,0,null,6,0.4,null,{"$f":"'Sommaire du rôle_sec_4'!T37","v":0},{"$f":"'Sommaire du rôle_sec_4'!U37","v":0},null,0,0,null,0,null,6,0.4,null,{"$f":"'Sommaire du rôle_sec_4'!V37","v":0},{"$f":"'Sommaire du rôle_sec_4'!W37","v":0},null,0,0,null,0,null,6,0.4,null,{"$f":"'Sommaire du rôle_sec_4'!X37","v":0},{"$f":"'Sommaire du rôle_sec_4'!Y37","v":0},null,0,0,null,0,null,6,0.4,null,{"$f":"'Sommaire du rôle_sec_4'!Z37","v":0},{"$f":"'Sommaire du rôle_sec_4'!AA37","v":0},null,0,0,null,0]
[7,0.6,null,{"$f":"'Sommaire du rôle_sec_4'!H38","v":0},{"$f":"'Sommaire du rôle_sec_4'!I38","v":0},null,0,0,null,0,null,7,0.6,null,{"$f":"'Sommaire du rôle_sec_4'!J38","v":0},{"$f":"'Sommaire du rôle_sec_4'!K38","v":0},null,0,0,null,0,null,7,0.6,null,{"$f":"'Sommaire du rôle_sec_4'!L38","v":0},{"$f":"'Sommaire du rôle_sec_4'!M38","v":0},null,0,0,null,0,null,7,0.6,null,{"$f":"'Sommaire du rôle_sec_4'!N38","v":0},{"$f":"'Sommaire du rôle_sec_4'!O38","v":0},null,0,0,null,0,null,7,0.6,null,{"$f":"'Sommaire du rôle_sec_4'!P38","v":0},{"$f":"'Sommaire du rôle_sec_4'!Q38","v":0},null,0,0,null,0,null,7,0.6,null,{"$f":"'Sommaire du rôle_sec_4'!R38","v":0},{"$f":"'Sommaire du rôle_sec_4'!S38","v":0},null,0,0,null,0,null,7,0.6,null,{"$f":"'Sommaire du rôle_sec_4'!T38","v":0},{"$f":"'Sommaire du rôle_sec_4'!U38","v":0},null,0,0,null,0,null,7,0.6,null,{"$f":"'Sommaire du rôle_sec_4'!V38","v":0},{"$f":"'Sommaire du rôle_sec_4'!W38","v":0},null,0,0,null,0,null,7,0.6,null,{"$f":"'Sommaire du rôle_sec_4'!X38","v":0},{"$f":"'Sommaire du rôle_sec_4'!Y38","v":0},null,0,0,null,0,null,7,0.6,null,{"$f":"'Sommaire du rôle_sec_4'!Z38","v":0},{"$f":"'Sommaire du rôle_sec_4'!AA38","v":0},null,0,0,null,0]
[8,0.85,null,{"$f":"'Sommaire du rôle_sec_4'!H39","v":0},{"$f":"'Sommaire du rôle_sec_4'!I39","v":0},null,0,0,null,0,null,8,0.85,null,{"$f":"'Sommaire du rôle_sec_4'!J39","v":0},{"$f":"'Sommaire du rôle_sec_4'!K39","v":0},null,0,0,null,0,null,8,0.85,null,{"$f":"'Sommaire du rôle_sec_4'!L39","v":0},{"$f":"'Sommaire du rôle_sec_4'!M39","v":0},null,0,0,null,0,null,8,0.85,null,{"$f":"'Sommaire du rôle_sec_4'!N39","v":0},{"$f":"'Sommaire du rôle_sec_4'!O39","v":0},null,0,0,null,0,null,8,0.85,null,{"$f":"'Sommaire du rôle_sec_4'!P39","v":0},{"$f":"'Sommaire du rôle_sec_4'!Q39","v":0},null,0,0,null,0,null,8,0.85,null,{"$f":"'Sommaire du rôle_sec_4'!R39","v":0},{"$f":"'Sommaire du rôle_sec_4'!S39","v":0},null,0,0,null,0,null,8,0.85,null,{"$f":"'Sommaire du rôle_sec_4'!T39","v":0},{"$f":"'Sommaire du rôle_sec_4'!U39","v":0},null,0,0,null,0,null,8,0.85,null,{"$f":"'Sommaire du rôle_sec_4'!V39","v":0},{"$f":"'Sommaire du rôle_sec_4'!W39","v":0},null,0,0,null,0,null,8,0.85,null,{"$f":"'Sommaire du rôle_sec_4'!X39","v":0},{"$f":"'Sommaire du rôle_sec_4'!Y39","v":0},null,0,0,null,0,null,8,0.85,null,{"$f":"'Sommaire du rôle_sec_4'!Z39","v":0},{"$f":"'Sommaire du rôle_sec_4'!AA39","v":0},null,0,0,null,0]
[9,1,null,{"$f":"'Sommaire du rôle_sec_4'!H40","v":0},{"$f":"'Sommaire du rôle_sec_4'!I40","v":0},null,0,0,null,0,null,9,1,null,{"$f":"'Sommaire du rôle_sec_4'!J40","v":0},{"$f":"'Sommaire du rôle_sec_4'!K40","v":0},null,0,0,null,0,null,9,1,null,{"$f":"'Sommaire du rôle_sec_4'!L40","v":0},{"$f":"'Sommaire du rôle_sec_4'!M40","v":0},null,0,0,null,0,null,9,1,null,{"$f":"'Sommaire du rôle_sec_4'!N40","v":0},{"$f":"'Sommaire du rôle_sec_4'!O40","v":0},null,0,0,null,0,null,9,1,null,{"$f":"'Sommaire du rôle_sec_4'!P40","v":0},{"$f":"'Sommaire du rôle_sec_4'!Q40","v":0},null,0,0,null,0,null,9,1,null,{"$f":"'Sommaire du rôle_sec_4'!R40","v":0},{"$f":"'Sommaire du rôle_sec_4'!S40","v":0},null,0,0,null,0,null,9,1,null,{"$f":"'Sommaire du rôle_sec_4'!T40","v":0},{"$f":"'Sommaire du rôle_sec_4'!U40","v":0},null,0,0,null,0,null,9,1,null,{"$f":"'Sommaire du rôle_sec_4'!V40","v":0},{"$f":"'Sommaire du rôle_sec_4'!W40","v":0},null,0,0,null,0,null,9,1,null,{"$f":"'Sommaire du rôle_sec_4'!X40","v":0},{"$f":"'Sommaire du rôle_sec_4'!Y40","v":0},null,0,0,null,0,null,9,1,null,{"$f":"'Sommaire du rôle_sec_4'!Z40","v":0},{"$f":"'Sommaire du rôle_sec_4'!AA40","v":0},null,0,0,null,0]
[10,1,null,{"$f":"'Sommaire du rôle_sec_4'!H41","v":0},{"$f":"'Sommaire du rôle_sec_4'!I41","v":0},null,0,0,null,0,null,10,1,null,{"$f":"'Sommaire du rôle_sec_4'!J41","v":0},{"$f":"'Sommaire du rôle_sec_4'!K41","v":0},null,0,0,null,0,null,10,1,null,{"$f":"'Sommaire du rôle_sec_4'!L41","v":0},{"$f":"'Sommaire du rôle_sec_4'!M41","v":0},null,0,0,null,0,null,10,1,null,{"$f":"'Sommaire du rôle_sec_4'!N41","v":0},{"$f":"'Sommaire du rôle_sec_4'!O41","v":0},null,0,0,null,0,null,10,1,null,{"$f":"'Sommaire du rôle_sec_4'!P41","v":0},{"$f":"'Sommaire du rôle_sec_4'!Q41","v":0},null,0,0,null,0,null,10,1,null,{"$f":"'Sommaire du rôle_sec_4'!R41","v":0},{"$f":"'Sommaire du rôle_sec_4'!S41","v":0},null,0,0,null,0,null,10,1,null,{"$f":"'Sommaire du rôle_sec_4'!T41","v":0},{"$f":"'Sommaire du rôle_sec_4'!U41","v":0},null,0,0,null,0,null,10,1,null,{"$f":"'Sommaire du rôle_sec_4'!V41","v":0},{"$f":"'Sommaire du rôle_sec_4'!W41","v":0},null,0,0,null,0,null,10,1,null,{"$f":"'Sommaire du rôle_sec_4'!X41","v":0},{"$f":"'Sommaire du rôle_sec_4'!Y41","v":0},null,0,0,null,0,null,10,1,null,{"$f":"'Sommaire du rôle_sec_4'!Z41","v":0},{"$f":"'Sommaire du rôle_sec_4'!AA41","v":0},null,0,0,null,0]
["11 Cours de triage","100%",null,{"$f":"'Sommaire du rôle_sec_4'!H42","v":0},{"$f":"'Sommaire du rôle_sec_4'!I42","v":0},null,0,0,null,0,null,"11 Cours de triage","100%",null,{"$f":"'Sommaire du rôle_sec_4'!J42","v":0},{"$f":"'Sommaire du rôle_sec_4'!K42","v":0},null,0,0,null,0,null,"11 Cours de triage","100%",null,{"$f":"'Sommaire du rôle_sec_4'!L42","v":0},{"$f":"'Sommaire du rôle_sec_4'!M42","v":0},null,0,0,null,0,null,"11 Cours de triage","100%",null,{"$f":"'Sommaire du rôle_sec_4'!N42","v":0},{"$f":"'Sommaire du rôle_sec_4'!O42","v":0},null,0,0,null,0,null,"11 Cours de triage","100%",null,{"$f":"'Sommaire du rôle_sec_4'!P42","v":0},{"$f":"'Sommaire du rôle_sec_4'!Q42","v":0},null,0,0,null,0,null,"11 Cours de triage","100%",null,{"$f":"'Sommaire du rôle_sec_4'!R42","v":0},{"$f":"'Sommaire du rôle_sec_4'!S42","v":0},null,0,0,null,0,null,"11 Cours de triage","100%",null,{"$f":"'Sommaire du rôle_sec_4'!T42","v":0},{"$f":"'Sommaire du rôle_sec_4'!U42","v":0},null,0,0,null,0,null,"11 Cours de triage","100%",null,{"$f":"'Sommaire du rôle_sec_4'!V42","v":0},{"$f":"'Sommaire du rôle_sec_4'!W42","v":0},null,0,0,null,0,null,"11 Cours de triage","100%",null,{"$f":"'Sommaire du rôle_sec_4'!X42","v":0},{"$f":"'Sommaire du rôle_sec_4'!Y42","v":0},null,0,0,null,0,null,"11 Cours de triage","100%",null,{"$f":"'Sommaire du rôle_sec_4'!Z42","v":0},{"$f":"'Sommaire du rôle_sec_4'!AA42","v":0},null,0,0,null,0]
["12 CHSLD",0.2,null,{"$f":"'Sommaire du rôle_sec_4'!H43","v":0},null,null,0,null,null,0,null,"12 CHSLD",0.2,null,{"$f":"'Sommaire du rôle_sec_4'!J43","v":0},null,null,0,null,null,0,null,"12 CHSLD",0.2,null,{"$f":"'Sommaire du rôle_sec_4'!L43","v":0},null,null,0,null,null,0,null,"12 CHSLD",0.2,null,{"$f":"'Sommaire du rôle_sec_4'!N43","v":0},null,null,0,null,null,0,null,"12 CHSLD",0.2,null,{"$f":"'Sommaire du rôle_sec_4'!P43","v":0},null,null,0,null,null,0,null,"12 CHSLD",0.2,null,{"$f":"'Sommaire du rôle_sec_4'!R43","v":0},null,null,0,null,null,0,null,"12 CHSLD",0.2,null,{"$f":"'Sommaire du rôle_sec_4'!T43","v":0},null,null,0,null,null,0,null,"12 CHSLD",0.2,null,{"$f":"'Sommaire du rôle_sec_4'!V43","v":0},null,null,0,null,null,0,null,"12 CHSLD",0.2,null,{"$f":"'Sommaire du rôle_sec_4'!X43","v":0},null,null,0,null,null,0,null,"12 CHSLD",0.2,null,{"$f":"'Sommaire du rôle_sec_4'!Z43","v":0},null,null,0,null,null,0]
["13 Cours de triage 40 %","40%",null,{"$f":"'Sommaire du rôle_sec_4'!H44","v":0},null,null,0,null,null,0,null,"13 Cours de triage 40 %","40%",null,{"$f":"'Sommaire du rôle_sec_4'!J44","v":0},null,null,0,null,null,0,null,"13 Cours de triage 40 %","40%",null,{"$f":"'Sommaire du rôle_sec_4'!L44","v":0},null,null,0,null,null,0,null,"13 Cours de triage 40 %","40%",null,{"$f":"'Sommaire du rôle_sec_4'!N44","v":0},null,null,0,null,null,0,null,"13 Cours de triage 40 %","40%",null,{"$f":"'Sommaire du rôle_sec_4'!P44","v":0},null,null,0,null,null,0,null,"13 Cours de triage 40 %","40%",null,{"$f":"'Sommaire du rôle_sec_4'!R44","v":0},null,null,0,null,null,0,null,"13 Cours de triage 40 %","40%",null,{"$f":"'Sommaire du rôle_sec_4'!T44","v":0},null,null,0,null,null,0,null,"13 Cours de triage 40 %","40%",null,{"$f":"'Sommaire du rôle_sec_4'!V44","v":0},null,null,0,null,null,0,null,"13 Cours de triage 40 %","40%",null,{"$f":"'Sommaire du rôle_sec_4'!X44","v":0},null,null,0,null,null,0,null,"13 Cours de triage 40 %","40%",null,{"$f":"'Sommaire du rôle_sec_4'!Z44","v":0},null,null,0,null,null,0]
[" APPLICATION DU TNR QUAND TTVD",1,null,{"$f":"'Sommaire du rôle_sec_4'!H45","v":0},{"$f":"'Sommaire du rôle_sec_4'!I45","v":0},null,0,{"$f":"B121*E121","v":0},null,0,null," APPLICATION DU TNR QUAND TTVD",1,null,{"$f":"'Sommaire du rôle_sec_4'!J45","v":0},{"$f":"'Sommaire du rôle_sec_4'!K45","v":0},null,0,{"$f":"M121*P121","v":0},null,0,null," APPLICATION DU TNR QUAND TTVD",1,null,{"$f":"'Sommaire du rôle_sec_4'!L45","v":0},{"$f":"'Sommaire du rôle_sec_4'!M45","v":0},null,0,{"$f":"X121*AA121","v":0},null,0,null," APPLICATION DU TNR QUAND TTVD",1,null,{"$f":"'Sommaire du rôle_sec_4'!N45","v":0},{"$f":"'Sommaire du rôle_sec_4'!O45","v":0},null,0,{"$f":"AI121*AL121","v":0},null,0,null," APPLICATION DU TNR QUAND TTVD",1,null,{"$f":"'Sommaire du rôle_sec_4'!P45","v":0},{"$f":"'Sommaire du rôle_sec_4'!Q45","v":0},null,0,{"$f":"AT121*AW121","v":0},null,0,null," APPLICATION DU TNR QUAND TTVD",1,null,{"$f":"'Sommaire du rôle_sec_4'!R45","v":0},{"$f":"'Sommaire du rôle_sec_4'!S45","v":0},null,0,{"$f":"BE121*BH121","v":0},null,0,null," APPLICATION DU TNR QUAND TTVD",1,null,{"$f":"'Sommaire du rôle_sec_4'!T45","v":0},{"$f":"'Sommaire du rôle_sec_4'!U45","v":0},null,0,{"$f":"BP121*BS121","v":0},null,0,null," APPLICATION DU TNR QUAND TTVD",1,null,{"$f":"'Sommaire du rôle_sec_4'!AE45","v":0},{"$f":"'Sommaire du rôle_sec_4'!AF45","v":0},null,0,{"$f":"CA121*CD121","v":0},null,0,null," APPLICATION DU TNR QUAND TTVD",1,null,{"$f":"'Sommaire du rôle_sec_4'!X45","v":0},{"$f":"'Sommaire du rôle_sec_4'!Y45","v":0},null,0,{"$f":"CL121*CO121","v":0},null,0,null," APPLICATION DU TNR QUAND TTVD",1,null,{"$f":"'Sommaire du rôle_sec_4'!Z45","v":0},{"$f":"'Sommaire du rôle_sec_4'!AA45","v":0},null,0,{"$f":"CW121*CZ121","v":0},null,0]
["Total",null,null,null,null,null,{"$f":"SUM(G106:G121)","v":0},{"$f":"SUM(H106:H121)","v":0},null,0,null,"Total",null,null,null,null,null,{"$f":"SUM(R106:R121)","v":0},{"$f":"SUM(S106:S121)","v":0},null,0,null,"Total",null,null,null,null,null,{"$f":"SUM(AC106:AC121)","v":0},{"$f":"SUM(AD106:AD121)","v":0},null,0,null,"Total",null,null,null,null,null,{"$f":"SUM(AN106:AN121)","v":0},{"$f":"SUM(AO106:AO121)","v":0},null,0,null,"Total",null,null,null,null,null,{"$f":"SUM(AY106:AY121)","v":0},{"$f":"SUM(AZ106:AZ121)","v":0},null,0,null,"Total",null,null,null,null,null,{"$f":"SUM(BJ106:BJ121)","v":0},{"$f":"SUM(BK106:BK121)","v":0},null,0,null,"Total",null,null,null,null,null,{"$f":"SUM(BU106:BU121)","v":0},{"$f":"SUM(BV106:BV121)","v":0},null,0,null,"Total",null,null,null,null,null,{"$f":"SUM(CF106:CF121)","v":0},{"$f":"SUM(CG106:CG121)","v":0},null,0,null,"Total",null,null,null,null,null,{"$f":"SUM(CQ106:CQ121)","v":0},{"$f":"SUM(CR106:CR121)","v":0},null,0,null,"Total",null,null,null,null,null,{"$f":"SUM(DB106:DB121)","v":0},{"$f":"SUM(DC106:DC121)","v":0},null,0]
[]
["ASSIETTE SOUS-CATÉGORIE RÉSIDUELLE"]
["Classe non résidentielle","Pourcentage de taxation",null,"VALEUR À 100 %"]
[null,null,null,"  Imposables","Compensables",null,"Imposables pondérées","Compensables pondérées",null,"Total"]
[null,"(1)",null,"(2)","(3)",null,"(4) = (1) X (2)","(5) = (1) X (3)",null,"(6) = (4) + (5)"]
[" 1A",0.999,null,{"$f":"'Sommaire du rôle_sec_4'!F53","v":0},{"$f":"'Sommaire du rôle_sec_4'!G53","v":0},null,{"$f":"D128*B128","v":0},{"$f":"B128*E128","v":0},null,{"$f":"G128+H128","v":0},2359638]
[" 1B",0.995,null,{"$f":"'Sommaire du rôle_sec_4'!F54","v":0},{"$f":"'Sommaire du rôle_sec_4'!G54","v":0},null,0,0,null,0,670132.5]
[" 1C",0.99,null,{"$f":"'Sommaire du rôle_sec_4'!F55","v":0},{"$f":"'Sommaire du rôle_sec_4'!G55","v":0},null,0,0,null,0,4405005]
[2,0.97,null,{"$f":"'Sommaire du rôle_sec_4'!F56","v":0},{"$f":"'Sommaire du rôle_sec_4'!G56","v":0},null,0,0,null,0,21413332]
[3,0.94,null,{"$f":"'Sommaire du rôle_sec_4'!F57","v":0},{"$f":"'Sommaire du rôle_sec_4'!G57","v":0},null,0,0,null,0,36190282]
[4,0.88,null,{"$f":"'Sommaire du rôle_sec_4'!F58","v":0},{"$f":"'Sommaire du rôle_sec_4'!G58","v":0},null,0,0,null,0,27846104]
[5,0.78,null,{"$f":"'Sommaire du rôle_sec_4'!F59","v":0},{"$f":"'Sommaire du rôle_sec_4'!G59","v":0},null,0,0,null,0,22550424]
[6,0.6,null,{"$f":"'Sommaire du rôle_sec_4'!F60","v":0},{"$f":"'Sommaire du rôle_sec_4'!G60","v":0},null,0,0,null,0,19039560]
[7,0.4,null,{"$f":"'Sommaire du rôle_sec_4'!F61","v":0},{"$f":"'Sommaire du rôle_sec_4'!G61","v":0},null,0,0,null,0,37782600]
[8,0.15000000000000002,null,{"$f":"'Sommaire du rôle_sec_4'!F62","v":0},{"$f":"'Sommaire du rôle_sec_4'!G62","v":0},null,0,0,null,0,32037030.000000004]
["IMMEUBLES SANS PARTIE NON RÉSIDENTIELLE",1,null,{"$f":"'Sommaire du rôle_sec_4'!F63","v":0},{"$f":"'Sommaire du rôle_sec_4'!G63","v":0},null,0,0,null,0,7336485128]
["12  CHSLD",0.8,null,{"$f":"'Sommaire du rôle_sec_4'!F64","v":0},{"$f":"'Sommaire du rôle_sec_4'!G64","v":0},null,0]
["13 Cours de triage ",0.6,null,{"$f":"'Sommaire du rôle_sec_4'!F65","v":0},{"$f":"'Sommaire du rôle_sec_4'!G65","v":0},null,0]
["Total",null,null,null,null,null,{"$f":"SUM(G128:G140)","v":0},{"$f":"SUM(H128:H138)","v":0},{"$f":"SUM(I128:I138)","v":0},{"$f":"G141+H141","v":0}]
[]
["ASSIETTE AU TAUX RÉSIDENTIEL SOUS-CATÉGORIE 1",null,null,null,null,null,null,null,null,null,null,"ASSIETTE AU TAUX RÉSIDENTIEL SOUS-CATÉGORIE 2",null,null,null,null,null,null,null,null,null,null,"ASSIETTE AU TAUX RÉSIDENTIEL SOUS-CATÉGORIE 3",null,null,null,null,null,null,null,null,null,null,"ASSIETTE AU TAUX RÉSIDENTIEL SOUS-CATÉGORIE 4",null,null,null,null,null,null,null,null,null,null,"ASSIETTE AU TAUX RÉSIDENTIEL SOUS-CATÉGORIE 5",null,null,null,null,null,null,null,null,null,null,"ASSIETTE AU TAUX RÉSIDENTIEL SOUS-CATÉGORIE 6",null,null,null,null,null,null,null,null,null,null,"ASSIETTE AU TAUX RÉSIDENTIEL SOUS-CATÉGORIE 7",null,null,null,null,null,null,null,null,null,null,"ASSIETTE AU TAUX RÉSIDENTIEL SOUS-CATÉGORIE 8",null,null,null,null,null,null,null,null,null,null,"ASSIETTE AU TAUX RÉSIDENTIEL SOUS-CATÉGORIE 9",null,null,null,null,null,null,null,null,null,null,"ASSIETTE AU TAUX RÉSIDENTIEL SOUS-CATÉGORIE 10"]
["Classe non résidentielle","Pourcentage de taxation",null,"VALEUR À 100 %",null,null,null,null,null,null,null,"Classe non résidentielle","Pourcentage de taxation",null,"VALEUR À 100 %",null,null,null,null,null,null,null,"Classe non résidentielle","Pourcentage de taxation",null,"VALEUR À 100 %",null,null,null,null,null,null,null,"Classe non résidentielle","Pourcentage de taxation",null,"VALEUR À 100 %",null,null,null,null,null,null,null,"Classe non résidentielle","Pourcentage de taxation",null,"VALEUR À 100 %",null,null,null,null,null,null,null,"Classe non résidentielle","Pourcentage de taxation",null,"VALEUR À 100 %",null,null,null,null,null,null,null,"Classe non résidentielle","Pourcentage de taxation",null,"VALEUR À 100 %",null,null,null,null,null,null,null,"Classe non résidentielle","Pourcentage de taxation",null,"VALEUR À 100 %",null,null,null,null,null,null,null,"Classe non résidentielle","Pourcentage de taxation",null,"VALEUR À 100 %",null,null,null,null,null,null,null,"Classe non résidentielle","Pourcentage de taxation",null,"VALEUR À 100 %"]
[null,null,null,"  Imposables","Compensables",null,"Imposables pondérées","Compensables pondérées",null,"Total",null,null,null,null,"  Imposables","Compensables",null,"Imposables pondérées","Compensables pondérées",null,"Total",null,null,null,null,"  Imposables","Compensables",null,"Imposables pondérées","Compensables pondérées",null,"Total",null,null,null,null,"  Imposables","Compensables",null,"Imposables pondérées","Compensables pondérées",null,"Total",null,null,null,null,"  Imposables","Compensables",null,"Imposables pondérées","Compensables pondérées",null,"Total",null,null,null,null,"  Imposables","Compensables",null,"Imposables pondérées","Compensables pondérées",null,"Total",null,null,null,null,"  Imposables","Compensables",null,"Imposables pondérées","Compensables pondérées",null,"Total",null,null,null,null,"  Imposables","Compensables",null,"Imposables pondérées","Compensables pondérées",null,"Total",null,null,null,null,"  Imposables","Compensables",null,"Imposables pondérées","Compensables pondérées",null,"Total",null,null,null,null,"  Imposables","Compensables",null,"Imposables pondérées","Compensables pondérées",null,"Total"]
[null,"(1)",null,"(2)","(3)",null,"(4) = (1) X (2)","(5) = (1) X (3)",null,"(6) = (4) + (5)",null,null,"(1)",null,"(2)","(3)",null,"(4) = (1) X (2)","(5) = (1) X (3)",null,"(6) = (4) + (5)",null,null,"(1)",null,"(2)","(3)",null,"(4) = (1) X (2)","(5) = (1) X (3)",null,"(6) = (4) + (5)",null,null,"(1)",null,"(2)","(3)",null,"(4) = (1) X (2)","(5) = (1) X (3)",null,"(6) = (4) + (5)",null,null,"(1)",null,"(2)","(3)",null,"(4) = (1) X (2)","(5) = (1) X (3)",null,"(6) = (4) + (5)",null,null,"(1)",null,"(2)","(3)",null,"(4) = (1) X (2)","(5) = (1) X (3)",null,"(6) = (4) + (5)",null,null,"(1)",null,"(2)","(3)",null,"(4) = (1) X (2)","(5) = (1) X (3)",null,"(6) = (4) + (5)",null,null,"(1)",null,"(2)","(3)",null,"(4) = (1) X (2)","(5) = (1) X (3)",null,"(6) = (4) + (5)",null,null,"(1)",null,"(2)","(3)",null,"(4) = (1) X (2)","(5) = (1) X (3)",null,"(6) = (4) + (5)",null,null,"(1)",null,"(2)","(3)",null,"(4) = (1) X (2)","(5) = (1) X (3)",null,"(6) = (4) + (5)"]
[" 1A",0.999,null,{"$f":"'Sommaire du rôle_sec_4'!H53","v":0},{"$f":"'Sommaire du rôle_sec_4'!I53","v":0},null,{"$f":"D147*B147","v":0},{"$f":"B147*E147","v":0},null,{"$f":"G147+H147","v":0},null," 1A",0.999,null,{"$f":"'Sommaire du rôle_sec_4'!J53","v":0},{"$f":"'Sommaire du rôle_sec_4'!K53","v":0},null,{"$f":"O147*M147","v":0},{"$f":"M147*P147","v":0},null,{"$f":"R147+S147","v":0},null," 1A",0.999,null,{"$f":"'Sommaire du rôle_sec_4'!L53","v":0},{"$f":"'Sommaire du rôle_sec_4'!M53","v":0},null,{"$f":"Z147*X147","v":0},{"$f":"X147*AA147","v":0},null,{"$f":"AC147+AD147","v":0},null," 1A",0.999,null,{"$f":"'Sommaire du rôle_sec_4'!N53","v":0},{"$f":"'Sommaire du rôle_sec_4'!O53","v":0},null,{"$f":"AK147*AI147","v":0},{"$f":"AI147*AL147","v":0},null,{"$f":"AN147+AO147","v":0},null," 1A",0.999,null,{"$f":"'Sommaire du rôle_sec_4'!P53","v":0},{"$f":"'Sommaire du rôle_sec_4'!Q53","v":0},null,{"$f":"AV147*AT147","v":0},{"$f":"AT147*AW147","v":0},null,{"$f":"AY147+AZ147","v":0},null," 1A",0.999,null,{"$f":"'Sommaire du rôle_sec_4'!R53","v":0},{"$f":"'Sommaire du rôle_sec_4'!S53","v":0},null,{"$f":"BG147*BE147","v":0},{"$f":"BE147*BH147","v":0},null,{"$f":"BJ147+BK147","v":0},null," 1A",0.999,null,{"$f":"'Sommaire du rôle_sec_4'!T53","v":0},{"$f":"'Sommaire du rôle_sec_4'!U53","v":0},null,{"$f":"BR147*BP147","v":0},{"$f":"BP147*BS147","v":0},null,{"$f":"BU147+BV147","v":0},null," 1A",0.999,null,{"$f":"'Sommaire du rôle_sec_4'!V53","v":0},{"$f":"'Sommaire du rôle_sec_4'!W53","v":0},null,{"$f":"CC147*CA147","v":0},{"$f":"CA147*CD147","v":0},null,{"$f":"CF147+CG147","v":0},null," 1A",0.999,null,{"$f":"'Sommaire du rôle_sec_4'!X53","v":0},{"$f":"'Sommaire du rôle_sec_4'!Y53","v":0},null,{"$f":"CN147*CL147","v":0},{"$f":"CL147*CO147","v":0},null,{"$f":"CQ147+CR147","v":0},null," 1A",0.999,null,{"$f":"'Sommaire du rôle_sec_4'!Z53","v":0},{"$f":"'Sommaire du rôle_sec_4'!AA53","v":0},null,{"$f":"CY147*CW147","v":0},{"$f":"CW147*CZ147","v":0},null,{"$f":"DB147+DC147","v":0}]
[" 1B",0.995,null,{"$f":"'Sommaire du rôle_sec_4'!H54","v":0},{"$f":"'Sommaire du rôle_sec_4'!I54","v":0},null,0,0,null,0,null," 1B",0.995,null,{"$f":"'Sommaire du rôle_sec_4'!J54","v":0},{"$f":"'Sommaire du rôle_sec_4'!K54","v":0},null,0,0,null,0,null," 1B",0.995,null,{"$f":"'Sommaire du rôle_sec_4'!L54","v":0},{"$f":"'Sommaire du rôle_sec_4'!M54","v":0},null,0,0,null,0,null," 1B",0.995,null,{"$f":"'Sommaire du rôle_sec_4'!N54","v":0},{"$f":"'Sommaire du rôle_sec_4'!O54","v":0},null,0,0,null,0,null," 1B",0.995,null,{"$f":"'Sommaire du rôle_sec_4'!P54","v":0},{"$f":"'Sommaire du rôle_sec_4'!Q54","v":0},null,0,0,null,0,null," 1B",0.995,null,{"$f":"'Sommaire du rôle_sec_4'!R54","v":0},{"$f":"'Sommaire du rôle_sec_4'!S54","v":0},null,0,0,null,0,null," 1B",0.995,null,{"$f":"'Sommaire du rôle_sec_4'!T54","v":0},{"$f":"'Sommaire du rôle_sec_4'!U54","v":0},null,0,0,null,0,null," 1B",0.995,null,{"$f":"'Sommaire du rôle_sec_4'!V54","v":0},{"$f":"'Sommaire du rôle_sec_4'!W54","v":0},null,0,0,null,0,null," 1B",0.995,null,{"$f":"'Sommaire du rôle_sec_4'!X54","v":0},{"$f":"'Sommaire du rôle_sec_4'!Y54","v":0},null,0,0,null,0,null," 1B",0.995,null,{"$f":"'Sommaire du rôle_sec_4'!Z54","v":0},{"$f":"'Sommaire du rôle_sec_4'!AA54","v":0},null,0,0,null,0]
[" 1C",0.99,null,{"$f":"'Sommaire du rôle_sec_4'!H55","v":0},{"$f":"'Sommaire du rôle_sec_4'!I55","v":0},null,0,0,null,0,null," 1C",0.99,null,{"$f":"'Sommaire du rôle_sec_4'!J55","v":0},{"$f":"'Sommaire du rôle_sec_4'!K55","v":0},null,0,0,null,0,null," 1C",0.99,null,{"$f":"'Sommaire du rôle_sec_4'!L55","v":0},{"$f":"'Sommaire du rôle_sec_4'!M55","v":0},null,0,0,null,0,null," 1C",0.99,null,{"$f":"'Sommaire du rôle_sec_4'!N55","v":0},{"$f":"'Sommaire du rôle_sec_4'!O55","v":0},null,0,0,null,0,null," 1C",0.99,null,{"$f":"'Sommaire du rôle_sec_4'!P55","v":0},{"$f":"'Sommaire du rôle_sec_4'!Q55","v":0},null,0,0,null,0,null," 1C",0.99,null,{"$f":"'Sommaire du rôle_sec_4'!R55","v":0},{"$f":"'Sommaire du rôle_sec_4'!S55","v":0},null,0,0,null,0,null," 1C",0.99,null,{"$f":"'Sommaire du rôle_sec_4'!T55","v":0},{"$f":"'Sommaire du rôle_sec_4'!U55","v":0},null,0,0,null,0,null," 1C",0.99,null,{"$f":"'Sommaire du rôle_sec_4'!V55","v":0},{"$f":"'Sommaire du rôle_sec_4'!W55","v":0},null,0,0,null,0,null," 1C",0.99,null,{"$f":"'Sommaire du rôle_sec_4'!X55","v":0},{"$f":"'Sommaire du rôle_sec_4'!Y55","v":0},null,0,0,null,0,null," 1C",0.99,null,{"$f":"'Sommaire du rôle_sec_4'!Z55","v":0},{"$f":"'Sommaire du rôle_sec_4'!AA55","v":0},null,0,0,null,0]
[2,0.97,null,{"$f":"'Sommaire du rôle_sec_4'!H56","v":0},{"$f":"'Sommaire du rôle_sec_4'!I56","v":0},null,0,0,null,0,null,2,0.97,null,{"$f":"'Sommaire du rôle_sec_4'!J56","v":0},{"$f":"'Sommaire du rôle_sec_4'!K56","v":0},null,0,0,null,0,null,2,0.97,null,{"$f":"'Sommaire du rôle_sec_4'!L56","v":0},{"$f":"'Sommaire du rôle_sec_4'!M56","v":0},null,0,0,null,0,null,2,0.97,null,{"$f":"'Sommaire du rôle_sec_4'!N56","v":0},{"$f":"'Sommaire du rôle_sec_4'!O56","v":0},null,0,0,null,0,null,2,0.97,null,{"$f":"'Sommaire du rôle_sec_4'!P56","v":0},{"$f":"'Sommaire du rôle_sec_4'!Q56","v":0},null,0,0,null,0,null,2,0.97,null,{"$f":"'Sommaire du rôle_sec_4'!R56","v":0},{"$f":"'Sommaire du rôle_sec_4'!S56","v":0},null,0,0,null,0,null,2,0.97,null,{"$f":"'Sommaire du rôle_sec_4'!T56","v":0},{"$f":"'Sommaire du rôle_sec_4'!U56","v":0},null,0,0,null,0,null,2,0.97,null,{"$f":"'Sommaire du rôle_sec_4'!V56","v":0},{"$f":"'Sommaire du rôle_sec_4'!W56","v":0},null,0,0,null,0,null,2,0.97,null,{"$f":"'Sommaire du rôle_sec_4'!X56","v":0},{"$f":"'Sommaire du rôle_sec_4'!Y56","v":0},null,0,0,null,0,null,2,0.97,null,{"$f":"'Sommaire du rôle_sec_4'!Z56","v":0},{"$f":"'Sommaire du rôle_sec_4'!AA56","v":0},null,0,0,null,0]
[3,0.94,null,{"$f":"'Sommaire du rôle_sec_4'!H57","v":0},{"$f":"'Sommaire du rôle_sec_4'!I57","v":0},null,0,0,null,0,null,3,0.94,null,{"$f":"'Sommaire du rôle_sec_4'!J57","v":0},{"$f":"'Sommaire du rôle_sec_4'!K57","v":0},null,0,0,null,0,null,3,0.94,null,{"$f":"'Sommaire du rôle_sec_4'!L57","v":0},{"$f":"'Sommaire du rôle_sec_4'!M57","v":0},null,0,0,null,0,null,3,0.94,null,{"$f":"'Sommaire du rôle_sec_4'!N57","v":0},{"$f":"'Sommaire du rôle_sec_4'!O57","v":0},null,0,0,null,0,null,3,0.94,null,{"$f":"'Sommaire du rôle_sec_4'!P57","v":0},{"$f":"'Sommaire du rôle_sec_4'!Q57","v":0},null,0,0,null,0,null,3,0.94,null,{"$f":"'Sommaire du rôle_sec_4'!R57","v":0},{"$f":"'Sommaire du rôle_sec_4'!S57","v":0},null,0,0,null,0,null,3,0.94,null,{"$f":"'Sommaire du rôle_sec_4'!T57","v":0},{"$f":"'Sommaire du rôle_sec_4'!U57","v":0},null,0,0,null,0,null,3,0.94,null,{"$f":"'Sommaire du rôle_sec_4'!V57","v":0},{"$f":"'Sommaire du rôle_sec_4'!W57","v":0},null,0,0,null,0,null,3,0.94,null,{"$f":"'Sommaire du rôle_sec_4'!X57","v":0},{"$f":"'Sommaire du rôle_sec_4'!Y57","v":0},null,0,0,null,0,null,3,0.94,null,{"$f":"'Sommaire du rôle_sec_4'!Z57","v":0},{"$f":"'Sommaire du rôle_sec_4'!AA57","v":0},null,0,0,null,0]
[4,0.88,null,{"$f":"'Sommaire du rôle_sec_4'!H58","v":0},{"$f":"'Sommaire du rôle_sec_4'!I58","v":0},null,0,0,null,0,null,4,0.88,null,{"$f":"'Sommaire du rôle_sec_4'!J58","v":0},{"$f":"'Sommaire du rôle_sec_4'!K58","v":0},null,0,0,null,0,null,4,0.88,null,{"$f":"'Sommaire du rôle_sec_4'!L58","v":0},{"$f":"'Sommaire du rôle_sec_4'!M58","v":0},null,0,0,null,0,null,4,0.88,null,{"$f":"'Sommaire du rôle_sec_4'!N58","v":0},{"$f":"'Sommaire du rôle_sec_4'!O58","v":0},null,0,0,null,0,null,4,0.88,null,{"$f":"'Sommaire du rôle_sec_4'!P58","v":0},{"$f":"'Sommaire du rôle_sec_4'!Q58","v":0},null,0,0,null,0,null,4,0.88,null,{"$f":"'Sommaire du rôle_sec_4'!R58","v":0},{"$f":"'Sommaire du rôle_sec_4'!S58","v":0},null,0,0,null,0,null,4,0.88,null,{"$f":"'Sommaire du rôle_sec_4'!T58","v":0},{"$f":"'Sommaire du rôle_sec_4'!U58","v":0},null,0,0,null,0,null,4,0.88,null,{"$f":"'Sommaire du rôle_sec_4'!V58","v":0},{"$f":"'Sommaire du rôle_sec_4'!W58","v":0},null,0,0,null,0,null,4,0.88,null,{"$f":"'Sommaire du rôle_sec_4'!X58","v":0},{"$f":"'Sommaire du rôle_sec_4'!Y58","v":0},null,0,0,null,0,null,4,0.88,null,{"$f":"'Sommaire du rôle_sec_4'!Z58","v":0},{"$f":"'Sommaire du rôle_sec_4'!AA58","v":0},null,0,0,null,0]
[5,0.78,null,{"$f":"'Sommaire du rôle_sec_4'!H59","v":0},{"$f":"'Sommaire du rôle_sec_4'!I59","v":0},null,0,0,null,0,null,5,0.78,null,{"$f":"'Sommaire du rôle_sec_4'!J59","v":0},{"$f":"'Sommaire du rôle_sec_4'!K59","v":0},null,0,0,null,0,null,5,0.78,null,{"$f":"'Sommaire du rôle_sec_4'!L59","v":0},{"$f":"'Sommaire du rôle_sec_4'!M59","v":0},null,0,0,null,0,null,5,0.78,null,{"$f":"'Sommaire du rôle_sec_4'!N59","v":0},{"$f":"'Sommaire du rôle_sec_4'!O59","v":0},null,0,0,null,0,null,5,0.78,null,{"$f":"'Sommaire du rôle_sec_4'!P59","v":0},{"$f":"'Sommaire du rôle_sec_4'!Q59","v":0},null,0,0,null,0,null,5,0.78,null,{"$f":"'Sommaire du rôle_sec_4'!R59","v":0},{"$f":"'Sommaire du rôle_sec_4'!S59","v":0},null,0,0,null,0,null,5,0.78,null,{"$f":"'Sommaire du rôle_sec_4'!T59","v":0},{"$f":"'Sommaire du rôle_sec_4'!U59","v":0},null,0,0,null,0,null,5,0.78,null,{"$f":"'Sommaire du rôle_sec_4'!V59","v":0},{"$f":"'Sommaire du rôle_sec_4'!W59","v":0},null,0,0,null,0,null,5,0.78,null,{"$f":"'Sommaire du rôle_sec_4'!X59","v":0},{"$f":"'Sommaire du rôle_sec_4'!Y59","v":0},null,0,0,null,0,null,5,0.78,null,{"$f":"'Sommaire du rôle_sec_4'!Z59","v":0},{"$f":"'Sommaire du rôle_sec_4'!AA59","v":0},null,0,0,null,0]
[6,0.6,null,{"$f":"'Sommaire du rôle_sec_4'!H60","v":0},{"$f":"'Sommaire du rôle_sec_4'!I60","v":0},null,0,0,null,0,null,6,0.6,null,{"$f":"'Sommaire du rôle_sec_4'!J60","v":0},{"$f":"'Sommaire du rôle_sec_4'!K60","v":0},null,0,0,null,0,null,6,0.6,null,{"$f":"'Sommaire du rôle_sec_4'!L60","v":0},{"$f":"'Sommaire du rôle_sec_4'!M60","v":0},null,0,0,null,0,null,6,0.6,null,{"$f":"'Sommaire du rôle_sec_4'!N60","v":0},{"$f":"'Sommaire du rôle_sec_4'!O60","v":0},null,0,0,null,0,null,6,0.6,null,{"$f":"'Sommaire du rôle_sec_4'!P60","v":0},{"$f":"'Sommaire du rôle_sec_4'!Q60","v":0},null,0,0,null,0,null,6,0.6,null,{"$f":"'Sommaire du rôle_sec_4'!R60","v":0},{"$f":"'Sommaire du rôle_sec_4'!S60","v":0},null,0,0,null,0,null,6,0.6,null,{"$f":"'Sommaire du rôle_sec_4'!T60","v":0},{"$f":"'Sommaire du rôle_sec_4'!U60","v":0},null,0,0,null,0,null,6,0.6,null,{"$f":"'Sommaire du rôle_sec_4'!V60","v":0},{"$f":"'Sommaire du rôle_sec_4'!W60","v":0},null,0,0,null,0,null,6,0.6,null,{"$f":"'Sommaire du rôle_sec_4'!X60","v":0},{"$f":"'Sommaire du rôle_sec_4'!Y60","v":0},null,0,0,null,0,null,6,0.6,null,{"$f":"'Sommaire du rôle_sec_4'!Z60","v":0},{"$f":"'Sommaire du rôle_sec_4'!AA60","v":0},null,0,0,null,0]
[7,0.4,null,{"$f":"'Sommaire du rôle_sec_4'!H61","v":0},{"$f":"'Sommaire du rôle_sec_4'!I61","v":0},null,0,0,null,0,null,7,0.4,null,{"$f":"'Sommaire du rôle_sec_4'!J61","v":0},{"$f":"'Sommaire du rôle_sec_4'!K61","v":0},null,0,0,null,0,null,7,0.4,null,{"$f":"'Sommaire du rôle_sec_4'!L61","v":0},{"$f":"'Sommaire du rôle_sec_4'!M61","v":0},null,0,0,null,0,null,7,0.4,null,{"$f":"'Sommaire du rôle_sec_4'!N61","v":0},{"$f":"'Sommaire du rôle_sec_4'!O61","v":0},null,0,0,null,0,null,7,0.4,null,{"$f":"'Sommaire du rôle_sec_4'!P61","v":0},{"$f":"'Sommaire du rôle_sec_4'!Q61","v":0},null,0,0,null,0,null,7,0.4,null,{"$f":"'Sommaire du rôle_sec_4'!R61","v":0},{"$f":"'Sommaire du rôle_sec_4'!S61","v":0},null,0,0,null,0,null,7,0.4,null,{"$f":"'Sommaire du rôle_sec_4'!T61","v":0},{"$f":"'Sommaire du rôle_sec_4'!U61","v":0},null,0,0,null,0,null,7,0.4,null,{"$f":"'Sommaire du rôle_sec_4'!V61","v":0},{"$f":"'Sommaire du rôle_sec_4'!W61","v":0},null,0,0,null,0,null,7,0.4,null,{"$f":"'Sommaire du rôle_sec_4'!X61","v":0},{"$f":"'Sommaire du rôle_sec_4'!Y61","v":0},null,0,0,null,0,null,7,0.4,null,{"$f":"'Sommaire du rôle_sec_4'!Z61","v":0},{"$f":"'Sommaire du rôle_sec_4'!AA61","v":0},null,0,0,null,0]
[8,0.15000000000000002,null,{"$f":"'Sommaire du rôle_sec_4'!H62","v":0},{"$f":"'Sommaire du rôle_sec_4'!I62","v":0},null,0,0,null,0,null,8,0.15000000000000002,null,{"$f":"'Sommaire du rôle_sec_4'!J62","v":0},{"$f":"'Sommaire du rôle_sec_4'!K62","v":0},null,0,0,null,0,null,8,0.15000000000000002,null,{"$f":"'Sommaire du rôle_sec_4'!L62","v":0},{"$f":"'Sommaire du rôle_sec_4'!M62","v":0},null,0,0,null,0,null,8,0.15000000000000002,null,{"$f":"'Sommaire du rôle_sec_4'!N62","v":0},{"$f":"'Sommaire du rôle_sec_4'!O62","v":0},null,0,0,null,0,null,8,0.15000000000000002,null,{"$f":"'Sommaire du rôle_sec_4'!P62","v":0},{"$f":"'Sommaire du rôle_sec_4'!Q62","v":0},null,0,0,null,0,null,8,0.15000000000000002,null,{"$f":"'Sommaire du rôle_sec_4'!R62","v":0},{"$f":"'Sommaire du rôle_sec_4'!S62","v":0},null,0,0,null,0,null,8,0.15000000000000002,null,{"$f":"'Sommaire du rôle_sec_4'!T62","v":0},{"$f":"'Sommaire du rôle_sec_4'!U62","v":0},null,0,0,null,0,null,8,0.15000000000000002,null,{"$f":"'Sommaire du rôle_sec_4'!V62","v":0},{"$f":"'Sommaire du rôle_sec_4'!W62","v":0},null,0,0,null,0,null,8,0.15000000000000002,null,{"$f":"'Sommaire du rôle_sec_4'!X62","v":0},{"$f":"'Sommaire du rôle_sec_4'!Y62","v":0},null,0,0,null,0,null,8,0.15000000000000002,null,{"$f":"'Sommaire du rôle_sec_4'!Z62","v":0},{"$f":"'Sommaire du rôle_sec_4'!AA62","v":0},null,0,0,null,0]
["IMMEUBLES SANS PARTIE NON RÉSIDENTIELLE",1,null,{"$f":"'Sommaire du rôle_sec_4'!H63","v":0},{"$f":"'Sommaire du rôle_sec_4'!I63","v":0},null,0,0,null,0,null,"IMMEUBLES SANS PARTIE NON RÉSIDENTIELLE",1,null,{"$f":"'Sommaire du rôle_sec_4'!J63","v":0},{"$f":"'Sommaire du rôle_sec_4'!K63","v":0},null,0,0,null,0,null,"IMMEUBLES SANS PARTIE NON RÉSIDENTIELLE",1,null,{"$f":"'Sommaire du rôle_sec_4'!L63","v":0},{"$f":"'Sommaire du rôle_sec_4'!M63","v":0},null,0,0,null,0,null,"IMMEUBLES SANS PARTIE NON RÉSIDENTIELLE",1,null,{"$f":"'Sommaire du rôle_sec_4'!N63","v":0},{"$f":"'Sommaire du rôle_sec_4'!O63","v":0},null,0,0,null,0,null,"IMMEUBLES SANS PARTIE NON RÉSIDENTIELLE",1,null,{"$f":"'Sommaire du rôle_sec_4'!P63","v":0},{"$f":"'Sommaire du rôle_sec_4'!Q63","v":0},null,0,0,null,0,null,"IMMEUBLES SANS PARTIE NON RÉSIDENTIELLE",1,null,{"$f":"'Sommaire du rôle_sec_4'!R63","v":0},{"$f":"'Sommaire du rôle_sec_4'!S63","v":0},null,0,0,null,0,null,"IMMEUBLES SANS PARTIE NON RÉSIDENTIELLE",1,null,{"$f":"'Sommaire du rôle_sec_4'!T63","v":0},{"$f":"'Sommaire du rôle_sec_4'!U63","v":0},null,0,0,null,0,null,"IMMEUBLES SANS PARTIE NON RÉSIDENTIELLE",1,null,{"$f":"'Sommaire du rôle_sec_4'!V63","v":0},{"$f":"'Sommaire du rôle_sec_4'!W63","v":0},null,0,0,null,0,null,"IMMEUBLES SANS PARTIE NON RÉSIDENTIELLE",1,null,{"$f":"'Sommaire du rôle_sec_4'!X63","v":0},{"$f":"'Sommaire du rôle_sec_4'!Y63","v":0},null,0,0,null,0,null,"IMMEUBLES SANS PARTIE NON RÉSIDENTIELLE",1,null,{"$f":"'Sommaire du rôle_sec_4'!Z63","v":0},{"$f":"'Sommaire du rôle_sec_4'!AA63","v":0},null,0,0,null,0]
["12  CHSLD",0.8,null,null,null,null,0,null,null,null,null,"12  CHSLD",0.8,null,null,null,null,0,null,null,null,null,"12  CHSLD",0.8,null,null,null,null,0,null,null,null,null,"12  CHSLD",0.8,null,null,null,null,0,null,null,null,null,"12  CHSLD",0.8,null,null,null,null,0,null,null,null,null,"12  CHSLD",0.8,null,null,null,null,0,null,null,null,null,"12  CHSLD",0.8,null,null,null,null,0,null,null,null,null,"12  CHSLD",0.8,null,null,null,null,0,null,null,null,null,"12  CHSLD",0.8,null,null,null,null,null,null,null,null,null,"12  CHSLD",0.8]
["13 Cours de triage ",0.6,null,null,null,null,0,null,null,null,null,"13 Cours de triage ",0.6,null,null,null,null,0,null,null,null,null,"13 Cours de triage ",0.6,null,null,null,null,0,null,null,null,null,"13 Cours de triage ",0.6,null,null,null,null,0,null,null,null,null,"13 Cours de triage ",0.6,null,null,null,null,0,null,null,null,null,"13 Cours de triage ",0.6,null,null,null,null,0,null,null,null,null,"13 Cours de triage ",0.6,null,null,null,null,0,null,null,null,null,"13 Cours de triage ",0.6,null,null,null,null,0,null,null,null,null,"13 Cours de triage ",0.6,null,null,null,null,null,null,null,null,null,"13 Cours de triage ",0.6]
["Total",null,null,null,null,null,{"$f":"SUM(G147:G159)","v":0},{"$f":"SUM(H147:H157)","v":0},{"$f":"SUM(I147:I157)","v":0},{"$f":"G160+H160","v":0},null,"Total",null,null,null,null,null,{"$f":"SUM(R147:R159)","v":0},{"$f":"SUM(S147:S157)","v":0},null,{"$f":"R160+S160","v":0},null,"Total",null,null,null,null,null,{"$f":"SUM(AC147:AC159)","v":0},{"$f":"SUM(AD147:AD157)","v":0},null,{"$f":"AC160+AD160","v":0},null,"Total",null,null,null,null,null,{"$f":"SUM(AN147:AN159)","v":0},{"$f":"SUM(AO147:AO157)","v":0},null,{"$f":"AN160+AO160","v":0},null,"Total",null,null,null,null,null,{"$f":"SUM(AY147:AY159)","v":0},{"$f":"SUM(AZ147:AZ157)","v":0},null,{"$f":"AY160+AZ160","v":0},null,"Total",null,null,null,null,null,{"$f":"SUM(BJ147:BJ159)","v":0},{"$f":"SUM(BK147:BK157)","v":0},null,{"$f":"BJ160+BK160","v":0},null,"Total",null,null,null,null,null,{"$f":"SUM(BU147:BU159)","v":0},{"$f":"SUM(BV147:BV157)","v":0},null,{"$f":"BU160+BV160","v":0},null,"Total",null,null,null,null,null,{"$f":"SUM(CF147:CF159)","v":0},{"$f":"SUM(CG147:CG157)","v":0},null,{"$f":"CF160+CG160","v":0},null,"Total",null,null,null,null,null,{"$f":"SUM(CQ147:CQ159)","v":0},{"$f":"SUM(CR147:CR157)","v":0},null,{"$f":"CQ160+CR160","v":0},null,"Total",null,null,null,null,null,{"$f":"SUM(DB147:DB159)","v":0},{"$f":"SUM(DC147:DC157)","v":0},null,{"$f":"DB160+DC160","v":0}]

{"sheet":"Détermination_sec_5","index":10,"n_rows":160,"n_cols":109,"rows_kept":160,"cut":false,"hidden":true,"merged":[[143,102,143,103],[143,66,144,66],[143,67,144,67],[143,69,143,70],[143,77,144,77],[143,78,144,78],[143,80,143,81],[143,88,144,88],[143,89,144,89],[143,91,143,92],[143,99,144,99],[143,100,144,100],[143,58,143,59],[143,22,144,22],[143,23,144,23],[143,25,143,26],[143,33,144,33],[143,34,144,34],[143,36,143,37],[143,44,144,44],[143,45,144,45],[143,47,143,48],[143,55,144,55],[143,56,144,56],[143,0,144,0],[143,1,144,1],[143,3,143,4],[143,11,144,11],[143,12,144,12],[143,14,143,15],[102,99,103,99],[102,100,103,100],[102,102,102,103],[124,0,125,0],[124,1,125,1],[124,3,124,4],[102,77,103,77],[102,78,103,78],[102,80,102,81],[102,88,103,88],[102,47,102,48],[102,89,103,89],[102,91,102,92],[102,55,103,55],[102,56,103,56],[102,58,102,59],[102,66,103,66],[102,67,103,67],[102,69,102,70],[102,33,103,33],[102,34,103,34],[102,36,102,37],[102,44,103,44],[102,45,103,45],[102,25,102,26],[80,0,81,0],[80,1,81,1],[80,3,80,4],[102,0,103,0],[102,1,103,1],[102,3,102,4],[102,11,103,11],[102,12,103,12],[102,14,102,15],[102,22,103,22],[102,23,103,23],[43,0,44,0],[43,1,44,1],[43,3,43,4],[61,0,62,0],[61,1,62,1],[61,3,61,4],[3,0,4,0],[3,1,4,1],[3,3,3,4],[25,0,26,0],[25,1,26,1],[25,3,25,4]]}
["DÉTERMINATION DES ASSIETTES "]
[]
["ASSIETTE AU TAUX NON RÉSIDENTIEL"]
["Classe non résidentielle","Pourcentage de taxation",null,"VAL. NR À 100 % ET IND. CL. 2 À 50 %"]
[null,null,null,"  Imposables","Compensables",null,"Imposables pondérées","Compensables pondérées",null,"Total"]
[null,"(1)",null,"(2)","(3)",null,"(4) = (1) X (2)","(5) = (1 ) X  (3)",null,"(6) = (4) + (5)"]
[" 1A",1E-3,null,{"$f":"'Sommaire du rôle_sec_5'!F7","v":76534150},{"$f":"'Sommaire du rôle_sec_5'!G7","v":0},null,{"$f":"B7*D7","v":76534.150000000009},{"$f":"B7*E7","v":0},null,{"$f":"G7+H7","v":76534.150000000009}]
[" 1B",5.0000000000000001E-3,null,{"$f":"'Sommaire du rôle_sec_5'!F8","v":34712370},{"$f":"'Sommaire du rôle_sec_5'!G8","v":0},null,173561.85,0,null,173561.85]
[" 1C",0.01,null,{"$f":"'Sommaire du rôle_sec_5'!F9","v":4894450},{"$f":"'Sommaire du rôle_sec_5'!G9","v":0},null,48944.5,0,null,48944.5]
[2,0.03,null,{"$f":"'Sommaire du rôle_sec_5'!F10","v":23616670},{"$f":"'Sommaire du rôle_sec_5'!G10","v":0},null,708500.1,0,null,708500.1]
[3,0.06,null,{"$f":"'Sommaire du rôle_sec_5'!F11","v":44153450},{"$f":"'Sommaire du rôle_sec_5'!G11","v":0},null,2649207,0,null,2649207]
[4,0.12,null,{"$f":"'Sommaire du rôle_sec_5'!F12","v":60256460},{"$f":"'Sommaire du rôle_sec_5'!G12","v":0},null,7230775.2000000002,0,null,7230775.2000000002]
[5,0.22,null,{"$f":"'Sommaire du rôle_sec_5'!F13","v":38643990},{"$f":"'Sommaire du rôle_sec_5'!G13","v":0},null,8501677.8000000007,0,null,8501677.8000000007]
[6,0.4,null,{"$f":"'Sommaire du rôle_sec_5'!F14","v":38532890},{"$f":"'Sommaire du rôle_sec_5'!G14","v":0},null,15413156,0,null,15413156]
[7,0.6,null,{"$f":"'Sommaire du rôle_sec_5'!F15","v":39569365},{"$f":"'Sommaire du rôle_sec_5'!G15","v":72376370},null,23741619,43425822,null,67167441]
[8,0.85,null,{"$f":"'Sommaire du rôle_sec_5'!F16","v":22323070},{"$f":"'Sommaire du rôle_sec_5'!G16","v":211592260},null,18974609.5,179853421,null,198828030.5]
[9,1,null,{"$f":"'Sommaire du rôle_sec_5'!F17","v":3177900},{"$f":"'Sommaire du rôle_sec_5'!G17","v":0},null,3177900,0,null,3177900]
[10,1,null,{"$f":"'Sommaire du rôle_sec_5'!F18","v":1155755205},{"$f":"'Sommaire du rôle_sec_5'!G18","v":61905690},null,1155755205,61905690,null,1217660895]
["11 Cours de triage","100%",null,{"$f":"'Sommaire du rôle_sec_5'!F19","v":0},{"$f":"'Sommaire du rôle_sec_5'!G19","v":0},null,0,0,null,0]
["12 CHSLD",0.2,null,{"$f":"'Sommaire du rôle_sec_5'!F20","v":13938200},null,null,2787640,null,null,2787640]
["13 Cours de triage 40 %","40%",null,{"$f":"'Sommaire du rôle_sec_5'!F21","v":0},null,null,0,null,null,0]
[" APPLICATION DU TNR QUAND TTVD",1,null,{"$f":"'Sommaire du rôle_sec_5'!F22","v":5228300},{"$f":"'Sommaire du rôle_sec_5'!G22","v":0},null,5228300,{"$f":"B22*E22","v":0},null,5228300]
["Total",null,null,null,null,null,{"$f":"SUM(G7:G22)","v":1244467630.0999999},{"$f":"SUM(H7:H22)","v":285184933},null,1529652563.0999999]
[]
["ASSIETTE AU TAUX INDUSTRIEL (CLASSE 2)"]
["Classe non résidentielle","Pourcentage de taxation",null,"VALEUR À 50 %"]
[null,null,null,"  Imposables","Compensables",null,"Imposables pondérées","Compensables pondérées",null,"Total"]
[null,"(1)",null,"(2)","(3)",null,"(4) = (1) X (2)","(5) = (1) X (3)",null,"(6) = (4) + (5)"]
[" 1A",1E-3,null,{"$f":"'Sommaire du rôle_sec_5'!H7","v":0},{"$f":"'Sommaire du rôle_sec_5'!I7","v":0},null,{"$f":"B29*D29","v":0},{"$f":"B29*E29","v":0},null,{"$f":"G29+H29","v":0}]
[" 1B",5.0000000000000001E-3,null,{"$f":"'Sommaire du rôle_sec_5'!H8","v":0},{"$f":"'Sommaire du rôle_sec_5'!I8","v":0},null,0,0,null,0]
[" 1C",0.01,null,{"$f":"'Sommaire du rôle_sec_5'!H9","v":0},{"$f":"'Sommaire du rôle_sec_5'!I9","v":0},null,0,0,null,0]
[2,0.03,null,{"$f":"'Sommaire du rôle_sec_5'!H10","v":0},{"$f":"'Sommaire du rôle_sec_5'!I10","v":0},null,0,0,null,0]
[3,0.06,null,{"$f":"'Sommaire du rôle_sec_5'!H11","v":0},{"$f":"'Sommaire du rôle_sec_5'!I11","v":0},null,0,0,null,0]
[4,0.12,null,{"$f":"'Sommaire du rôle_sec_5'!H12","v":0},{"$f":"'Sommaire du rôle_sec_5'!I12","v":0},null,0,0,null,0]
[5,0.22,null,{"$f":"'Sommaire du rôle_sec_5'!H13","v":0},{"$f":"'Sommaire du rôle_sec_5'!I13","v":0},null,0,0,null,0]
[6,0.4,null,{"$f":"'Sommaire du rôle_sec_5'!H14","v":290100},{"$f":"'Sommaire du rôle_sec_5'!I14","v":0},null,116040,0,null,116040]
[7,0.6,null,{"$f":"'Sommaire du rôle_sec_5'!H15","v":350350},{"$f":"'Sommaire du rôle_sec_5'!I15","v":0},null,210210,0,null,210210]
[8,0.85,null,{"$f":"'Sommaire du rôle_sec_5'!H16","v":0},{"$f":"'Sommaire du rôle_sec_5'!I16","v":0},null,0,0,null,0]
[9,1,null,{"$f":"'Sommaire du rôle_sec_5'!H17","v":0},{"$f":"'Sommaire du rôle_sec_5'!I17","v":0},null,0,0,null,0]
[10,1,null,{"$f":"'Sommaire du rôle_sec_5'!H18","v":10515650},{"$f":"'Sommaire du rôle_sec_5'!I18","v":0},null,10515650,0,null,10515650]
["Total",null,null,null,null,null,{"$f":"SUM(G29:G40)","v":10841900},{"$f":"SUM(H29:H40)","v":0},null,10841900]
[]
["ASSIETTE AU TAUX IND. (SAUF CL.1 ET 2)"]
["Classe non résidentielle","Pourcentage de taxation",null,"VALEUR À 100 %"]
[null,null,null,"  Imposables","Compensables",null,"Imposables pondérées","Compensables pondérées",null,"Total"]
[null,"(1)",null,"(2)","(3)",null,"(4) = (1) X (2)","(5) = (1) X (3)",null,"(6) = (4) + (5)"]
[" 1A",1E-3,null,{"$f":"'Sommaire du rôle_sec_5'!J7","v":0},{"$f":"'Sommaire du rôle_sec_5'!K7","v":0},null,{"$f":"B47*D47","v":0},{"$f":"B47*E47","v":0},null,{"$f":"G47+H47","v":0}]
[" 1B",5.0000000000000001E-3,null,{"$f":"'Sommaire du rôle_sec_5'!J8","v":0},{"$f":"'Sommaire du rôle_sec_5'!K8","v":0},null,0,0,null,0]
[" 1C",0.01,null,{"$f":"'Sommaire du rôle_sec_5'!J9","v":0},{"$f":"'Sommaire du rôle_sec_5'!K9","v":0},null,0,0,null,0]
[2,0.03,null,{"$f":"'Sommaire du rôle_sec_5'!J10","v":605900},{"$f":"'Sommaire du rôle_sec_5'!K10","v":0},null,18177,0,null,18177]
[3,0.06,null,{"$f":"'Sommaire du rôle_sec_5'!J11","v":181400},{"$f":"'Sommaire du rôle_sec_5'!K11","v":0},null,10884,0,null,10884]
[4,0.12,null,{"$f":"'Sommaire du rôle_sec_5'!J12","v":215700},{"$f":"'Sommaire du rôle_sec_5'!K12","v":0},null,25884,0,null,25884]
[5,0.22,null,{"$f":"'Sommaire du rôle_sec_5'!J13","v":0},{"$f":"'Sommaire du rôle_sec_5'!K13","v":0},null,0,0,null,0]
[6,0.4,null,{"$f":"'Sommaire du rôle_sec_5'!J14","v":2421200},{"$f":"'Sommaire du rôle_sec_5'!K14","v":0},null,968480,0,null,968480]
[7,0.6,null,{"$f":"'Sommaire du rôle_sec_5'!J15","v":354000},{"$f":"'Sommaire du rôle_sec_5'!K15","v":0},null,212400,0,null,212400]
[8,0.85,null,{"$f":"'Sommaire du rôle_sec_5'!J16","v":1875900},{"$f":"'Sommaire du rôle_sec_5'!K16","v":0},null,1594515,0,null,1594515]
[9,1,null,{"$f":"'Sommaire du rôle_sec_5'!J17","v":0},{"$f":"'Sommaire du rôle_sec_5'!K17","v":0},null,0,0,null,0]
[10,1,null,{"$f":"'Sommaire du rôle_sec_5'!J18","v":225704400},{"$f":"'Sommaire du rôle_sec_5'!K18","v":2325200},null,225704400,2325200,null,228029600]
["Total",null,null,null,null,null,{"$f":"SUM(G47:G58)","v":228534740},{"$f":"SUM(H47:H58)","v":2325200},null,230859940]
[]
["ASSIETTE AU TAUX DE BASE"]
["Classe non résidentielle","Pourcentage de taxation",null,"VALEUR À 100 %"]
[null,null,null,"  Imposables","Compensables",null,"Imposables pondérées","Compensables pondérées",null,"Total"]
[null,"(1)",null,"(2)","(3)",null,"(4) = (1) X (2)","(5) = (1) X (3)",null,"(6) = (4) + (5)"]
[" 1A",0.999,null,{"$f":"'Sommaire du rôle_sec_5'!P7","v":76534150},{"$f":"'Sommaire du rôle_sec_5'!Q7","v":0},null,{"$f":"D65*B65","v":76457615.849999994},{"$f":"B65*E65","v":0},null,{"$f":"G65+H65","v":76457615.849999994}]
[" 1B",0.995,null,{"$f":"'Sommaire du rôle_sec_5'!P8","v":34712370},{"$f":"'Sommaire du rôle_sec_5'!Q8","v":0},null,34538808.149999999,0,null,34538808.149999999]
[" 1C",0.99,null,{"$f":"'Sommaire du rôle_sec_5'!P9","v":4894450},{"$f":"'Sommaire du rôle_sec_5'!Q9","v":0},null,4845505.5,0,null,4845505.5]
[2,0.97,null,{"$f":"'Sommaire du rôle_sec_5'!P10","v":23616670},{"$f":"'Sommaire du rôle_sec_5'!Q10","v":0},null,22908169.899999999,0,null,22908169.899999999]
[3,0.94,null,{"$f":"'Sommaire du rôle_sec_5'!P11","v":44153450},{"$f":"'Sommaire du rôle_sec_5'!Q11","v":0},null,41504243,0,null,41504243]
[4,0.88,null,{"$f":"'Sommaire du rôle_sec_5'!P12","v":60256460},{"$f":"'Sommaire du rôle_sec_5'!Q12","v":0},null,53025684.799999997,0,null,53025684.799999997]
[5,0.78,null,{"$f":"'Sommaire du rôle_sec_5'!P13","v":38643990},{"$f":"'Sommaire du rôle_sec_5'!Q13","v":0},null,30142312.199999999,0,null,30142312.199999999]
[6,0.6,null,{"$f":"'Sommaire du rôle_sec_5'!P14","v":38532890},{"$f":"'Sommaire du rôle_sec_5'!Q14","v":0},null,23119734,0,null,23119734]
[7,0.4,null,{"$f":"'Sommaire du rôle_sec_5'!P15","v":39569365},{"$f":"'Sommaire du rôle_sec_5'!Q15","v":72376370},null,15827746,28950548,null,44778294]
[8,0.15000000000000002,null,{"$f":"'Sommaire du rôle_sec_5'!P16","v":22323070},{"$f":"'Sommaire du rôle_sec_5'!Q16","v":211592260},null,3348460.5000000005,31738839.000000004,null,35087299.500000007]
["IMMEUBLES SANS PARTIE NON RÉSIDENTIELLE",1,null,{"$f":"'Sommaire du rôle_sec_5'!P18","v":8068032861},{"$f":"'Sommaire du rôle_sec_5'!Q18","v":2100780},null,8068032861,2100780,null,8070133641]
["12  CHSLD",0.8,null,{"$f":"'Sommaire du rôle_sec_5'!P20","v":13938200},null,null,11150560]
["13 Cours de triage ",0.6,null,{"$f":"'Sommaire du rôle_sec_5'!P21","v":0},null,null,0]
["Total",null,null,null,null,null,{"$f":"SUM(G65:G77)","v":8384901700.8999996},{"$f":"SUM(H65:H75)","v":62790167},{"$f":"SUM(I65:I75)","v":0},{"$f":"G78+H78","v":8447691867.8999996}]
[]
["ASSIETTE AU TAUX NON RÉSIDENTIEL RÉFÉRENCE"]
["Classe non résidentielle","Pourcentage de taxation",null,"VAL. NR À 100 % ET IND. CL. 2 À 50 %"]
[null,null,null,"  Imposables","Compensables",null,"Imposables pondérées","Compensables pondérées",null,"Total"]
[null,"(1)",null,"(2)","(3)",null,"(4) = (1) X (2)","(5) = (1 ) X  (3)",null,"(6) = (4) + (5)"]
[" 1A",1E-3,null,{"$f":"'Sommaire du rôle_sec_5'!F30","v":0},{"$f":"'Sommaire du rôle_sec_5'!G30","v":0},null,{"$f":"B84*D84","v":0},{"$f":"B84*E84","v":0},null,{"$f":"G84+H84","v":0}]
[" 1B",5.0000000000000001E-3,null,{"$f":"'Sommaire du rôle_sec_5'!F31","v":0},{"$f":"'Sommaire du rôle_sec_5'!G31","v":0},null,0,0,null,0]
[" 1C",0.01,null,{"$f":"'Sommaire du rôle_sec_5'!F32","v":0},{"$f":"'Sommaire du rôle_sec_5'!G32","v":0},null,0,0,null,0]
[2,0.03,null,{"$f":"'Sommaire du rôle_sec_5'!F33","v":0},{"$f":"'Sommaire du rôle_sec_5'!G33","v":0},null,0,0,null,0]
[3,0.06,null,{"$f":"'Sommaire du rôle_sec_5'!F34","v":0},{"$f":"'Sommaire du rôle_sec_5'!G34","v":0},null,0,0,null,0]
[4,0.12,null,{"$f":"'Sommaire du rôle_sec_5'!F35","v":0},{"$f":"'Sommaire du rôle_sec_5'!G35","v":0},null,0,0,null,0]
[5,0.22,null,{"$f":"'Sommaire du rôle_sec_5'!F36","v":0},{"$f":"'Sommaire du rôle_sec_5'!G36","v":0},null,0,0,null,0]
[6,0.4,null,{"$f":"'Sommaire du rôle_sec_5'!F37","v":0},{"$f":"'Sommaire du rôle_sec_5'!G37","v":0},null,0,0,null,0]
[7,0.6,null,{"$f":"'Sommaire du rôle_sec_5'!F38","v":0},{"$f":"'Sommaire du rôle_sec_5'!G38","v":0},null,0,0,null,0]
[8,0.85,null,{"$f":"'Sommaire du rôle_sec_5'!F39","v":0},{"$f":"'Sommaire du rôle_sec_5'!G39","v":0},null,0,0,null,0]
[9,1,null,{"$f":"'Sommaire du rôle_sec_5'!F40","v":0},{"$f":"'Sommaire du rôle_sec_5'!G40","v":0},null,0,0,null,0]
[10,1,null,{"$f":"'Sommaire du rôle_sec_5'!F41","v":0},{"$f":"'Sommaire du rôle_sec_5'!G41","v":0},null,0,0,null,0]
["11 Cours de triage","100%",null,{"$f":"'Sommaire du rôle_sec_5'!F42","v":0},{"$f":"'Sommaire du rôle_sec_5'!G42","v":0},null,0,0,null,0]
["12 CHSLD",0.2,null,{"$f":"'Sommaire du rôle_sec_5'!F43","v":0},null,null,0,null,null,0]
["13 Cours de triage 40 %","40%",null,{"$f":"'Sommaire du rôle_sec_5'!F44","v":0},null,null,0,null,null,0]
[" APPLICATION DU TNR QUAND TTVD",1,null,{"$f":"'Sommaire du rôle_sec_5'!F45","v":0},{"$f":"'Sommaire du rôle_sec_5'!G45","v":0},null,0,{"$f":"B99*E99","v":0},null,0]
["Total",null,null,null,null,null,{"$f":"SUM(G84:G99)","v":0},{"$f":"SUM(H84:H99)","v":0},null,0]
[]
["ASSIETTE AU TAUX NON RÉSIDENTIEL SOUS-CATÉGORIE 1",null,null,null,null,null,null,null,null,null,null,"ASSIETTE AU TAUX NON RÉSIDENTIEL SOUS-CATÉGORIE 2",null,null,null,null,null,null,null,null,null,null,"ASSIETTE AU TAUX NON RÉSIDENTIEL SOUS-CATÉGORIE 3",null,null,null,null,null,null,null,null,null,null,"ASSIETTE AU TAUX NON RÉSIDENTIEL SOUS-CATÉGORIE 4",null,null,null,null,null,null,null,null,null,null,"ASSIETTE AU TAUX NON RÉSIDENTIEL SOUS-CATÉGORIE 5",null,null,null,null,null,null,null,null,null,null,"ASSIETTE AU TAUX NON RÉSIDENTIEL SOUS-CATÉGORIE 6",null,null,null,null,null,null,null,null,null,null,"ASSIETTE AU TAUX NON RÉSIDENTIEL SOUS-CATÉGORIE 7",null,null,null,null,null,null,null,null,null,null,"ASSIETTE AU TAUX NON RÉSIDENTIEL SOUS-CATÉGORIE 8",null,null,null,null,null,null,null,null,null,null,"ASSIETTE AU TAUX NON RÉSIDENTIEL SOUS-CATÉGORIE 9",null,null,null,null,null,null,null,null,null,null,"ASSIETTE AU TAUX NON RÉSIDENTIEL SOUS-CATÉGORIE 10"]
["Classe non résidentielle","Pourcentage de taxation",null,"VAL. NR À 100 % ET IND. CL. 2 À 50 %",null,null,null,null,null,null,null,"Classe non résidentielle","Pourcentage de taxation",null,"VAL. NR À 100 % ET IND. CL. 2 À 50 %",null,null,null,null,null,null,null,"Classe non résidentielle","Pourcentage de taxation",null,"VAL. NR À 100 % ET IND. CL. 2 À 50 %",null,null,null,null,null,null,null,"Classe non résidentielle","Pourcentage de taxation",null,"VAL. NR À 100 % ET IND. CL. 2 À 50 %",null,null,null,null,null,null,null,"Classe non résidentielle","Pourcentage de taxation",null,"VAL. NR À 100 % ET IND. CL. 2 À 50 %",null,null,null,null,null,null,null,"Classe non résidentielle","Pourcentage de taxation",null,"VAL. NR À 100 % ET IND. CL. 2 À 50 %",null,null,null,null,null,null,null,"Classe non résidentielle","Pourcentage de taxation",null,"VAL. NR À 100 % ET IND. CL. 2 À 50 %",null,null,null,null,null,null,null,"Classe non résidentielle","Pourcentage de taxation",null,"VAL. NR À 100 % ET IND. CL. 2 À 50 %",null,null,null,null,null,null,null,"Classe non résidentielle","Pourcentage de taxation",null,"VAL. NR À 100 % ET IND. CL. 2 À 50 %",null,null,null,null,null,null,null,"Classe non résidentielle","Pourcentage de taxation",null,"VAL. NR À 100 % ET IND. CL. 2 À 50 %"]
[null,null,null,"  Imposables","Compensables",null,"Imposables pondérées","Compensables pondérées",null,"Total",null,null,null,null,"  Imposables","Compensables",null,"Imposables pondérées","Compensables pondérées",null,"Total",null,null,null,null,"  Imposables","Compensables",null,"Imposables pondérées","Compensables pondérées",null,"Total",null,null,null,null,"  Imposables","Compensables",null,"Imposables pondérées","Compensables pondérées",null,"Total",null,null,null,null,"  Imposables","Compensables",null,"Imposables pondérées","Compensables pondérées",null,"Total",null,null,null,null,"  Imposables","Compensables",null,"Imposables pondérées","Compensables pondérées",null,"Total",null,null,null,null,"  Imposables","Compensables",null,"Imposables pondérées","Compensables pondérées",null,"Total",null,null,null,null,"  Imposables","Compensables",null,"Imposables pondérées","Compensables pondérées",null,"Total",null,null,null,null,"  Imposables","Compensables",null,"Imposables pondérées","Compensables pondérées",null,"Total",null,null,null,null,"  Imposables","Compensables",null,"Imposables pondérées","Compensables pondérées",null,"Total"]
[null,"(1)",null,"(2)","(3)",null,"(4) = (1) X (2)","(5) = (1 ) X  (3)",null,"(6) = (4) + (5)",null,null,"(1)",null,"(2)","(3)",null,"(4) = (1) X (2)","(5) = (1 ) X  (3)",null,"(6) = (4) + (5)",null,null,"(1)",null,"(2)","(3)",null,"(4) = (1) X (2)","(5) = (1 ) X  (3)",null,"(6) = (4) + (5)",null,null,"(1)",null,"(2)","(3)",null,"(4) = (1) X (2)","(5) = (1 ) X  (3)",null,"(6) = (4) + (5)",null,null,"(1)",null,"(2)","(3)",null,"(4) = (1) X (2)","(5) = (1 ) X  (3)",null,"(6) = (4) + (5)",null,null,"(1)",null,"(2)","(3)",null,"(4) = (1) X (2)","(5) = (1 ) X  (3)",null,"(6) = (4) + (5)",null,null,"(1)",null,"(2)","(3)",null,"(4) = (1) X (2)","(5) = (1 ) X  (3)",null,"(6) = (4) + (5)",null,null,"(1)",null,"(2)","(3)",null,"(4) = (1) X (2)","(5) = (1 ) X  (3)",null,"(6) = (4) + (5)",null,null,"(1)",null,"(2)","(3)",null,"(4) = (1) X (2)","(5) = (1 ) X  (3)",null,"(6) = (4) + (5)",null,null,"(1)",null,"(2)","(3)",null,"(4) = (1) X (2)","(5) = (1 ) X  (3)",null,"(6) = (4) + (5)"]
[" 1A",1E-3,null,{"$f":"'Sommaire du rôle_sec_5'!H30","v":0},{"$f":"'Sommaire du rôle_sec_5'!I30","v":0},null,{"$f":"B106*D106","v":0},{"$f":"B106*E106","v":0},null,{"$f":"G106+H106","v":0},null," 1A",1E-3,null,{"$f":"'Sommaire du rôle_sec_5'!J30","v":0},{"$f":"'Sommaire du rôle_sec_5'!K30","v":0},null,{"$f":"M106*O106","v":0},{"$f":"M106*P106","v":0},null,{"$f":"R106+S106","v":0},null," 1A",1E-3,null,{"$f":"'Sommaire du rôle_sec_5'!L30","v":0},{"$f":"'Sommaire du rôle_sec_5'!M30","v":0},null,{"$f":"X106*Z106","v":0},{"$f":"X106*AA106","v":0},null,{"$f":"AC106+AD106","v":0},null," 1A",1E-3,null,{"$f":"'Sommaire du rôle_sec_5'!N30","v":0},{"$f":"'Sommaire du rôle_sec_5'!O30","v":0},null,{"$f":"AI106*AK106","v":0},{"$f":"AI106*AL106","v":0},null,{"$f":"AN106+AO106","v":0},null," 1A",1E-3,null,{"$f":"'Sommaire du rôle_sec_5'!P30","v":0},{"$f":"'Sommaire du rôle_sec_5'!Q30","v":0},null,{"$f":"AT106*AV106","v":0},{"$f":"AT106*AW106","v":0},null,{"$f":"AY106+AZ106","v":0},null," 1A",1E-3,null,{"$f":"'Sommaire du rôle_sec_5'!R30","v":0},{"$f":"'Sommaire du rôle_sec_5'!S30","v":0},null,{"$f":"BE106*BG106","v":0},{"$f":"BE106*BH106","v":0},null,{"$f":"BJ106+BK106","v":0},null," 1A",1E-3,null,{"$f":"'Sommaire du rôle_sec_5'!T30","v":0},{"$f":"'Sommaire du rôle_sec_5'!U30","v":0},null,{"$f":"BP106*BR106","v":0},{"$f":"BP106*BS106","v":0},null,{"$f":"BU106+BV106","v":0},null," 1A",1E-3,null,{"$f":"'Sommaire du rôle_sec_5'!V30","v":0},{"$f":"'Sommaire du rôle_sec_5'!W30","v":0},null,{"$f":"CA106*CC106","v":0},{"$f":"CA106*CD106","v":0},null,{"$f":"CF106+CG106","v":0},null," 1A",1E-3,null,{"$f":"'Sommaire du rôle_sec_5'!X30","v":0},{"$f":"'Sommaire du rôle_sec_5'!Y30","v":0},null,{"$f":"CL106*CN106","v":0},{"$f":"CL106*CO106","v":0},null,{"$f":"CQ106+CR106","v":0},null," 1A",1E-3,null,{"$f":"'Sommaire du rôle_sec_5'!Z30","v":0},{"$f":"'Sommaire du rôle_sec_5'!AA30","v":0},null,{"$f":"CW106*CY106","v":0},{"$f":"CW106*CZ106","v":0},null,{"$f":"DB106+DC106","v":0}]
[" 1B",5.0000000000000001E-3,null,{"$f":"'Sommaire du rôle_sec_5'!H31","v":0},{"$f":"'Sommaire du rôle_sec_5'!I31","v":0},null,0,0,null,0,null," 1B",5.0000000000000001E-3,null,{"$f":"'Sommaire du rôle_sec_5'!J31","v":0},{"$f":"'Sommaire du rôle_sec_5'!K31","v":0},null,0,0,null,0,null," 1B",5.0000000000000001E-3,null,{"$f":"'Sommaire du rôle_sec_5'!L31","v":0},{"$f":"'Sommaire du rôle_sec_5'!M31","v":0},null,0,0,null,0,null," 1B",5.0000000000000001E-3,null,{"$f":"'Sommaire du rôle_sec_5'!N31","v":0},{"$f":"'Sommaire du rôle_sec_5'!O31","v":0},null,0,0,null,0,null," 1B",5.0000000000000001E-3,null,{"$f":"'Sommaire du rôle_sec_5'!P31","v":0},{"$f":"'Sommaire du rôle_sec_5'!Q31","v":0},null,0,0,null,0,null," 1B",5.0000000000000001E-3,null,{"$f":"'Sommaire du rôle_sec_5'!R31","v":0},{"$f":"'Sommaire du rôle_sec_5'!S31","v":0},null,0,0,null,0,null," 1B",5.0000000000000001E-3,null,{"$f":"'Sommaire du rôle_sec_5'!T31","v":0},{"$f":"'Sommaire du rôle_sec_5'!U31","v":0},null,0,0,null,0,null," 1B",5.0000000000000001E-3,null,{"$f":"'Sommaire du rôle_sec_5'!V31","v":0},{"$f":"'Sommaire du rôle_sec_5'!W31","v":0},null,0,0,null,0,null," 1B",5.0000000000000001E-3,null,{"$f":"'Sommaire du rôle_sec_5'!X31","v":0},{"$f":"'Sommaire du rôle_sec_5'!Y31","v":0},null,0,0,null,0,null," 1B",5.0000000000000001E-3,null,{"$f":"'Sommaire du rôle_sec_5'!Z31","v":0},{"$f":"'Sommaire du rôle_sec_5'!AA31","v":0},null,0,0,null,0]
[" 1C",0.01,null,{"$f":"'Sommaire du rôle_sec_5'!H32","v":0},{"$f":"'Sommaire du rôle_sec_5'!I32","v":0},null,0,0,null,0,null," 1C",0.01,null,{"$f":"'Sommaire du rôle_sec_5'!J32","v":0},{"$f":"'Sommaire du rôle_sec_5'!K32","v":0},null,0,0,null,0,null," 1C",0.01,null,{"$f":"'Sommaire du rôle_sec_5'!L32","v":0},{"$f":"'Sommaire du rôle_sec_5'!M32","v":0},null,0,0,null,0,null," 1C",0.01,null,{"$f":"'Sommaire du rôle_sec_5'!N32","v":0},{"$f":"'Sommaire du rôle_sec_5'!O32","v":0},null,0,0,null,0,null," 1C",0.01,null,{"$f":"'Sommaire du rôle_sec_5'!P32","v":0},{"$f":"'Sommaire du rôle_sec_5'!Q32","v":0},null,0,0,null,0,null," 1C",0.01,null,{"$f":"'Sommaire du rôle_sec_5'!R32","v":0},{"$f":"'Sommaire du rôle_sec_5'!S32","v":0},null,0,0,null,0,null," 1C",0.01,null,{"$f":"'Sommaire du rôle_sec_5'!T32","v":0},{"$f":"'Sommaire du rôle_sec_5'!U32","v":0},null,0,0,null,0,null," 1C",0.01,null,{"$f":"'Sommaire du rôle_sec_5'!V32","v":0},{"$f":"'Sommaire du rôle_sec_5'!W32","v":0},null,0,0,null,0,null," 1C",0.01,null,{"$f":"'Sommaire du rôle_sec_5'!X32","v":0},{"$f":"'Sommaire du rôle_sec_5'!Y32","v":0},null,0,0,null,0,null," 1C",0.01,null,{"$f":"'Sommaire du rôle_sec_5'!Z32","v":0},{"$f":"'Sommaire du rôle_sec_5'!AA32","v":0},null,0,0,null,0]
[2,0.03,null,{"$f":"'Sommaire du rôle_sec_5'!H33","v":0},{"$f":"'Sommaire du rôle_sec_5'!I33","v":0},null,0,0,null,0,null,2,0.03,null,{"$f":"'Sommaire du rôle_sec_5'!J33","v":0},{"$f":"'Sommaire du rôle_sec_5'!K33","v":0},null,0,0,null,0,null,2,0.03,null,{"$f":"'Sommaire du rôle_sec_5'!L33","v":0},{"$f":"'Sommaire du rôle_sec_5'!M33","v":0},null,0,0,null,0,null,2,0.03,null,{"$f":"'Sommaire du rôle_sec_5'!N33","v":0},{"$f":"'Sommaire du rôle_sec_5'!O33","v":0},null,0,0,null,0,null,2,0.03,null,{"$f":"'Sommaire du rôle_sec_5'!P33","v":0},{"$f":"'Sommaire du rôle_sec_5'!Q33","v":0},null,0,0,null,0,null,2,0.03,null,{"$f":"'Sommaire du rôle_sec_5'!R33","v":0},{"$f":"'Sommaire du rôle_sec_5'!S33","v":0},null,0,0,null,0,null,2,0.03,null,{"$f":"'Sommaire du rôle_sec_5'!T33","v":0},{"$f":"'Sommaire du rôle_sec_5'!U33","v":0},null,0,0,null,0,null,2,0.03,null,{"$f":"'Sommaire du rôle_sec_5'!V33","v":0},{"$f":"'Sommaire du rôle_sec_5'!W33","v":0},null,0,0,null,0,null,2,0.03,null,{"$f":"'Sommaire du rôle_sec_5'!X33","v":0},{"$f":"'Sommaire du rôle_sec_5'!Y33","v":0},null,0,0,null,0,null,2,0.03,null,{"$f":"'Sommaire du rôle_sec_5'!Z33","v":0},{"$f":"'Sommaire du rôle_sec_5'!AA33","v":0},null,0,0,null,0]
[3,0.06,null,{"$f":"'Sommaire du rôle_sec_5'!H34","v":0},{"$f":"'Sommaire du rôle_sec_5'!I34","v":0},null,0,0,null,0,null,3,0.06,null,{"$f":"'Sommaire du rôle_sec_5'!J34","v":0},{"$f":"'Sommaire du rôle_sec_5'!K34","v":0},null,0,0,null,0,null,3,0.06,null,{"$f":"'Sommaire du rôle_sec_5'!L34","v":0},{"$f":"'Sommaire du rôle_sec_5'!M34","v":0},null,0,0,null,0,null,3,0.06,null,{"$f":"'Sommaire du rôle_sec_5'!N34","v":0},{"$f":"'Sommaire du rôle_sec_5'!O34","v":0},null,0,0,null,0,null,3,0.06,null,{"$f":"'Sommaire du rôle_sec_5'!P34","v":0},{"$f":"'Sommaire du rôle_sec_5'!Q34","v":0},null,0,0,null,0,null,3,0.06,null,{"$f":"'Sommaire du rôle_sec_5'!R34","v":0},{"$f":"'Sommaire du rôle_sec_5'!S34","v":0},null,0,0,null,0,null,3,0.06,null,{"$f":"'Sommaire du rôle_sec_5'!T34","v":0},{"$f":"'Sommaire du rôle_sec_5'!U34","v":0},null,0,0,null,0,null,3,0.06,null,{"$f":"'Sommaire du rôle_sec_5'!V34","v":0},{"$f":"'Sommaire du rôle_sec_5'!W34","v":0},null,0,0,null,0,null,3,0.06,null,{"$f":"'Sommaire du rôle_sec_5'!X34","v":0},{"$f":"'Sommaire du rôle_sec_5'!Y34","v":0},null,0,0,null,0,null,3,0.06,null,{"$f":"'Sommaire du rôle_sec_5'!Z34","v":0},{"$f":"'Sommaire du rôle_sec_5'!AA34","v":0},null,0,0,null,0]
[4,0.12,null,{"$f":"'Sommaire du rôle_sec_5'!H35","v":0},{"$f":"'Sommaire du rôle_sec_5'!I35","v":0},null,0,0,null,0,null,4,0.12,null,{"$f":"'Sommaire du rôle_sec_5'!J35","v":0},{"$f":"'Sommaire du rôle_sec_5'!K35","v":0},null,0,0,null,0,null,4,0.12,null,{"$f":"'Sommaire du rôle_sec_5'!L35","v":0},{"$f":"'Sommaire du rôle_sec_5'!M35","v":0},null,0,0,null,0,null,4,0.12,null,{"$f":"'Sommaire du rôle_sec_5'!N35","v":0},{"$f":"'Sommaire du rôle_sec_5'!O35","v":0},null,0,0,null,0,null,4,0.12,null,{"$f":"'Sommaire du rôle_sec_5'!P35","v":0},{"$f":"'Sommaire du rôle_sec_5'!Q35","v":0},null,0,0,null,0,null,4,0.12,null,{"$f":"'Sommaire du rôle_sec_5'!R35","v":0},{"$f":"'Sommaire du rôle_sec_5'!S35","v":0},null,0,0,null,0,null,4,0.12,null,{"$f":"'Sommaire du rôle_sec_5'!T35","v":0},{"$f":"'Sommaire du rôle_sec_5'!U35","v":0},null,0,0,null,0,null,4,0.12,null,{"$f":"'Sommaire du rôle_sec_5'!V35","v":0},{"$f":"'Sommaire du rôle_sec_5'!W35","v":0},null,0,0,null,0,null,4,0.12,null,{"$f":"'Sommaire du rôle_sec_5'!X35","v":0},{"$f":"'Sommaire du rôle_sec_5'!Y35","v":0},null,0,0,null,0,null,4,0.12,null,{"$f":"'Sommaire du rôle_sec_5'!Z35","v":0},{"$f":"'Sommaire du rôle_sec_5'!AA35","v":0},null,0,0,null,0]
[5,0.22,null,{"$f":"'Sommaire du rôle_sec_5'!H36","v":0},{"$f":"'Sommaire du rôle_sec_5'!I36","v":0},null,0,0,null,0,null,5,0.22,null,{"$f":"'Sommaire du rôle_sec_5'!J36","v":0},{"$f":"'Sommaire du rôle_sec_5'!K36","v":0},null,0,0,null,0,null,5,0.22,null,{"$f":"'Sommaire du rôle_sec_5'!L36","v":0},{"$f":"'Sommaire du rôle_sec_5'!M36","v":0},null,0,0,null,0,null,5,0.22,null,{"$f":"'Sommaire du rôle_sec_5'!N36","v":0},{"$f":"'Sommaire du rôle_sec_5'!O36","v":0},null,0,0,null,0,null,5,0.22,null,{"$f":"'Sommaire du rôle_sec_5'!P36","v":0},{"$f":"'Sommaire du rôle_sec_5'!Q36","v":0},null,0,0,null,0,null,5,0.22,null,{"$f":"'Sommaire du rôle_sec_5'!R36","v":0},{"$f":"'Sommaire du rôle_sec_5'!S36","v":0},null,0,0,null,0,null,5,0.22,null,{"$f":"'Sommaire du rôle_sec_5'!T36","v":0},{"$f":"'Sommaire du rôle_sec_5'!U36","v":0},null,0,0,null,0,null,5,0.22,null,{"$f":"'Sommaire du rôle_sec_5'!V36","v":0},{"$f":"'Sommaire du rôle_sec_5'!W36","v":0},null,0,0,null,0,null,5,0.22,null,{"$f":"'Sommaire du rôle_sec_5'!X36","v":0},{"$f":"'Sommaire du rôle_sec_5'!Y36","v":0},null,0,0,null,0,null,5,0.22,null,{"$f":"'Sommaire du rôle_sec_5'!Z36","v":0},{"$f":"'Sommaire du rôle_sec_5'!AA36","v":0},null,0,0,null,0]
[6,0.4,null,{"$f":"'Sommaire du rôle_sec_5'!H37","v":0},{"$f":"'Sommaire du rôle_sec_5'!I37","v":0},null,0,0,null,0,null,6,0.4,null,{"$f":"'Sommaire du rôle_sec_5'!J37","v":0},{"$f":"'Sommaire du rôle_sec_5'!K37","v":0},null,0,0,null,0,null,6,0.4,null,{"$f":"'Sommaire du rôle_sec_5'!L37","v":0},{"$f":"'Sommaire du rôle_sec_5'!M37","v":0},null,0,0,null,0,null,6,0.4,null,{"$f":"'Sommaire du rôle_sec_5'!N37","v":0},{"$f":"'Sommaire du rôle_sec_5'!O37","v":0},null,0,0,null,0,null,6,0.4,null,{"$f":"'Sommaire du rôle_sec_5'!P37","v":0},{"$f":"'Sommaire du rôle_sec_5'!Q37","v":0},null,0,0,null,0,null,6,0.4,null,{"$f":"'Sommaire du rôle_sec_5'!R37","v":0},{"$f":"'Sommaire du rôle_sec_5'!S37","v":0},null,0,0,null,0,null,6,0.4,null,{"$f":"'Sommaire du rôle_sec_5'!T37","v":0},{"$f":"'Sommaire du rôle_sec_5'!U37","v":0},null,0,0,null,0,null,6,0.4,null,{"$f":"'Sommaire du rôle_sec_5'!V37","v":0},{"$f":"'Sommaire du rôle_sec_5'!W37","v":0},null,0,0,null,0,null,6,0.4,null,{"$f":"'Sommaire du rôle_sec_5'!X37","v":0},{"$f":"'Sommaire du rôle_sec_5'!Y37","v":0},null,0,0,null,0,null,6,0.4,null,{"$f":"'Sommaire du rôle_sec_5'!Z37","v":0},{"$f":"'Sommaire du rôle_sec_5'!AA37","v":0},null,0,0,null,0]
[7,0.6,null,{"$f":"'Sommaire du rôle_sec_5'!H38","v":0},{"$f":"'Sommaire du rôle_sec_5'!I38","v":0},null,0,0,null,0,null,7,0.6,null,{"$f":"'Sommaire du rôle_sec_5'!J38","v":0},{"$f":"'Sommaire du rôle_sec_5'!K38","v":0},null,0,0,null,0,null,7,0.6,null,{"$f":"'Sommaire du rôle_sec_5'!L38","v":0},{"$f":"'Sommaire du rôle_sec_5'!M38","v":0},null,0,0,null,0,null,7,0.6,null,{"$f":"'Sommaire du rôle_sec_5'!N38","v":0},{"$f":"'Sommaire du rôle_sec_5'!O38","v":0},null,0,0,null,0,null,7,0.6,null,{"$f":"'Sommaire du rôle_sec_5'!P38","v":0},{"$f":"'Sommaire du rôle_sec_5'!Q38","v":0},null,0,0,null,0,null,7,0.6,null,{"$f":"'Sommaire du rôle_sec_5'!R38","v":0},{"$f":"'Sommaire du rôle_sec_5'!S38","v":0},null,0,0,null,0,null,7,0.6,null,{"$f":"'Sommaire du rôle_sec_5'!T38","v":0},{"$f":"'Sommaire du rôle_sec_5'!U38","v":0},null,0,0,null,0,null,7,0.6,null,{"$f":"'Sommaire du rôle_sec_5'!V38","v":0},{"$f":"'Sommaire du rôle_sec_5'!W38","v":0},null,0,0,null,0,null,7,0.6,null,{"$f":"'Sommaire du rôle_sec_5'!X38","v":0},{"$f":"'Sommaire du rôle_sec_5'!Y38","v":0},null,0,0,null,0,null,7,0.6,null,{"$f":"'Sommaire du rôle_sec_5'!Z38","v":0},{"$f":"'Sommaire du rôle_sec_5'!AA38","v":0},null,0,0,null,0]
[8,0.85,null,{"$f":"'Sommaire du rôle_sec_5'!H39","v":0},{"$f":"'Sommaire du rôle_sec_5'!I39","v":0},null,0,0,null,0,null,8,0.85,null,{"$f":"'Sommaire du rôle_sec_5'!J39","v":0},{"$f":"'Sommaire du rôle_sec_5'!K39","v":0},null,0,0,null,0,null,8,0.85,null,{"$f":"'Sommaire du rôle_sec_5'!L39","v":0},{"$f":"'Sommaire du rôle_sec_5'!M39","v":0},null,0,0,null,0,null,8,0.85,null,{"$f":"'Sommaire du rôle_sec_5'!N39","v":0},{"$f":"'Sommaire du rôle_sec_5'!O39","v":0},null,0,0,null,0,null,8,0.85,null,{"$f":"'Sommaire du rôle_sec_5'!P39","v":0},{"$f":"'Sommaire du rôle_sec_5'!Q39","v":0},null,0,0,null,0,null,8,0.85,null,{"$f":"'Sommaire du rôle_sec_5'!R39","v":0},{"$f":"'Sommaire du rôle_sec_5'!S39","v":0},null,0,0,null,0,null,8,0.85,null,{"$f":"'Sommaire du rôle_sec_5'!T39","v":0},{"$f":"'Sommaire du rôle_sec_5'!U39","v":0},null,0,0,null,0,null,8,0.85,null,{"$f":"'Sommaire du rôle_sec_5'!V39","v":0},{"$f":"'Sommaire du rôle_sec_5'!W39","v":0},null,0,0,null,0,null,8,0.85,null,{"$f":"'Sommaire du rôle_sec_5'!X39","v":0},{"$f":"'Sommaire du rôle_sec_5'!Y39","v":0},null,0,0,null,0,null,8,0.85,null,{"$f":"'Sommaire du rôle_sec_5'!Z39","v":0},{"$f":"'Sommaire du rôle_sec_5'!AA39","v":0},null,0,0,null,0]
[9,1,null,{"$f":"'Sommaire du rôle_sec_5'!H40","v":0},{"$f":"'Sommaire du rôle_sec_5'!I40","v":0},null,0,0,null,0,null,9,1,null,{"$f":"'Sommaire du rôle_sec_5'!J40","v":0},{"$f":"'Sommaire du rôle_sec_5'!K40","v":0},null,0,0,null,0,null,9,1,null,{"$f":"'Sommaire du rôle_sec_5'!L40","v":0},{"$f":"'Sommaire du rôle_sec_5'!M40","v":0},null,0,0,null,0,null,9,1,null,{"$f":"'Sommaire du rôle_sec_5'!N40","v":0},{"$f":"'Sommaire du rôle_sec_5'!O40","v":0},null,0,0,null,0,null,9,1,null,{"$f":"'Sommaire du rôle_sec_5'!P40","v":0},{"$f":"'Sommaire du rôle_sec_5'!Q40","v":0},null,0,0,null,0,null,9,1,null,{"$f":"'Sommaire du rôle_sec_5'!R40","v":0},{"$f":"'Sommaire du rôle_sec_5'!S40","v":0},null,0,0,null,0,null,9,1,null,{"$f":"'Sommaire du rôle_sec_5'!T40","v":0},{"$f":"'Sommaire du rôle_sec_5'!U40","v":0},null,0,0,null,0,null,9,1,null,{"$f":"'Sommaire du rôle_sec_5'!V40","v":0},{"$f":"'Sommaire du rôle_sec_5'!W40","v":0},null,0,0,null,0,null,9,1,null,{"$f":"'Sommaire du rôle_sec_5'!X40","v":0},{"$f":"'Sommaire du rôle_sec_5'!Y40","v":0},null,0,0,null,0,null,9,1,null,{"$f":"'Sommaire du rôle_sec_5'!Z40","v":0},{"$f":"'Sommaire du rôle_sec_5'!AA40","v":0},null,0,0,null,0]
[10,1,null,{"$f":"'Sommaire du rôle_sec_5'!H41","v":0},{"$f":"'Sommaire du rôle_sec_5'!I41","v":0},null,0,0,null,0,null,10,1,null,{"$f":"'Sommaire du rôle_sec_5'!J41","v":0},{"$f":"'Sommaire du rôle_sec_5'!K41","v":0},null,0,0,null,0,null,10,1,null,{"$f":"'Sommaire du rôle_sec_5'!L41","v":0},{"$f":"'Sommaire du rôle_sec_5'!M41","v":0},null,0,0,null,0,null,10,1,null,{"$f":"'Sommaire du rôle_sec_5'!N41","v":0},{"$f":"'Sommaire du rôle_sec_5'!O41","v":0},null,0,0,null,0,null,10,1,null,{"$f":"'Sommaire du rôle_sec_5'!P41","v":0},{"$f":"'Sommaire du rôle_sec_5'!Q41","v":0},null,0,0,null,0,null,10,1,null,{"$f":"'Sommaire du rôle_sec_5'!R41","v":0},{"$f":"'Sommaire du rôle_sec_5'!S41","v":0},null,0,0,null,0,null,10,1,null,{"$f":"'Sommaire du rôle_sec_5'!T41","v":0},{"$f":"'Sommaire du rôle_sec_5'!U41","v":0},null,0,0,null,0,null,10,1,null,{"$f":"'Sommaire du rôle_sec_5'!V41","v":0},{"$f":"'Sommaire du rôle_sec_5'!W41","v":0},null,0,0,null,0,null,10,1,null,{"$f":"'Sommaire du rôle_sec_5'!X41","v":0},{"$f":"'Sommaire du rôle_sec_5'!Y41","v":0},null,0,0,null,0,null,10,1,null,{"$f":"'Sommaire du rôle_sec_5'!Z41","v":0},{"$f":"'Sommaire du rôle_sec_5'!AA41","v":0},null,0,0,null,0]
["11 Cours de triage","100%",null,{"$f":"'Sommaire du rôle_sec_5'!H42","v":0},{"$f":"'Sommaire du rôle_sec_5'!I42","v":0},null,0,0,null,0,null,"11 Cours de triage","100%",null,{"$f":"'Sommaire du rôle_sec_5'!J42","v":0},{"$f":"'Sommaire du rôle_sec_5'!K42","v":0},null,0,0,null,0,null,"11 Cours de triage","100%",null,{"$f":"'Sommaire du rôle_sec_5'!L42","v":0},{"$f":"'Sommaire du rôle_sec_5'!M42","v":0},null,0,0,null,0,null,"11 Cours de triage","100%",null,{"$f":"'Sommaire du rôle_sec_5'!N42","v":0},{"$f":"'Sommaire du rôle_sec_5'!O42","v":0},null,0,0,null,0,null,"11 Cours de triage","100%",null,{"$f":"'Sommaire du rôle_sec_5'!P42","v":0},{"$f":"'Sommaire du rôle_sec_5'!Q42","v":0},null,0,0,null,0,null,"11 Cours de triage","100%",null,{"$f":"'Sommaire du rôle_sec_5'!R42","v":0},{"$f":"'Sommaire du rôle_sec_5'!S42","v":0},null,0,0,null,0,null,"11 Cours de triage","100%",null,{"$f":"'Sommaire du rôle_sec_5'!T42","v":0},{"$f":"'Sommaire du rôle_sec_5'!U42","v":0},null,0,0,null,0,null,"11 Cours de triage","100%",null,{"$f":"'Sommaire du rôle_sec_5'!V42","v":0},{"$f":"'Sommaire du rôle_sec_5'!W42","v":0},null,0,0,null,0,null,"11 Cours de triage","100%",null,{"$f":"'Sommaire du rôle_sec_5'!X42","v":0},{"$f":"'Sommaire du rôle_sec_5'!Y42","v":0},null,0,0,null,0,null,"11 Cours de triage","100%",null,{"$f":"'Sommaire du rôle_sec_5'!Z42","v":0},{"$f":"'Sommaire du rôle_sec_5'!AA42","v":0},null,0,0,null,0]
["12 CHSLD",0.2,null,{"$f":"'Sommaire du rôle_sec_5'!H43","v":0},null,null,0,null,null,0,null,"12 CHSLD",0.2,null,{"$f":"'Sommaire du rôle_sec_5'!J43","v":0},null,null,0,null,null,0,null,"12 CHSLD",0.2,null,{"$f":"'Sommaire du rôle_sec_5'!L43","v":0},null,null,0,null,null,0,null,"12 CHSLD",0.2,null,{"$f":"'Sommaire du rôle_sec_5'!N43","v":0},null,null,0,null,null,0,null,"12 CHSLD",0.2,null,{"$f":"'Sommaire du rôle_sec_5'!P43","v":0},null,null,0,null,null,0,null,"12 CHSLD",0.2,null,{"$f":"'Sommaire du rôle_sec_5'!R43","v":0},null,null,0,null,null,0,null,"12 CHSLD",0.2,null,{"$f":"'Sommaire du rôle_sec_5'!T43","v":0},null,null,0,null,null,0,null,"12 CHSLD",0.2,null,{"$f":"'Sommaire du rôle_sec_5'!V43","v":0},null,null,0,null,null,0,null,"12 CHSLD",0.2,null,{"$f":"'Sommaire du rôle_sec_5'!X43","v":0},null,null,0,null,null,0,null,"12 CHSLD",0.2,null,{"$f":"'Sommaire du rôle_sec_5'!Z43","v":0},null,null,0,null,null,0]
["13 Cours de triage 40 %","40%",null,{"$f":"'Sommaire du rôle_sec_5'!H44","v":0},null,null,0,null,null,0,null,"13 Cours de triage 40 %","40%",null,{"$f":"'Sommaire du rôle_sec_5'!J44","v":0},null,null,0,null,null,0,null,"13 Cours de triage 40 %","40%",null,{"$f":"'Sommaire du rôle_sec_5'!L44","v":0},null,null,0,null,null,0,null,"13 Cours de triage 40 %","40%",null,{"$f":"'Sommaire du rôle_sec_5'!N44","v":0},null,null,0,null,null,0,null,"13 Cours de triage 40 %","40%",null,{"$f":"'Sommaire du rôle_sec_5'!P44","v":0},null,null,0,null,null,0,null,"13 Cours de triage 40 %","40%",null,{"$f":"'Sommaire du rôle_sec_5'!R44","v":0},null,null,0,null,null,0,null,"13 Cours de triage 40 %","40%",null,{"$f":"'Sommaire du rôle_sec_5'!T44","v":0},null,null,0,null,null,0,null,"13 Cours de triage 40 %","40%",null,{"$f":"'Sommaire du rôle_sec_5'!V44","v":0},null,null,0,null,null,0,null,"13 Cours de triage 40 %","40%",null,{"$f":"'Sommaire du rôle_sec_5'!X44","v":0},null,null,0,null,null,0,null,"13 Cours de triage 40 %","40%",null,{"$f":"'Sommaire du rôle_sec_5'!Z44","v":0},null,null,0,null,null,0]
[" APPLICATION DU TNR QUAND TTVD",1,null,{"$f":"'Sommaire du rôle_sec_5'!H45","v":0},{"$f":"'Sommaire du rôle_sec_5'!I45","v":0},null,0,{"$f":"B121*E121","v":0},null,0,null," APPLICATION DU TNR QUAND TTVD",1,null,{"$f":"'Sommaire du rôle_sec_5'!J45","v":0},{"$f":"'Sommaire du rôle_sec_5'!K45","v":0},null,0,{"$f":"M121*P121","v":0},null,0,null," APPLICATION DU TNR QUAND TTVD",1,null,{"$f":"'Sommaire du rôle_sec_5'!L45","v":0},{"$f":"'Sommaire du rôle_sec_5'!M45","v":0},null,0,{"$f":"X121*AA121","v":0},null,0,null," APPLICATION DU TNR QUAND TTVD",1,null,{"$f":"'Sommaire du rôle_sec_5'!N45","v":0},{"$f":"'Sommaire du rôle_sec_5'!O45","v":0},null,0,{"$f":"AI121*AL121","v":0},null,0,null," APPLICATION DU TNR QUAND TTVD",1,null,{"$f":"'Sommaire du rôle_sec_5'!P45","v":0},{"$f":"'Sommaire du rôle_sec_5'!Q45","v":0},null,0,{"$f":"AT121*AW121","v":0},null,0,null," APPLICATION DU TNR QUAND TTVD",1,null,{"$f":"'Sommaire du rôle_sec_5'!R45","v":0},{"$f":"'Sommaire du rôle_sec_5'!S45","v":0},null,0,{"$f":"BE121*BH121","v":0},null,0,null," APPLICATION DU TNR QUAND TTVD",1,null,{"$f":"'Sommaire du rôle_sec_5'!T45","v":0},{"$f":"'Sommaire du rôle_sec_5'!U45","v":0},null,0,{"$f":"BP121*BS121","v":0},null,0,null," APPLICATION DU TNR QUAND TTVD",1,null,{"$f":"'Sommaire du rôle_sec_5'!AE45","v":0},{"$f":"'Sommaire du rôle_sec_5'!AF45","v":0},null,0,{"$f":"CA121*CD121","v":0},null,0,null," APPLICATION DU TNR QUAND TTVD",1,null,{"$f":"'Sommaire du rôle_sec_5'!X45","v":0},{"$f":"'Sommaire du rôle_sec_5'!Y45","v":0},null,0,{"$f":"CL121*CO121","v":0},null,0,null," APPLICATION DU TNR QUAND TTVD",1,null,{"$f":"'Sommaire du rôle_sec_5'!Z45","v":0},{"$f":"'Sommaire du rôle_sec_5'!AA45","v":0},null,0,{"$f":"CW121*CZ121","v":0},null,0]
["Total",null,null,null,null,null,{"$f":"SUM(G106:G121)","v":0},{"$f":"SUM(H106:H121)","v":0},null,0,null,"Total",null,null,null,null,null,{"$f":"SUM(R106:R121)","v":0},{"$f":"SUM(S106:S121)","v":0},null,0,null,"Total",null,null,null,null,null,{"$f":"SUM(AC106:AC121)","v":0},{"$f":"SUM(AD106:AD121)","v":0},null,0,null,"Total",null,null,null,null,null,{"$f":"SUM(AN106:AN121)","v":0},{"$f":"SUM(AO106:AO121)","v":0},null,0,null,"Total",null,null,null,null,null,{"$f":"SUM(AY106:AY121)","v":0},{"$f":"SUM(AZ106:AZ121)","v":0},null,0,null,"Total",null,null,null,null,null,{"$f":"SUM(BJ106:BJ121)","v":0},{"$f":"SUM(BK106:BK121)","v":0},null,0,null,"Total",null,null,null,null,null,{"$f":"SUM(BU106:BU121)","v":0},{"$f":"SUM(BV106:BV121)","v":0},null,0,null,"Total",null,null,null,null,null,{"$f":"SUM(CF106:CF121)","v":0},{"$f":"SUM(CG106:CG121)","v":0},null,0,null,"Total",null,null,null,null,null,{"$f":"SUM(CQ106:CQ121)","v":0},{"$f":"SUM(CR106:CR121)","v":0},null,0,null,"Total",null,null,null,null,null,{"$f":"SUM(DB106:DB121)","v":0},{"$f":"SUM(DC106:DC121)","v":0},null,0]
[]
["ASSIETTE SOUS-CATÉGORIE RÉSIDUELLE"]
["Classe non résidentielle","Pourcentage de taxation",null,"VALEUR À 100 %"]
[null,null,null,"  Imposables","Compensables",null,"Imposables pondérées","Compensables pondérées",null,"Total"]
[null,"(1)",null,"(2)","(3)",null,"(4) = (1) X (2)","(5) = (1) X (3)",null,"(6) = (4) + (5)"]
[" 1A",0.999,null,{"$f":"'Sommaire du rôle_sec_5'!F53","v":0},{"$f":"'Sommaire du rôle_sec_5'!G53","v":0},null,{"$f":"D128*B128","v":0},{"$f":"B128*E128","v":0},null,{"$f":"G128+H128","v":0},2359638]
[" 1B",0.995,null,{"$f":"'Sommaire du rôle_sec_5'!F54","v":0},{"$f":"'Sommaire du rôle_sec_5'!G54","v":0},null,0,0,null,0,670132.5]
[" 1C",0.99,null,{"$f":"'Sommaire du rôle_sec_5'!F55","v":0},{"$f":"'Sommaire du rôle_sec_5'!G55","v":0},null,0,0,null,0,4405005]
[2,0.97,null,{"$f":"'Sommaire du rôle_sec_5'!F56","v":0},{"$f":"'Sommaire du rôle_sec_5'!G56","v":0},null,0,0,null,0,21413332]
[3,0.94,null,{"$f":"'Sommaire du rôle_sec_5'!F57","v":0},{"$f":"'Sommaire du rôle_sec_5'!G57","v":0},null,0,0,null,0,36190282]
[4,0.88,null,{"$f":"'Sommaire du rôle_sec_5'!F58","v":0},{"$f":"'Sommaire du rôle_sec_5'!G58","v":0},null,0,0,null,0,27846104]
[5,0.78,null,{"$f":"'Sommaire du rôle_sec_5'!F59","v":0},{"$f":"'Sommaire du rôle_sec_5'!G59","v":0},null,0,0,null,0,22550424]
[6,0.6,null,{"$f":"'Sommaire du rôle_sec_5'!F60","v":0},{"$f":"'Sommaire du rôle_sec_5'!G60","v":0},null,0,0,null,0,19039560]
[7,0.4,null,{"$f":"'Sommaire du rôle_sec_5'!F61","v":0},{"$f":"'Sommaire du rôle_sec_5'!G61","v":0},null,0,0,null,0,37782600]
[8,0.15000000000000002,null,{"$f":"'Sommaire du rôle_sec_5'!F62","v":0},{"$f":"'Sommaire du rôle_sec_5'!G62","v":0},null,0,0,null,0,32037030.000000004]
["IMMEUBLES SANS PARTIE NON RÉSIDENTIELLE",1,null,{"$f":"'Sommaire du rôle_sec_5'!F63","v":0},{"$f":"'Sommaire du rôle_sec_5'!G63","v":0},null,0,0,null,0,7336485128]
["12  CHSLD",0.8,null,{"$f":"'Sommaire du rôle_sec_5'!F64","v":0},{"$f":"'Sommaire du rôle_sec_5'!G64","v":0},null,0]
["13 Cours de triage ",0.6,null,{"$f":"'Sommaire du rôle_sec_5'!F65","v":0},{"$f":"'Sommaire du rôle_sec_5'!G65","v":0},null,0]
["Total",null,null,null,null,null,{"$f":"SUM(G128:G140)","v":0},{"$f":"SUM(H128:H138)","v":0},{"$f":"SUM(I128:I138)","v":0},{"$f":"G141+H141","v":0}]
[]
["ASSIETTE AU TAUX RÉSIDENTIEL SOUS-CATÉGORIE 1",null,null,null,null,null,null,null,null,null,null,"ASSIETTE AU TAUX RÉSIDENTIEL SOUS-CATÉGORIE 2",null,null,null,null,null,null,null,null,null,null,"ASSIETTE AU TAUX RÉSIDENTIEL SOUS-CATÉGORIE 3",null,null,null,null,null,null,null,null,null,null,"ASSIETTE AU TAUX RÉSIDENTIEL SOUS-CATÉGORIE 4",null,null,null,null,null,null,null,null,null,null,"ASSIETTE AU TAUX RÉSIDENTIEL SOUS-CATÉGORIE 5",null,null,null,null,null,null,null,null,null,null,"ASSIETTE AU TAUX RÉSIDENTIEL SOUS-CATÉGORIE 6",null,null,null,null,null,null,null,null,null,null,"ASSIETTE AU TAUX RÉSIDENTIEL SOUS-CATÉGORIE 7",null,null,null,null,null,null,null,null,null,null,"ASSIETTE AU TAUX RÉSIDENTIEL SOUS-CATÉGORIE 8",null,null,null,null,null,null,null,null,null,null,"ASSIETTE AU TAUX RÉSIDENTIEL SOUS-CATÉGORIE 9",null,null,null,null,null,null,null,null,null,null,"ASSIETTE AU TAUX RÉSIDENTIEL SOUS-CATÉGORIE 10"]
["Classe non résidentielle","Pourcentage de taxation",null,"VALEUR À 100 %",null,null,null,null,null,null,null,"Classe non résidentielle","Pourcentage de taxation",null,"VALEUR À 100 %",null,null,null,null,null,null,null,"Classe non résidentielle","Pourcentage de taxation",null,"VALEUR À 100 %",null,null,null,null,null,null,null,"Classe non résidentielle","Pourcentage de taxation",null,"VALEUR À 100 %",null,null,null,null,null,null,null,"Classe non résidentielle","Pourcentage de taxation",null,"VALEUR À 100 %",null,null,null,null,null,null,null,"Classe non résidentielle","Pourcentage de taxation",null,"VALEUR À 100 %",null,null,null,null,null,null,null,"Classe non résidentielle","Pourcentage de taxation",null,"VALEUR À 100 %",null,null,null,null,null,null,null,"Classe non résidentielle","Pourcentage de taxation",null,"VALEUR À 100 %",null,null,null,null,null,null,null,"Classe non résidentielle","Pourcentage de taxation",null,"VALEUR À 100 %",null,null,null,null,null,null,null,"Classe non résidentielle","Pourcentage de taxation",null,"VALEUR À 100 %"]
[null,null,null,"  Imposables","Compensables",null,"Imposables pondérées","Compensables pondérées",null,"Total",null,null,null,null,"  Imposables","Compensables",null,"Imposables pondérées","Compensables pondérées",null,"Total",null,null,null,null,"  Imposables","Compensables",null,"Imposables pondérées","Compensables pondérées",null,"Total",null,null,null,null,"  Imposables","Compensables",null,"Imposables pondérées","Compensables pondérées",null,"Total",null,null,null,null,"  Imposables","Compensables",null,"Imposables pondérées","Compensables pondérées",null,"Total",null,null,null,null,"  Imposables","Compensables",null,"Imposables pondérées","Compensables pondérées",null,"Total",null,null,null,null,"  Imposables","Compensables",null,"Imposables pondérées","Compensables pondérées",null,"Total",null,null,null,null,"  Imposables","Compensables",null,"Imposables pondérées","Compensables pondérées",null,"Total",null,null,null,null,"  Imposables","Compensables",null,"Imposables pondérées","Compensables pondérées",null,"Total",null,null,null,null,"  Imposables","Compensables",null,"Imposables pondérées","Compensables pondérées",null,"Total"]
[null,"(1)",null,"(2)","(3)",null,"(4) = (1) X (2)","(5) = (1) X (3)",null,"(6) = (4) + (5)",null,null,"(1)",null,"(2)","(3)",null,"(4) = (1) X (2)","(5) = (1) X (3)",null,"(6) = (4) + (5)",null,null,"(1)",null,"(2)","(3)",null,"(4) = (1) X (2)","(5) = (1) X (3)",null,"(6) = (4) + (5)",null,null,"(1)",null,"(2)","(3)",null,"(4) = (1) X (2)","(5) = (1) X (3)",null,"(6) = (4) + (5)",null,null,"(1)",null,"(2)","(3)",null,"(4) = (1) X (2)","(5) = (1) X (3)",null,"(6) = (4) + (5)",null,null,"(1)",null,"(2)","(3)",null,"(4) = (1) X (2)","(5) = (1) X (3)",null,"(6) = (4) + (5)",null,null,"(1)",null,"(2)","(3)",null,"(4) = (1) X (2)","(5) = (1) X (3)",null,"(6) = (4) + (5)",null,null,"(1)",null,"(2)","(3)",null,"(4) = (1) X (2)","(5) = (1) X (3)",null,"(6) = (4) + (5)",null,null,"(1)",null,"(2)","(3)",null,"(4) = (1) X (2)","(5) = (1) X (3)",null,"(6) = (4) + (5)",null,null,"(1)",null,"(2)","(3)",null,"(4) = (1) X (2)","(5) = (1) X (3)",null,"(6) = (4) + (5)"]
[" 1A",0.999,null,{"$f":"'Sommaire du rôle_sec_5'!H53","v":0},{"$f":"'Sommaire du rôle_sec_5'!I53","v":0},null,{"$f":"D147*B147","v":0},{"$f":"B147*E147","v":0},null,{"$f":"G147+H147","v":0},null," 1A",0.999,null,{"$f":"'Sommaire du rôle_sec_5'!J53","v":0},{"$f":"'Sommaire du rôle_sec_5'!K53","v":0},null,{"$f":"O147*M147","v":0},{"$f":"M147*P147","v":0},null,{"$f":"R147+S147","v":0},null," 1A",0.999,null,{"$f":"'Sommaire du rôle_sec_5'!L53","v":0},{"$f":"'Sommaire du rôle_sec_5'!M53","v":0},null,{"$f":"Z147*X147","v":0},{"$f":"X147*AA147","v":0},null,{"$f":"AC147+AD147","v":0},null," 1A",0.999,null,{"$f":"'Sommaire du rôle_sec_5'!N53","v":0},{"$f":"'Sommaire du rôle_sec_5'!O53","v":0},null,{"$f":"AK147*AI147","v":0},{"$f":"AI147*AL147","v":0},null,{"$f":"AN147+AO147","v":0},null," 1A",0.999,null,{"$f":"'Sommaire du rôle_sec_5'!P53","v":0},{"$f":"'Sommaire du rôle_sec_5'!Q53","v":0},null,{"$f":"AV147*AT147","v":0},{"$f":"AT147*AW147","v":0},null,{"$f":"AY147+AZ147","v":0},null," 1A",0.999,null,{"$f":"'Sommaire du rôle_sec_5'!R53","v":0},{"$f":"'Sommaire du rôle_sec_5'!S53","v":0},null,{"$f":"BG147*BE147","v":0},{"$f":"BE147*BH147","v":0},null,{"$f":"BJ147+BK147","v":0},null," 1A",0.999,null,{"$f":"'Sommaire du rôle_sec_5'!T53","v":0},{"$f":"'Sommaire du rôle_sec_5'!U53","v":0},null,{"$f":"BR147*BP147","v":0},{"$f":"BP147*BS147","v":0},null,{"$f":"BU147+BV147","v":0},null," 1A",0.999,null,{"$f":"'Sommaire du rôle_sec_5'!V53","v":0},{"$f":"'Sommaire du rôle_sec_5'!W53","v":0},null,{"$f":"CC147*CA147","v":0},{"$f":"CA147*CD147","v":0},null,{"$f":"CF147+CG147","v":0},null," 1A",0.999,null,{"$f":"'Sommaire du rôle_sec_5'!X53","v":0},{"$f":"'Sommaire du rôle_sec_5'!Y53","v":0},null,{"$f":"CN147*CL147","v":0},{"$f":"CL147*CO147","v":0},null,{"$f":"CQ147+CR147","v":0},null," 1A",0.999,null,{"$f":"'Sommaire du rôle_sec_5'!Z53","v":0},{"$f":"'Sommaire du rôle_sec_5'!AA53","v":0},null,{"$f":"CY147*CW147","v":0},{"$f":"CW147*CZ147","v":0},null,{"$f":"DB147+DC147","v":0}]
[" 1B",0.995,null,{"$f":"'Sommaire du rôle_sec_5'!H54","v":0},{"$f":"'Sommaire du rôle_sec_5'!I54","v":0},null,0,0,null,0,null," 1B",0.995,null,{"$f":"'Sommaire du rôle_sec_5'!J54","v":0},{"$f":"'Sommaire du rôle_sec_5'!K54","v":0},null,0,0,null,0,null," 1B",0.995,null,{"$f":"'Sommaire du rôle_sec_5'!L54","v":0},{"$f":"'Sommaire du rôle_sec_5'!M54","v":0},null,0,0,null,0,null," 1B",0.995,null,{"$f":"'Sommaire du rôle_sec_5'!N54","v":0},{"$f":"'Sommaire du rôle_sec_5'!O54","v":0},null,0,0,null,0,null," 1B",0.995,null,{"$f":"'Sommaire du rôle_sec_5'!P54","v":0},{"$f":"'Sommaire du rôle_sec_5'!Q54","v":0},null,0,0,null,0,null," 1B",0.995,null,{"$f":"'Sommaire du rôle_sec_5'!R54","v":0},{"$f":"'Sommaire du rôle_sec_5'!S54","v":0},null,0,0,null,0,null," 1B",0.995,null,{"$f":"'Sommaire du rôle_sec_5'!T54","v":0},{"$f":"'Sommaire du rôle_sec_5'!U54","v":0},null,0,0,null,0,null," 1B",0.995,null,{"$f":"'Sommaire du rôle_sec_5'!V54","v":0},{"$f":"'Sommaire du rôle_sec_5'!W54","v":0},null,0,0,null,0,null," 1B",0.995,null,{"$f":"'Sommaire du rôle_sec_5'!X54","v":0},{"$f":"'Sommaire du rôle_sec_5'!Y54","v":0},null,0,0,null,0,null," 1B",0.995,null,{"$f":"'Sommaire du rôle_sec_5'!Z54","v":0},{"$f":"'Sommaire du rôle_sec_5'!AA54","v":0},null,0,0,null,0]
[" 1C",0.99,null,{"$f":"'Sommaire du rôle_sec_5'!H55","v":0},{"$f":"'Sommaire du rôle_sec_5'!I55","v":0},null,0,0,null,0,null," 1C",0.99,null,{"$f":"'Sommaire du rôle_sec_5'!J55","v":0},{"$f":"'Sommaire du rôle_sec_5'!K55","v":0},null,0,0,null,0,null," 1C",0.99,null,{"$f":"'Sommaire du rôle_sec_5'!L55","v":0},{"$f":"'Sommaire du rôle_sec_5'!M55","v":0},null,0,0,null,0,null," 1C",0.99,null,{"$f":"'Sommaire du rôle_sec_5'!N55","v":0},{"$f":"'Sommaire du rôle_sec_5'!O55","v":0},null,0,0,null,0,null," 1C",0.99,null,{"$f":"'Sommaire du rôle_sec_5'!P55","v":0},{"$f":"'Sommaire du rôle_sec_5'!Q55","v":0},null,0,0,null,0,null," 1C",0.99,null,{"$f":"'Sommaire du rôle_sec_5'!R55","v":0},{"$f":"'Sommaire du rôle_sec_5'!S55","v":0},null,0,0,null,0,null," 1C",0.99,null,{"$f":"'Sommaire du rôle_sec_5'!T55","v":0},{"$f":"'Sommaire du rôle_sec_5'!U55","v":0},null,0,0,null,0,null," 1C",0.99,null,{"$f":"'Sommaire du rôle_sec_5'!V55","v":0},{"$f":"'Sommaire du rôle_sec_5'!W55","v":0},null,0,0,null,0,null," 1C",0.99,null,{"$f":"'Sommaire du rôle_sec_5'!X55","v":0},{"$f":"'Sommaire du rôle_sec_5'!Y55","v":0},null,0,0,null,0,null," 1C",0.99,null,{"$f":"'Sommaire du rôle_sec_5'!Z55","v":0},{"$f":"'Sommaire du rôle_sec_5'!AA55","v":0},null,0,0,null,0]
[2,0.97,null,{"$f":"'Sommaire du rôle_sec_5'!H56","v":0},{"$f":"'Sommaire du rôle_sec_5'!I56","v":0},null,0,0,null,0,null,2,0.97,null,{"$f":"'Sommaire du rôle_sec_5'!J56","v":0},{"$f":"'Sommaire du rôle_sec_5'!K56","v":0},null,0,0,null,0,null,2,0.97,null,{"$f":"'Sommaire du rôle_sec_5'!L56","v":0},{"$f":"'Sommaire du rôle_sec_5'!M56","v":0},null,0,0,null,0,null,2,0.97,null,{"$f":"'Sommaire du rôle_sec_5'!N56","v":0},{"$f":"'Sommaire du rôle_sec_5'!O56","v":0},null,0,0,null,0,null,2,0.97,null,{"$f":"'Sommaire du rôle_sec_5'!P56","v":0},{"$f":"'Sommaire du rôle_sec_5'!Q56","v":0},null,0,0,null,0,null,2,0.97,null,{"$f":"'Sommaire du rôle_sec_5'!R56","v":0},{"$f":"'Sommaire du rôle_sec_5'!S56","v":0},null,0,0,null,0,null,2,0.97,null,{"$f":"'Sommaire du rôle_sec_5'!T56","v":0},{"$f":"'Sommaire du rôle_sec_5'!U56","v":0},null,0,0,null,0,null,2,0.97,null,{"$f":"'Sommaire du rôle_sec_5'!V56","v":0},{"$f":"'Sommaire du rôle_sec_5'!W56","v":0},null,0,0,null,0,null,2,0.97,null,{"$f":"'Sommaire du rôle_sec_5'!X56","v":0},{"$f":"'Sommaire du rôle_sec_5'!Y56","v":0},null,0,0,null,0,null,2,0.97,null,{"$f":"'Sommaire du rôle_sec_5'!Z56","v":0},{"$f":"'Sommaire du rôle_sec_5'!AA56","v":0},null,0,0,null,0]
[3,0.94,null,{"$f":"'Sommaire du rôle_sec_5'!H57","v":0},{"$f":"'Sommaire du rôle_sec_5'!I57","v":0},null,0,0,null,0,null,3,0.94,null,{"$f":"'Sommaire du rôle_sec_5'!J57","v":0},{"$f":"'Sommaire du rôle_sec_5'!K57","v":0},null,0,0,null,0,null,3,0.94,null,{"$f":"'Sommaire du rôle_sec_5'!L57","v":0},{"$f":"'Sommaire du rôle_sec_5'!M57","v":0},null,0,0,null,0,null,3,0.94,null,{"$f":"'Sommaire du rôle_sec_5'!N57","v":0},{"$f":"'Sommaire du rôle_sec_5'!O57","v":0},null,0,0,null,0,null,3,0.94,null,{"$f":"'Sommaire du rôle_sec_5'!P57","v":0},{"$f":"'Sommaire du rôle_sec_5'!Q57","v":0},null,0,0,null,0,null,3,0.94,null,{"$f":"'Sommaire du rôle_sec_5'!R57","v":0},{"$f":"'Sommaire du rôle_sec_5'!S57","v":0},null,0,0,null,0,null,3,0.94,null,{"$f":"'Sommaire du rôle_sec_5'!T57","v":0},{"$f":"'Sommaire du rôle_sec_5'!U57","v":0},null,0,0,null,0,null,3,0.94,null,{"$f":"'Sommaire du rôle_sec_5'!V57","v":0},{"$f":"'Sommaire du rôle_sec_5'!W57","v":0},null,0,0,null,0,null,3,0.94,null,{"$f":"'Sommaire du rôle_sec_5'!X57","v":0},{"$f":"'Sommaire du rôle_sec_5'!Y57","v":0},null,0,0,null,0,null,3,0.94,null,{"$f":"'Sommaire du rôle_sec_5'!Z57","v":0},{"$f":"'Sommaire du rôle_sec_5'!AA57","v":0},null,0,0,null,0]
[4,0.88,null,{"$f":"'Sommaire du rôle_sec_5'!H58","v":0},{"$f":"'Sommaire du rôle_sec_5'!I58","v":0},null,0,0,null,0,null,4,0.88,null,{"$f":"'Sommaire du rôle_sec_5'!J58","v":0},{"$f":"'Sommaire du rôle_sec_5'!K58","v":0},null,0,0,null,0,null,4,0.88,null,{"$f":"'Sommaire du rôle_sec_5'!L58","v":0},{"$f":"'Sommaire du rôle_sec_5'!M58","v":0},null,0,0,null,0,null,4,0.88,null,{"$f":"'Sommaire du rôle_sec_5'!N58","v":0},{"$f":"'Sommaire du rôle_sec_5'!O58","v":0},null,0,0,null,0,null,4,0.88,null,{"$f":"'Sommaire du rôle_sec_5'!P58","v":0},{"$f":"'Sommaire du rôle_sec_5'!Q58","v":0},null,0,0,null,0,null,4,0.88,null,{"$f":"'Sommaire du rôle_sec_5'!R58","v":0},{"$f":"'Sommaire du rôle_sec_5'!S58","v":0},null,0,0,null,0,null,4,0.88,null,{"$f":"'Sommaire du rôle_sec_5'!T58","v":0},{"$f":"'Sommaire du rôle_sec_5'!U58","v":0},null,0,0,null,0,null,4,0.88,null,{"$f":"'Sommaire du rôle_sec_5'!V58","v":0},{"$f":"'Sommaire du rôle_sec_5'!W58","v":0},null,0,0,null,0,null,4,0.88,null,{"$f":"'Sommaire du rôle_sec_5'!X58","v":0},{"$f":"'Sommaire du rôle_sec_5'!Y58","v":0},null,0,0,null,0,null,4,0.88,null,{"$f":"'Sommaire du rôle_sec_5'!Z58","v":0},{"$f":"'Sommaire du rôle_sec_5'!AA58","v":0},null,0,0,null,0]
[5,0.78,null,{"$f":"'Sommaire du rôle_sec_5'!H59","v":0},{"$f":"'Sommaire du rôle_sec_5'!I59","v":0},null,0,0,null,0,null,5,0.78,null,{"$f":"'Sommaire du rôle_sec_5'!J59","v":0},{"$f":"'Sommaire du rôle_sec_5'!K59","v":0},null,0,0,null,0,null,5,0.78,null,{"$f":"'Sommaire du rôle_sec_5'!L59","v":0},{"$f":"'Sommaire du rôle_sec_5'!M59","v":0},null,0,0,null,0,null,5,0.78,null,{"$f":"'Sommaire du rôle_sec_5'!N59","v":0},{"$f":"'Sommaire du rôle_sec_5'!O59","v":0},null,0,0,null,0,null,5,0.78,null,{"$f":"'Sommaire du rôle_sec_5'!P59","v":0},{"$f":"'Sommaire du rôle_sec_5'!Q59","v":0},null,0,0,null,0,null,5,0.78,null,{"$f":"'Sommaire du rôle_sec_5'!R59","v":0},{"$f":"'Sommaire du rôle_sec_5'!S59","v":0},null,0,0,null,0,null,5,0.78,null,{"$f":"'Sommaire du rôle_sec_5'!T59","v":0},{"$f":"'Sommaire du rôle_sec_5'!U59","v":0},null,0,0,null,0,null,5,0.78,null,{"$f":"'Sommaire du rôle_sec_5'!V59","v":0},{"$f":"'Sommaire du rôle_sec_5'!W59","v":0},null,0,0,null,0,null,5,0.78,null,{"$f":"'Sommaire du rôle_sec_5'!X59","v":0},{"$f":"'Sommaire du rôle_sec_5'!Y59","v":0},null,0,0,null,0,null,5,0.78,null,{"$f":"'Sommaire du rôle_sec_5'!Z59","v":0},{"$f":"'Sommaire du rôle_sec_5'!AA59","v":0},null,0,0,null,0]
[6,0.6,null,{"$f":"'Sommaire du rôle_sec_5'!H60","v":0},{"$f":"'Sommaire du rôle_sec_5'!I60","v":0},null,0,0,null,0,null,6,0.6,null,{"$f":"'Sommaire du rôle_sec_5'!J60","v":0},{"$f":"'Sommaire du rôle_sec_5'!K60","v":0},null,0,0,null,0,null,6,0.6,null,{"$f":"'Sommaire du rôle_sec_5'!L60","v":0},{"$f":"'Sommaire du rôle_sec_5'!M60","v":0},null,0,0,null,0,null,6,0.6,null,{"$f":"'Sommaire du rôle_sec_5'!N60","v":0},{"$f":"'Sommaire du rôle_sec_5'!O60","v":0},null,0,0,null,0,null,6,0.6,null,{"$f":"'Sommaire du rôle_sec_5'!P60","v":0},{"$f":"'Sommaire du rôle_sec_5'!Q60","v":0},null,0,0,null,0,null,6,0.6,null,{"$f":"'Sommaire du rôle_sec_5'!R60","v":0},{"$f":"'Sommaire du rôle_sec_5'!S60","v":0},null,0,0,null,0,null,6,0.6,null,{"$f":"'Sommaire du rôle_sec_5'!T60","v":0},{"$f":"'Sommaire du rôle_sec_5'!U60","v":0},null,0,0,null,0,null,6,0.6,null,{"$f":"'Sommaire du rôle_sec_5'!V60","v":0},{"$f":"'Sommaire du rôle_sec_5'!W60","v":0},null,0,0,null,0,null,6,0.6,null,{"$f":"'Sommaire du rôle_sec_5'!X60","v":0},{"$f":"'Sommaire du rôle_sec_5'!Y60","v":0},null,0,0,null,0,null,6,0.6,null,{"$f":"'Sommaire du rôle_sec_5'!Z60","v":0},{"$f":"'Sommaire du rôle_sec_5'!AA60","v":0},null,0,0,null,0]
[7,0.4,null,{"$f":"'Sommaire du rôle_sec_5'!H61","v":0},{"$f":"'Sommaire du rôle_sec_5'!I61","v":0},null,0,0,null,0,null,7,0.4,null,{"$f":"'Sommaire du rôle_sec_5'!J61","v":0},{"$f":"'Sommaire du rôle_sec_5'!K61","v":0},null,0,0,null,0,null,7,0.4,null,{"$f":"'Sommaire du rôle_sec_5'!L61","v":0},{"$f":"'Sommaire du rôle_sec_5'!M61","v":0},null,0,0,null,0,null,7,0.4,null,{"$f":"'Sommaire du rôle_sec_5'!N61","v":0},{"$f":"'Sommaire du rôle_sec_5'!O61","v":0},null,0,0,null,0,null,7,0.4,null,{"$f":"'Sommaire du rôle_sec_5'!P61","v":0},{"$f":"'Sommaire du rôle_sec_5'!Q61","v":0},null,0,0,null,0,null,7,0.4,null,{"$f":"'Sommaire du rôle_sec_5'!R61","v":0},{"$f":"'Sommaire du rôle_sec_5'!S61","v":0},null,0,0,null,0,null,7,0.4,null,{"$f":"'Sommaire du rôle_sec_5'!T61","v":0},{"$f":"'Sommaire du rôle_sec_5'!U61","v":0},null,0,0,null,0,null,7,0.4,null,{"$f":"'Sommaire du rôle_sec_5'!V61","v":0},{"$f":"'Sommaire du rôle_sec_5'!W61","v":0},null,0,0,null,0,null,7,0.4,null,{"$f":"'Sommaire du rôle_sec_5'!X61","v":0},{"$f":"'Sommaire du rôle_sec_5'!Y61","v":0},null,0,0,null,0,null,7,0.4,null,{"$f":"'Sommaire du rôle_sec_5'!Z61","v":0},{"$f":"'Sommaire du rôle_sec_5'!AA61","v":0},null,0,0,null,0]
[8,0.15000000000000002,null,{"$f":"'Sommaire du rôle_sec_5'!H62","v":0},{"$f":"'Sommaire du rôle_sec_5'!I62","v":0},null,0,0,null,0,null,8,0.15000000000000002,null,{"$f":"'Sommaire du rôle_sec_5'!J62","v":0},{"$f":"'Sommaire du rôle_sec_5'!K62","v":0},null,0,0,null,0,null,8,0.15000000000000002,null,{"$f":"'Sommaire du rôle_sec_5'!L62","v":0},{"$f":"'Sommaire du rôle_sec_5'!M62","v":0},null,0,0,null,0,null,8,0.15000000000000002,null,{"$f":"'Sommaire du rôle_sec_5'!N62","v":0},{"$f":"'Sommaire du rôle_sec_5'!O62","v":0},null,0,0,null,0,null,8,0.15000000000000002,null,{"$f":"'Sommaire du rôle_sec_5'!P62","v":0},{"$f":"'Sommaire du rôle_sec_5'!Q62","v":0},null,0,0,null,0,null,8,0.15000000000000002,null,{"$f":"'Sommaire du rôle_sec_5'!R62","v":0},{"$f":"'Sommaire du rôle_sec_5'!S62","v":0},null,0,0,null,0,null,8,0.15000000000000002,null,{"$f":"'Sommaire du rôle_sec_5'!T62","v":0},{"$f":"'Sommaire du rôle_sec_5'!U62","v":0},null,0,0,null,0,null,8,0.15000000000000002,null,{"$f":"'Sommaire du rôle_sec_5'!V62","v":0},{"$f":"'Sommaire du rôle_sec_5'!W62","v":0},null,0,0,null,0,null,8,0.15000000000000002,null,{"$f":"'Sommaire du rôle_sec_5'!X62","v":0},{"$f":"'Sommaire du rôle_sec_5'!Y62","v":0},null,0,0,null,0,null,8,0.15000000000000002,null,{"$f":"'Sommaire du rôle_sec_5'!Z62","v":0},{"$f":"'Sommaire du rôle_sec_5'!AA62","v":0},null,0,0,null,0]
["IMMEUBLES SANS PARTIE NON RÉSIDENTIELLE",1,null,{"$f":"'Sommaire du rôle_sec_5'!H63","v":0},{"$f":"'Sommaire du rôle_sec_5'!I63","v":0},null,0,0,null,0,null,"IMMEUBLES SANS PARTIE NON RÉSIDENTIELLE",1,null,{"$f":"'Sommaire du rôle_sec_5'!J63","v":0},{"$f":"'Sommaire du rôle_sec_5'!K63","v":0},null,0,0,null,0,null,"IMMEUBLES SANS PARTIE NON RÉSIDENTIELLE",1,null,{"$f":"'Sommaire du rôle_sec_5'!L63","v":0},{"$f":"'Sommaire du rôle_sec_5'!M63","v":0},null,0,0,null,0,null,"IMMEUBLES SANS PARTIE NON RÉSIDENTIELLE",1,null,{"$f":"'Sommaire du rôle_sec_5'!N63","v":0},{"$f":"'Sommaire du rôle_sec_5'!O63","v":0},null,0,0,null,0,null,"IMMEUBLES SANS PARTIE NON RÉSIDENTIELLE",1,null,{"$f":"'Sommaire du rôle_sec_5'!P63","v":0},{"$f":"'Sommaire du rôle_sec_5'!Q63","v":0},null,0,0,null,0,null,"IMMEUBLES SANS PARTIE NON RÉSIDENTIELLE",1,null,{"$f":"'Sommaire du rôle_sec_5'!R63","v":0},{"$f":"'Sommaire du rôle_sec_5'!S63","v":0},null,0,0,null,0,null,"IMMEUBLES SANS PARTIE NON RÉSIDENTIELLE",1,null,{"$f":"'Sommaire du rôle_sec_5'!T63","v":0},{"$f":"'Sommaire du rôle_sec_5'!U63","v":0},null,0,0,null,0,null,"IMMEUBLES SANS PARTIE NON RÉSIDENTIELLE",1,null,{"$f":"'Sommaire du rôle_sec_5'!V63","v":0},{"$f":"'Sommaire du rôle_sec_5'!W63","v":0},null,0,0,null,0,null,"IMMEUBLES SANS PARTIE NON RÉSIDENTIELLE",1,null,{"$f":"'Sommaire du rôle_sec_5'!X63","v":0},{"$f":"'Sommaire du rôle_sec_5'!Y63","v":0},null,0,0,null,0,null,"IMMEUBLES SANS PARTIE NON RÉSIDENTIELLE",1,null,{"$f":"'Sommaire du rôle_sec_5'!Z63","v":0},{"$f":"'Sommaire du rôle_sec_5'!AA63","v":0},null,0,0,null,0]
["12  CHSLD",0.8,null,null,null,null,0,null,null,null,null,"12  CHSLD",0.8,null,null,null,null,0,null,null,null,null,"12  CHSLD",0.8,null,null,null,null,0,null,null,null,null,"12  CHSLD",0.8,null,null,null,null,0,null,null,null,null,"12  CHSLD",0.8,null,null,null,null,0,null,null,null,null,"12  CHSLD",0.8,null,null,null,null,0,null,null,null,null,"12  CHSLD",0.8,null,null,null,null,0,null,null,null,null,"12  CHSLD",0.8,null,null,null,null,0,null,null,null,null,"12  CHSLD",0.8,null,null,null,null,null,null,null,null,null,"12  CHSLD",0.8]
["13 Cours de triage ",0.6,null,null,null,null,0,null,null,null,null,"13 Cours de triage ",0.6,null,null,null,null,0,null,null,null,null,"13 Cours de triage ",0.6,null,null,null,null,0,null,null,null,null,"13 Cours de triage ",0.6,null,null,null,null,0,null,null,null,null,"13 Cours de triage ",0.6,null,null,null,null,0,null,null,null,null,"13 Cours de triage ",0.6,null,null,null,null,0,null,null,null,null,"13 Cours de triage ",0.6,null,null,null,null,0,null,null,null,null,"13 Cours de triage ",0.6,null,null,null,null,0,null,null,null,null,"13 Cours de triage ",0.6,null,null,null,null,null,null,null,null,null,"13 Cours de triage ",0.6]
["Total",null,null,null,null,null,{"$f":"SUM(G147:G159)","v":0},{"$f":"SUM(H147:H157)","v":0},{"$f":"SUM(I147:I157)","v":0},{"$f":"G160+H160","v":0},null,"Total",null,null,null,null,null,{"$f":"SUM(R147:R159)","v":0},{"$f":"SUM(S147:S157)","v":0},null,{"$f":"R160+S160","v":0},null,"Total",null,null,null,null,null,{"$f":"SUM(AC147:AC159)","v":0},{"$f":"SUM(AD147:AD157)","v":0},null,{"$f":"AC160+AD160","v":0},null,"Total",null,null,null,null,null,{"$f":"SUM(AN147:AN159)","v":0},{"$f":"SUM(AO147:AO157)","v":0},null,{"$f":"AN160+AO160","v":0},null,"Total",null,null,null,null,null,{"$f":"SUM(AY147:AY159)","v":0},{"$f":"SUM(AZ147:AZ157)","v":0},null,{"$f":"AY160+AZ160","v":0},null,"Total",null,null,null,null,null,{"$f":"SUM(BJ147:BJ159)","v":0},{"$f":"SUM(BK147:BK157)","v":0},null,{"$f":"BJ160+BK160","v":0},null,"Total",null,null,null,null,null,{"$f":"SUM(BU147:BU159)","v":0},{"$f":"SUM(BV147:BV157)","v":0},null,{"$f":"BU160+BV160","v":0},null,"Total",null,null,null,null,null,{"$f":"SUM(CF147:CF159)","v":0},{"$f":"SUM(CG147:CG157)","v":0},null,{"$f":"CF160+CG160","v":0},null,"Total",null,null,null,null,null,{"$f":"SUM(CQ147:CQ159)","v":0},{"$f":"SUM(CR147:CR157)","v":0},null,{"$f":"CQ160+CR160","v":0},null,"Total",null,null,null,null,null,{"$f":"SUM(DB147:DB159)","v":0},{"$f":"SUM(DC147:DC157)","v":0},null,{"$f":"DB160+DC160","v":0}]

{"sheet":"Scénario-taux variés","index":11,"n_rows":215,"n_cols":21,"rows_kept":215,"cut":false,"hidden":false,"merged":[[47,2,51,10],[57,6,57,10],[12,11,12,17],[12,19,12,23],[12,6,12,10],[18,2,18,3],[19,2,19,3],[41,0,41,3],[20,2,20,3],[21,2,21,3],[22,2,22,3],[23,2,23,3],[24,2,24,3],[26,4,36,4],[26,5,36,5],[31,2,31,3],[7,0,7,2],[12,4,12,5],[15,2,15,3],[16,2,16,3],[17,2,17,3],[58,13,58,14],[58,15,58,16],[58,17,58,18],[58,19,58,20],[57,11,57,20],[58,11,58,12],[32,2,32,3],[33,2,33,3],[34,2,34,3],[35,2,35,3],[26,2,26,3],[27,2,27,3],[28,2,28,3],[29,2,29,3],[30,2,30,3],[93,7,95,8],[165,1,165,5],[165,7,165,11],[72,2,72,3],[78,2,78,3],[101,7,127,10],[79,2,79,3],[80,2,80,3],[73,2,73,3],[74,2,74,3],[75,2,75,3],[76,2,76,3],[77,2,77,3],[69,2,69,3],[71,4,81,5],[57,4,57,5],[60,2,60,3],[61,2,61,3],[67,2,67,3],[71,2,71,3],[68,2,68,3],[65,2,65,3],[66,2,66,3],[62,2,62,3],[63,2,63,3],[64,2,64,3]]}
[]
[]
["CHOIX DES COEFFICIENTS SELON LES BALISES ET CALCUL DU TAUX DE BASE"]
["Il faut remplir les cases ombragées (motif à points) pour faire fonctionner le simulateur."]
["Note : Les assiettes de taxation du modèle n'incluent que les valeurs imposables.",null,null,null,null,null,null,null,null,null,{"$f":"K$15","v":1.214}]
[]
["Nom de la municipalité =",null,null,null,null,"Année:",2025]
["Population de la municipalité ou de l'agglomération, s'il y a lieu =",null,null,null,1000000,"habitants",null,{"$f":"IF(E8=0,\"Inscrivez  la population\",\"-\")","v":"-"}]
["Recettes de la taxe foncière générale =",null,null,null,473120515,"(prévues au budget)",null,{"$f":"IF(E9=0,\"Inscrivez des recettes\",\"-\")","v":"-"}]
["Nom du scénario ="]
[]
["MULTIPLES DU TAUX DE BASE UNIFORMISÉ (TBU)"]
[{"$f":"A$15","v":"Taux de base sectoriel "},null,null,null,"Balises des coefficients par rapport au taux de base uniformisé (Taux variés) ou Taux de base sectoriel",null,"Coefficients "]
[null,null,null,null,"Minimum ","Maximum","Secteur 1","Secteur 2","Secteur 3","Secteur 4","Secteur 5"]
["Taux de base sectoriel ",null,null,null,0.66600000000000004,1.333,1,0.66600000000000004,1.22,0.9,1.214,{"$f":"IF(OR(G90=0,E210=1),\"-\", \" Les coefficients des taux de base sectoriels ne permettent pas d'obtenir les recettes désirées.\")","v":"-"}]
["Taux sous-catégorie résidentielle 1 (TSCR 1)",null,{"$f":"IF('Sommaire du rôle_sec_1'!H50>0,'Sommaire du rôle_sec_1'!H50,\"-\")","v":"SR1"},null,0.66600000000000004,1.333,1]
["Taux sous-catégorie résidentielle 2 (TSCR 2)",null,{"$f":"IF('Sommaire du rôle_sec_1'!J50>0,'Sommaire du rôle_sec_1'!J50,\"-\")","v":"SR2"},null,0.66600000000000004,1.333,1.333]
["Taux sous-catégorie résidentielle 3 (TSCR 3)",null,{"$f":"IF('Sommaire du rôle_sec_1'!J50>0,'Sommaire du rôle_sec_1'!L50,\"-\")","v":"SR3"},null,0.66600000000000004,1.333,1.333]
["Taux sous-catégorie résidentielle 4 (TSCR 4)",null,{"$f":"IF('Sommaire du rôle_sec_1'!N50>0,'Sommaire du rôle_sec_1'!N50,\"-\")","v":"SR4"},null,0.66600000000000004,1.333,1.333]
["Taux sous-catégorie résidentielle 5 (TSCR 5)",null,{"$f":"IF('Sommaire du rôle_sec_1'!P50>0,'Sommaire du rôle_sec_1'!P50,\"-\")","v":"SR5"},null,0.66600000000000004,1.333,1.333]
["Taux sous-catégorie résidentielle 6 (TSCR6)",null,{"$f":"IF('Sommaire du rôle_sec_1'!R50>0,'Sommaire du rôle_sec_1'!R50,\"-\")","v":"SR6"},null,0.66600000000000004,1.333,1.333]
["Taux sous-catégorie résidentielle 7 (TSCR 7)",null,{"$f":"IF('Sommaire du rôle_sec_1'!T50>0,'Sommaire du rôle_sec_1'!T50,\"-\")","v":"SR7"},null,0.66600000000000004,1.333,1.333]
["Taux sous-catégorie résidentielle 8 (TSCR 8)",null,{"$f":"IF('Sommaire du rôle_sec_1'!V50>0,'Sommaire du rôle_sec_1'!V50,\"-\")","v":"SR8"},null,0.66600000000000004,1.333,1.333]
["Taux sous-catégorie résidentielle 9 (TSCR 9)",null,{"$f":"IF('Sommaire du rôle_sec_1'!X50>0,'Sommaire du rôle_sec_1'!X50,\"-\")","v":"SR9"},null,0.66600000000000004,1.333,1.333]
["Taux sous-catégorie résidentielle 10 (TSCR 10)",null,{"$f":"IF('Sommaire du rôle_sec_1'!Z50>0,'Sommaire du rôle_sec_1'!Z50,\"-\")","v":"SR10"},null,0.66600000000000004,1.333,1.333]
["Taux non résidentiel ou sous-catégorie de référence (TINR)",null,null,null,1,{"$f":"'Balises-Taux'!$B$10","v":4.8},4.8,4,3,2.5,4.5]
["Taux sous-catégorie non résidentielle 1 (TSCNR 1)",null,{"$f":"IF('Sommaire du rôle_sec_1'!H27>0,'Sommaire du rôle_sec_1'!H27,\"-\")","v":"SNR 1"},null,"Le plus grand entre :\n 0,666 X TINR et  1,00 X TBU  ","Le plus petit entre : \n 1,333 X TINR et   Coeff xTBU",{"$f":"G26","v":4.8}]
["Taux sous-catégorie non résidentielle 2 (TSCNR 2)",null,{"$f":"IF('Sommaire du rôle_sec_1'!J27>0,'Sommaire du rôle_sec_1'!J27,\"-\")","v":"SNR 2"},null,null,null,{"$f":"G27","v":4.8}]
["Taux sous-catégorie non résidentielle 3 (TSCNR 3)",null,{"$f":"IF('Sommaire du rôle_sec_1'!J27>0,'Sommaire du rôle_sec_1'!L27,\"-\")","v":"SNR 3"},null,null,null,4.8]
["Taux sous-catégorie non résidentielle 4 (TSCNR 4)",null,{"$f":"IF('Sommaire du rôle_sec_1'!N27>0,'Sommaire du rôle_sec_1'!N27,\"-\")","v":"SNR 4"},null,null,null,4.8]
["Taux sous-catégorie non résidentielle 5 (TSCNR 5)",null,{"$f":"IF('Sommaire du rôle_sec_1'!P27>0,'Sommaire du rôle_sec_1'!P27,\"-\")","v":"SNR 5"},null,null,null,4.8]
["Taux sous-catégorie non résidentielle 6 (TSCNR6)",null,{"$f":"IF('Sommaire du rôle_sec_1'!R27>0,'Sommaire du rôle_sec_1'!R27,\"-\")","v":"SNR 6"},null,null,null,4.8]
["Taux sous-catégorie non résidentielle 7 (TSCNR 7)",null,{"$f":"IF('Sommaire du rôle_sec_1'!T27>0,'Sommaire du rôle_sec_1'!T27,\"-\")","v":"SNR 7"},null,null,null,4.8]
["Taux sous-catégorie non résidentielle 8 (TSCNR 8)",null,{"$f":"IF('Sommaire du rôle_sec_1'!V27>0,'Sommaire du rôle_sec_1'!V27,\"-\")","v":"SNR 8"},null,null,null,4.8]
["Taux sous-catégorie non résidentielle 9 (TSCNR 9)",null,{"$f":"IF('Sommaire du rôle_sec_1'!X27>0,'Sommaire du rôle_sec_1'!X27,\"-\")","v":"SNR 9"},null,null,null,4.8]
["Taux sous-catégorie non résidentielle 10 (TSCNR 10)",null,{"$f":"IF('Sommaire du rôle_sec_1'!Z27>0,'Sommaire du rôle_sec_1'!Z27,\"-\")","v":"SNR 10"},null,null,null,4.8]
["Taux industriel (TIND)",null,null,null,null,null,5,null,null,null,5]
["Taux des terrains vagues desservis (TTVD) ",null,null,null,1,4,4,2,2,3,4]
["Taux forestier (TFOREST)",null,null,null,0.66600000000000004,1,1]
["Taux agricole (TAGRI) ",null,null,null,0.66600000000000004,1,1]
[]
[{"$f":"IF(OR(G90=0,E210=1),\"-\",\" ** Explications**\")","v":"-"}]
[{"$f":"IF(OR(G90=0,E210=1),\"-\",\"La combinaison des coefficients pour les taux de base sectoriels ne permet pas d'obtenir des taux de taxe générant les recettes désirées.\")","v":"-"}]
[]
[{"$f":"IF(OR(G90=0,E210=1),\"-\",\"Par exemple, un coefficient générant un taux de base plus faible doit être compensé par un ou des coefficients plus élevés dans les autres secteurs afin d'obtenir les recettes désirées.\")","v":"-"}]
[]
[{"$f":"IF(OR(G90=0,E210=1),\"-\", \"Afin de rééquilibrer les taux, vous pouvez utiliser l'un des coefficients des taux de base sectoriels suivants :\")","v":"-"}]
[{"$f":"IF(OR(G90=0,E210=1),\"-\",\"Secteur 1\")","v":"-"},{"$f":"IF(OR(B90=0,E210=1),\"-\",IF(AND('Calculs taux de base'!C10>=0.666,'Calculs taux de base'!C10<=1.333),'Calculs taux de base'!C10,\"-\"))","v":"-"},{"$f":"IF(OR(G90=0,E210=1),\"-\",\" ◄ PRENDRE UNIQUEMENT UN DES COEFFICIENTS DES TAUX DE BASE SECTORIELS À GAUCHE ET L'INSCRIRE À LIGNE 15 DU SECTEUR.\")","v":"-"}]
[{"$f":"IF(OR(G90=0,E210=1),\"-\",\"Secteur 2\")","v":"-"},{"$f":"IF(OR(C90=0,E210=1),\"-\",IF(AND('Calculs taux de base'!D17>=0.666,'Calculs taux de base'!D17<=1.333),'Calculs taux de base'!D17,\"-\"))","v":"-"}]
[{"$f":"IF(OR(G90=0,E210=1),\"-\",\"Secteur 3\")","v":"-"},{"$f":"IF(OR(D90=0,E210=1),\"-\",IF(AND('Calculs taux de base'!E23>=0.666,'Calculs taux de base'!E23<=1.333),'Calculs taux de base'!E23,\"-\"))","v":"-"}]
[{"$f":"IF(OR(G90=0,E210=1),\"-\",\"Secteur 4\")","v":"-"},{"$f":"IF(OR(E90=0,E210=1),\"-\",IF(AND('Calculs taux de base'!F30>=0.666,'Calculs taux de base'!F30<=1.333),'Calculs taux de base'!F30,\"-\"))","v":"-"}]
[{"$f":"IF(OR(G90=0,E210=1),\"-\",\"Secteur 5\")","v":"-"},{"$f":"IF(OR(F90=0,E210=1),\"-\",IF(AND('Calculs taux de base'!G37>=0.666,'Calculs taux de base'!G37<=1.333),'Calculs taux de base'!G37,\"-\"))","v":"-"}]
[{"$f":"IF(OR(G90=0,E210=1),\"-\",\"Autrement, le simulateur devra recalculer l'ensemble des coefficients qui permettront d'obtenir les recettes désirées. Il est possible que ce calcul implique que certains coefficients ne respectent pas les balises.\")","v":"-"}]
[]
[]
["Validation des coefficients nécessaires pour obtenir les recettes désirées."]
[{"$f":"IF(OR(G90=0,E210=1),\"-\",\"Les coefficients sont différents de ceux qui ont été choisis afin d'obtenir les recettes désirées.\")","v":"-"}]
[null,null,null,null,"Balises des coefficients par rapport au taux de base uniformisé (Taux variés) ou Taux de base sectoriel",null,"Coefficients pour obtenir les recettes désirées",null,null,null,null,"Validation"]
[null,null,null,null,"Minimum ","Maximum","Secteur 1","Secteur 2","Secteur 3","Secteur 4","Secteur 5","Secteur 1",null,"Secteur 2",null,"Secteur 3",null,"Secteur 4",null,"Secteur 5"]
["Taux de base sectoriel  (TB)",null,null,null,0.66600000000000004,1.333,{"$f":"ROUND(IF(B$90=0,0,C102/$H$97),4)","v":1},{"$f":"ROUND(IF(C$90=0,0,D102/$H$97),4)","v":0.66600000000000004},1.22,0.9,1.214,{"$f":"IF(G60>0,IF(AND($E60<=G60,$F60>=G60),\"-\",\"INVALIDE\"),\"-\")","v":"-"},{"$f":"IF(L60=\"INVALIDE\",IF(G60<$E60,\"Le coefficient est inférieur au minimum.\",\"Le coefficient est supérieur au maximum.\"),\"-\")","v":"-"},{"$f":"IF(H60>0,IF(AND($E60<=H60,$F60>=H60),\"-\",\"INVALIDE\"),\"-\")","v":"-"},{"$f":"IF(N60=\"INVALIDE\",IF(H60<$E60,\"Le coefficient est inférieur au minimum.\",\"Le coefficient est supérieur au maximum.\"),\"-\")","v":"-"},{"$f":"IF(I60>0,IF(AND($E60<=I60,$F60>=I60),\"-\",\"INVALIDE\"),\"-\")","v":"-"},{"$f":"IF(P60=\"INVALIDE\",IF(I60<$E60,\"Le coefficient est inférieur au minimum.\",\"Le coefficient est supérieur au maximum.\"),\"-\")","v":"-"},{"$f":"IF(J60>0,IF(AND($E60<=J60,$F60>=J60),\"-\",\"INVALIDE\"),\"-\")","v":"-"},{"$f":"IF(R60=\"INVALIDE\",IF(J60<$E60,\"Le coefficient est inférieur au minimum.\",\"Le coefficient est supérieur au maximum.\"),\"-\")","v":"-"},{"$f":"IF(K60>0,IF(AND($E60<=K60,$F60>=K60),\"-\",\"INVALIDE\"),\"-\")","v":"-"},{"$f":"IF(T60=\"INVALIDE\",IF(K60<$E60,\"Le coefficient est inférieur au minimum.\",\"Le coefficient est supérieur au maximum.\"),\"-\")","v":"-"}]
["Taux sous-catégorie résidentielle 1 (TSCR 1)",null,{"$f":"C16","v":"SR1"},null,0.66600000000000004,1.333,{"$f":"ROUND(IF(B$90=0,0,C103/$H$97),4)","v":1},{"$f":"ROUND(IF(C$90=0,0,D103/$H$97),4)","v":0.66600000000000004},{"$f":"ROUND(IF(D$90=0,0,E103/$H$97),4)","v":1.22},{"$f":"ROUND(IF(E$90=0,0,F103/$H$97),4)","v":0.9},{"$f":"ROUND(IF(F$90=0,0,G103/$H$97),4)","v":1.214},{"$f":"IF(G$60=G61, \"-\",IF(G61>0,IF(AND($E61<=G61,$F61>=G61),\"-\",\"INVALIDE\"),\"-\"))","v":"-"},"-",{"$f":"IF(H$60=H61, \"-\",IF(H61>0,IF(AND($E61<=H61,$F61>=H61),\"-\",\"INVALIDE\"),\"-\"))","v":"-"},"-",{"$f":"IF(I$60=I61, \"-\",IF(I61>0,IF(AND($E61<=I61,$F61>=I61),\"-\",\"INVALIDE\"),\"-\"))","v":"-"},"-",{"$f":"IF(J$60=J61, \"-\",IF(J61>0,IF(AND($E61<=J61,$F61>=J61),\"-\",\"INVALIDE\"),\"-\"))","v":"-"},"-",{"$f":"IF(K$60=K61, \"-\",IF(K61>0,IF(AND($E61<=K61,$F61>=K61),\"-\",\"INVALIDE\"),\"-\"))","v":"-"},"-"]
["Taux sous-catégorie résidentielle 2 (TSCR 2)",null,{"$f":"C17","v":"SR2"},null,0.66600000000000004,1.333,1.333,0.66600000000000004,1.22,0.9,1.214,{"$f":"IF(G$60=G62, \"-\",IF(G62>0,IF(AND($E62<=G62,$F62>=G62),\"-\",\"INVALIDE\"),\"-\"))","v":"-"},"-","-","-","-","-","-","-","-","-"]
["Taux sous-catégorie résidentielle 3 (TSCR 3)",null,"SR3",null,0.66600000000000004,1.333,1.333,0.66600000000000004,1.22,0.9,1.214,"-","-","-","-","-","-","-","-","-","-"]
["Taux sous-catégorie résidentielle 4 (TSCR 4)",null,"SR4",null,0.66600000000000004,1.333,1.333,0.66600000000000004,1.22,0.9,1.214,"-","-","-","-","-","-","-","-","-","-"]
["Taux sous-catégorie résidentielle 5 (TSCR 5)",null,"SR5",null,0.66600000000000004,1.333,1.333,0.66600000000000004,1.22,0.9,1.214,"-","-","-","-","-","-","-","-","-","-"]
["Taux sous-catégorie résidentielle 6 (TSCR6)",null,"SR6",null,0.66600000000000004,1.333,1.333,0.66600000000000004,1.22,0.9,1.214,"-","-","-","-","-","-","-","-","-","-"]
["Taux sous-catégorie résidentielle 7 (TSCR 7)",null,"SR7",null,0.66600000000000004,1.333,1.333,0.66600000000000004,1.22,0.9,1.214,"-","-","-","-","-","-","-","-","-","-"]
["Taux sous-catégorie résidentielle 8 (TSCR 8)",null,"SR8",null,0.66600000000000004,1.333,1.333,0.66600000000000004,1.22,0.9,1.214,"-","-","-","-","-","-","-","-","-","-"]
["Taux sous-catégorie résidentielle 9 (TSCR 9)",null,"SR9",null,0.66600000000000004,1.333,1.333,0.66600000000000004,1.22,0.9,1.214,"-","-","-","-","-","-","-","-","-","-"]
["Taux sous-catégorie résidentielle 10 (TSCR 10)",null,"SR10",null,0.66600000000000004,1.333,1.333,0.66600000000000004,1.22,0.9,1.214,"-","-","-","-","-","-","-","-","-","-"]
["Taux non résidentiel ou sous-catégorie de référence (TINR)",null,null,null,1,{"$f":"'Balises-Taux'!$B$10","v":4.8},4.8,4,3,2.5,4.5,{"$f":"IF(G$60=G71, \"-\",IF(G71>0,IF(AND($E71<=G71,$F71>=G71),\"-\",\"INVALIDE\"),\"-\"))","v":"-"},"-","-","-","-","-","-","-",{"$f":"IF(K$60=K71, \"-\",IF(K71>0,IF(AND($E71<=K71,$F71>=K71),\"-\",\"INVALIDE\"),\"-\"))","v":"-"},"-"]
["Taux sous-catégorie non résidentielle 1 (TSCNR 1)",null,{"$f":"C27","v":"SNR 1"},null,"Voir Balises-Taux",null,4.8,4,3,2.5,4.5,{"$f":"IF(AND(G$60=G$71,G$60=G72), \"-\",IF(G72>0,IF(AND('Balises-Taux'!$C$22<=G72,'Balises-Taux'!$F$22>=G72),\"-\",\"INVALIDE\"),\"-\"))","v":"-"},{"$f":"IF(L72=\"INVALIDE\",IF(G72<'Balises-Taux'!C$22,\"Le coefficient est inférieur au minimum.\",\"Le coefficient est supérieur au maximum.\"),\"-\")","v":"-"},{"$f":"IF(AND($H$60=H$71,$H$60=H72), \"-\",IF(H72>0,IF(AND('Balises-Taux'!$C$28<=H72,'Balises-Taux'!$F$28>=H72),\"-\",\"INVALIDE\"),\"-\"))","v":"-"},{"$f":"IF(N72=\"INVALIDE\",IF(H72<'Balises-Taux'!C$28,\"Le coefficient est inférieur au minimum.\",\"Le coefficient est supérieur au maximum.\"),\"-\")","v":"-"},{"$f":"IF(AND($I$60=I$71,I$60=I72), \"-\",IF(I72>0,IF(AND('Balises-Taux'!$C$34<=I72,'Balises-Taux'!$F$34>=I72),\"-\",\"INVALIDE\"),\"-\"))","v":"-"},{"$f":"IF(P72=\"INVALIDE\",IF(I72<'Balises-Taux'!C$34,\"Le coefficient est inférieur au minimum.\",\"Le coefficient est supérieur au maximum.\"),\"-\")","v":"-"},{"$f":"IF(AND($J$60=J71,J$60=J72), \"-\",IF(J72>0,IF(AND('Balises-Taux'!$C$40<=J72,'Balises-Taux'!$F$40>=J72),\"-\",\"INVALIDE\"),\"-\"))","v":"-"},{"$f":"IF(R72=\"INVALIDE\",IF(J72<'Balises-Taux'!C$40,\"Le coefficient est inférieur au minimum.\",\"Le coefficient est supérieur au maximum.\"),\"-\")","v":"-"},{"$f":"IF(AND($K$60=K$71,K$60=K72), \"-\",IF(K72>0,IF(AND('Balises-Taux'!$C$46<=K72,'Balises-Taux'!$F$46>=K72),\"-\",\"INVALIDE\"),\"-\"))","v":"-"},{"$f":"IF(T72=\"INVALIDE\",IF(K72<'Balises-Taux'!C46,\"Le coefficient est inférieur au minimum.\",\"Le coefficient est supérieur au maximum.\"),\"-\")","v":"-"}]
["Taux sous-catégorie non résidentielle 2 (TSCNR 2)",null,{"$f":"C28","v":"SNR 2"},null,null,null,4.8,4,3,2.5,4.5,{"$f":"IF(AND(G$60=G$71,G$60=G73), \"-\",IF(G73>0,IF(AND('Balises-Taux'!$C$22<=G73,'Balises-Taux'!$F$22>=G73),\"-\",\"INVALIDE\"),\"-\"))","v":"-"},{"$f":"IF(L73=\"INVALIDE\",IF(G73<'Balises-Taux'!C$22,\"Le coefficient est inférieur au minimum.\",\"Le coefficient est supérieur au maximum.\"),\"-\")","v":"-"},{"$f":"IF(AND($H$60=H$71,$H$60=H73), \"-\",IF(H73>0,IF(AND('Balises-Taux'!$C$28<=H73,'Balises-Taux'!$F$28>=H73),\"-\",\"INVALIDE\"),\"-\"))","v":"-"},{"$f":"IF(N73=\"INVALIDE\",IF(H73<'Balises-Taux'!C$28,\"Le coefficient est inférieur au minimum.\",\"Le coefficient est supérieur au maximum.\"),\"-\")","v":"-"},{"$f":"IF(AND($I$60=I$71,I$60=I73), \"-\",IF(I73>0,IF(AND('Balises-Taux'!$C$34<=I73,'Balises-Taux'!$F$34>=I73),\"-\",\"INVALIDE\"),\"-\"))","v":"-"},{"$f":"IF(P73=\"INVALIDE\",IF(I73<'Balises-Taux'!C$34,\"Le coefficient est inférieur au minimum.\",\"Le coefficient est supérieur au maximum.\"),\"-\")","v":"-"},{"$f":"IF(AND($J$60=J72,J$60=J73), \"-\",IF(J73>0,IF(AND('Balises-Taux'!$C$40<=J73,'Balises-Taux'!$F$40>=J73),\"-\",\"INVALIDE\"),\"-\"))","v":"-"},{"$f":"IF(R73=\"INVALIDE\",IF(J73<'Balises-Taux'!C$40,\"Le coefficient est inférieur au minimum.\",\"Le coefficient est supérieur au maximum.\"),\"-\")","v":"-"},{"$f":"IF(AND($K$60=K$71,K$60=K73), \"-\",IF(K73>0,IF(AND('Balises-Taux'!$C$46<=K73,'Balises-Taux'!$F$46>=K73),\"-\",\"INVALIDE\"),\"-\"))","v":"-"},{"$f":"IF(T73=\"INVALIDE\",IF(K73<'Balises-Taux'!C47,\"Le coefficient est inférieur au minimum.\",\"Le coefficient est supérieur au maximum.\"),\"-\")","v":"-"}]
["Taux sous-catégorie non résidentielle 3 (TSCNR 3)",null,"SNR 3",null,null,null,4.8,4,3,2.5,4.5,{"$f":"IF(AND(G$60=G$71,G$60=G74), \"-\",IF(G74>0,IF(AND('Balises-Taux'!$C$22<=G74,'Balises-Taux'!$F$22>=G74),\"-\",\"INVALIDE\"),\"-\"))","v":"-"},{"$f":"IF(L74=\"INVALIDE\",IF(G74<'Balises-Taux'!C$22,\"Le coefficient est inférieur au minimum.\",\"Le coefficient est supérieur au maximum.\"),\"-\")","v":"-"},{"$f":"IF(AND($H$60=H$71,$H$60=H74), \"-\",IF(H74>0,IF(AND('Balises-Taux'!$C$28<=H74,'Balises-Taux'!$F$28>=H74),\"-\",\"INVALIDE\"),\"-\"))","v":"-"},{"$f":"IF(N74=\"INVALIDE\",IF(H74<'Balises-Taux'!C$28,\"Le coefficient est inférieur au minimum.\",\"Le coefficient est supérieur au maximum.\"),\"-\")","v":"-"},{"$f":"IF(AND($I$60=I$71,I$60=I74), \"-\",IF(I74>0,IF(AND('Balises-Taux'!$C$34<=I74,'Balises-Taux'!$F$34>=I74),\"-\",\"INVALIDE\"),\"-\"))","v":"-"},{"$f":"IF(P74=\"INVALIDE\",IF(I74<'Balises-Taux'!C$34,\"Le coefficient est inférieur au minimum.\",\"Le coefficient est supérieur au maximum.\"),\"-\")","v":"-"},{"$f":"IF(AND($J$60=J73,J$60=J74), \"-\",IF(J74>0,IF(AND('Balises-Taux'!$C$40<=J74,'Balises-Taux'!$F$40>=J74),\"-\",\"INVALIDE\"),\"-\"))","v":"-"},{"$f":"IF(R74=\"INVALIDE\",IF(J74<'Balises-Taux'!C$40,\"Le coefficient est inférieur au minimum.\",\"Le coefficient est supérieur au maximum.\"),\"-\")","v":"-"},{"$f":"IF(AND($K$60=K$71,K$60=K74), \"-\",IF(K74>0,IF(AND('Balises-Taux'!$C$46<=K74,'Balises-Taux'!$F$46>=K74),\"-\",\"INVALIDE\"),\"-\"))","v":"-"},{"$f":"IF(T74=\"INVALIDE\",IF(K74<'Balises-Taux'!C48,\"Le coefficient est inférieur au minimum.\",\"Le coefficient est supérieur au maximum.\"),\"-\")","v":"-"}]
["Taux sous-catégorie non résidentielle 4 (TSCNR 4)",null,"SNR 4",null,null,null,4.8,4,3,2.5,4.5,{"$f":"IF(AND(G$60=G$71,G$60=G75), \"-\",IF(G75>0,IF(AND('Balises-Taux'!$C$22<=G75,'Balises-Taux'!$F$22>=G75),\"-\",\"INVALIDE\"),\"-\"))","v":"-"},{"$f":"IF(L75=\"INVALIDE\",IF(G75<'Balises-Taux'!C$22,\"Le coefficient est inférieur au minimum.\",\"Le coefficient est supérieur au maximum.\"),\"-\")","v":"-"},{"$f":"IF(AND($H$60=H$71,$H$60=H75), \"-\",IF(H75>0,IF(AND('Balises-Taux'!$C$28<=H75,'Balises-Taux'!$F$28>=H75),\"-\",\"INVALIDE\"),\"-\"))","v":"-"},{"$f":"IF(N75=\"INVALIDE\",IF(H75<'Balises-Taux'!C$28,\"Le coefficient est inférieur au minimum.\",\"Le coefficient est supérieur au maximum.\"),\"-\")","v":"-"},{"$f":"IF(AND($I$60=I$71,I$60=I75), \"-\",IF(I75>0,IF(AND('Balises-Taux'!$C$34<=I75,'Balises-Taux'!$F$34>=I75),\"-\",\"INVALIDE\"),\"-\"))","v":"-"},{"$f":"IF(P75=\"INVALIDE\",IF(I75<'Balises-Taux'!C$34,\"Le coefficient est inférieur au minimum.\",\"Le coefficient est supérieur au maximum.\"),\"-\")","v":"-"},{"$f":"IF(AND($J$60=J74,J$60=J75), \"-\",IF(J75>0,IF(AND('Balises-Taux'!$C$40<=J75,'Balises-Taux'!$F$40>=J75),\"-\",\"INVALIDE\"),\"-\"))","v":"-"},{"$f":"IF(R75=\"INVALIDE\",IF(J75<'Balises-Taux'!C$40,\"Le coefficient est inférieur au minimum.\",\"Le coefficient est supérieur au maximum.\"),\"-\")","v":"-"},{"$f":"IF(AND($K$60=K$71,K$60=K75), \"-\",IF(K75>0,IF(AND('Balises-Taux'!$C$46<=K75,'Balises-Taux'!$F$46>=K75),\"-\",\"INVALIDE\"),\"-\"))","v":"-"},{"$f":"IF(T75=\"INVALIDE\",IF(K75<'Balises-Taux'!C49,\"Le coefficient est inférieur au minimum.\",\"Le coefficient est supérieur au maximum.\"),\"-\")","v":"-"}]
["Taux sous-catégorie non résidentielle 5 (TSCNR 5)",null,"SNR 5",null,null,null,4.8,4,3,2.5,4.5,{"$f":"IF(AND(G$60=G$71,G$60=G76), \"-\",IF(G76>0,IF(AND('Balises-Taux'!$C$22<=G76,'Balises-Taux'!$F$22>=G76),\"-\",\"INVALIDE\"),\"-\"))","v":"-"},{"$f":"IF(L76=\"INVALIDE\",IF(G76<'Balises-Taux'!C$22,\"Le coefficient est inférieur au minimum.\",\"Le coefficient est supérieur au maximum.\"),\"-\")","v":"-"},{"$f":"IF(AND($H$60=H$71,$H$60=H76), \"-\",IF(H76>0,IF(AND('Balises-Taux'!$C$28<=H76,'Balises-Taux'!$F$28>=H76),\"-\",\"INVALIDE\"),\"-\"))","v":"-"},{"$f":"IF(N76=\"INVALIDE\",IF(H76<'Balises-Taux'!C$28,\"Le coefficient est inférieur au minimum.\",\"Le coefficient est supérieur au maximum.\"),\"-\")","v":"-"},{"$f":"IF(AND($I$60=I$71,I$60=I76), \"-\",IF(I76>0,IF(AND('Balises-Taux'!$C$34<=I76,'Balises-Taux'!$F$34>=I76),\"-\",\"INVALIDE\"),\"-\"))","v":"-"},{"$f":"IF(P76=\"INVALIDE\",IF(I76<'Balises-Taux'!C$34,\"Le coefficient est inférieur au minimum.\",\"Le coefficient est supérieur au maximum.\"),\"-\")","v":"-"},{"$f":"IF(AND($J$60=J75,J$60=J76), \"-\",IF(J76>0,IF(AND('Balises-Taux'!$C$40<=J76,'Balises-Taux'!$F$40>=J76),\"-\",\"INVALIDE\"),\"-\"))","v":"-"},{"$f":"IF(R76=\"INVALIDE\",IF(J76<'Balises-Taux'!C$40,\"Le coefficient est inférieur au minimum.\",\"Le coefficient est supérieur au maximum.\"),\"-\")","v":"-"},{"$f":"IF(AND($K$60=K$71,K$60=K76), \"-\",IF(K76>0,IF(AND('Balises-Taux'!$C$46<=K76,'Balises-Taux'!$F$46>=K76),\"-\",\"INVALIDE\"),\"-\"))","v":"-"},{"$f":"IF(T76=\"INVALIDE\",IF(K76<'Balises-Taux'!C50,\"Le coefficient est inférieur au minimum.\",\"Le coefficient est supérieur au maximum.\"),\"-\")","v":"-"}]
["Taux sous-catégorie non résidentielle 6 (TSCNR6)",null,"SNR 6",null,null,null,4.8,4,3,2.5,4.5,{"$f":"IF(AND(G$60=G$71,G$60=G77), \"-\",IF(G77>0,IF(AND('Balises-Taux'!$C$22<=G77,'Balises-Taux'!$F$22>=G77),\"-\",\"INVALIDE\"),\"-\"))","v":"-"},{"$f":"IF(L77=\"INVALIDE\",IF(G77<'Balises-Taux'!C$22,\"Le coefficient est inférieur au minimum.\",\"Le coefficient est supérieur au maximum.\"),\"-\")","v":"-"},{"$f":"IF(AND($H$60=H$71,$H$60=H77), \"-\",IF(H77>0,IF(AND('Balises-Taux'!$C$28<=H77,'Balises-Taux'!$F$28>=H77),\"-\",\"INVALIDE\"),\"-\"))","v":"-"},{"$f":"IF(N77=\"INVALIDE\",IF(H77<'Balises-Taux'!C$28,\"Le coefficient est inférieur au minimum.\",\"Le coefficient est supérieur au maximum.\"),\"-\")","v":"-"},{"$f":"IF(AND($I$60=I$71,I$60=I77), \"-\",IF(I77>0,IF(AND('Balises-Taux'!$C$34<=I77,'Balises-Taux'!$F$34>=I77),\"-\",\"INVALIDE\"),\"-\"))","v":"-"},{"$f":"IF(P77=\"INVALIDE\",IF(I77<'Balises-Taux'!C$34,\"Le coefficient est inférieur au minimum.\",\"Le coefficient est supérieur au maximum.\"),\"-\")","v":"-"},{"$f":"IF(AND($J$60=J76,J$60=J77), \"-\",IF(J77>0,IF(AND('Balises-Taux'!$C$40<=J77,'Balises-Taux'!$F$40>=J77),\"-\",\"INVALIDE\"),\"-\"))","v":"-"},{"$f":"IF(R77=\"INVALIDE\",IF(J77<'Balises-Taux'!C$40,\"Le coefficient est inférieur au minimum.\",\"Le coefficient est supérieur au maximum.\"),\"-\")","v":"-"},{"$f":"IF(AND($K$60=K$71,K$60=K77), \"-\",IF(K77>0,IF(AND('Balises-Taux'!$C$46<=K77,'Balises-Taux'!$F$46>=K77),\"-\",\"INVALIDE\"),\"-\"))","v":"-"},{"$f":"IF(T77=\"INVALIDE\",IF(K77<'Balises-Taux'!C51,\"Le coefficient est inférieur au minimum.\",\"Le coefficient est supérieur au maximum.\"),\"-\")","v":"-"}]
["Taux sous-catégorie non résidentielle 7 (TSCNR 7)",null,"SNR 7",null,null,null,4.8,4,3,2.5,4.5,{"$f":"IF(AND(G$60=G$71,G$60=G78), \"-\",IF(G78>0,IF(AND('Balises-Taux'!$C$22<=G78,'Balises-Taux'!$F$22>=G78),\"-\",\"INVALIDE\"),\"-\"))","v":"-"},{"$f":"IF(L78=\"INVALIDE\",IF(G78<'Balises-Taux'!C$22,\"Le coefficient est inférieur au minimum.\",\"Le coefficient est supérieur au maximum.\"),\"-\")","v":"-"},{"$f":"IF(AND($H$60=H$71,$H$60=H78), \"-\",IF(H78>0,IF(AND('Balises-Taux'!$C$28<=H78,'Balises-Taux'!$F$28>=H78),\"-\",\"INVALIDE\"),\"-\"))","v":"-"},{"$f":"IF(N78=\"INVALIDE\",IF(H78<'Balises-Taux'!C$28,\"Le coefficient est inférieur au minimum.\",\"Le coefficient est supérieur au maximum.\"),\"-\")","v":"-"},{"$f":"IF(AND($I$60=I$71,I$60=I78), \"-\",IF(I78>0,IF(AND('Balises-Taux'!$C$34<=I78,'Balises-Taux'!$F$34>=I78),\"-\",\"INVALIDE\"),\"-\"))","v":"-"},{"$f":"IF(P78=\"INVALIDE\",IF(I78<'Balises-Taux'!C$34,\"Le coefficient est inférieur au minimum.\",\"Le coefficient est supérieur au maximum.\"),\"-\")","v":"-"},{"$f":"IF(AND($J$60=J77,J$60=J78), \"-\",IF(J78>0,IF(AND('Balises-Taux'!$C$40<=J78,'Balises-Taux'!$F$40>=J78),\"-\",\"INVALIDE\"),\"-\"))","v":"-"},{"$f":"IF(R78=\"INVALIDE\",IF(J78<'Balises-Taux'!C$40,\"Le coefficient est inférieur au minimum.\",\"Le coefficient est supérieur au maximum.\"),\"-\")","v":"-"},{"$f":"IF(AND($K$60=K$71,K$60=K78), \"-\",IF(K78>0,IF(AND('Balises-Taux'!$C$46<=K78,'Balises-Taux'!$F$46>=K78),\"-\",\"INVALIDE\"),\"-\"))","v":"-"},{"$f":"IF(T78=\"INVALIDE\",IF(K78<'Balises-Taux'!C52,\"Le coefficient est inférieur au minimum.\",\"Le coefficient est supérieur au maximum.\"),\"-\")","v":"-"}]
["Taux sous-catégorie non résidentielle 8 (TSCNR 8)",null,"SNR 8",null,null,null,4.8,4,3,2.5,4.5,{"$f":"IF(AND(G$60=G$71,G$60=G79), \"-\",IF(G79>0,IF(AND('Balises-Taux'!$C$22<=G79,'Balises-Taux'!$F$22>=G79),\"-\",\"INVALIDE\"),\"-\"))","v":"-"},{"$f":"IF(L79=\"INVALIDE\",IF(G79<'Balises-Taux'!C$22,\"Le coefficient est inférieur au minimum.\",\"Le coefficient est supérieur au maximum.\"),\"-\")","v":"-"},{"$f":"IF(AND($H$60=H$71,$H$60=H79), \"-\",IF(H79>0,IF(AND('Balises-Taux'!$C$28<=H79,'Balises-Taux'!$F$28>=H79),\"-\",\"INVALIDE\"),\"-\"))","v":"-"},{"$f":"IF(N79=\"INVALIDE\",IF(H79<'Balises-Taux'!C$28,\"Le coefficient est inférieur au minimum.\",\"Le coefficient est supérieur au maximum.\"),\"-\")","v":"-"},{"$f":"IF(AND($I$60=I$71,I$60=I79), \"-\",IF(I79>0,IF(AND('Balises-Taux'!$C$34<=I79,'Balises-Taux'!$F$34>=I79),\"-\",\"INVALIDE\"),\"-\"))","v":"-"},{"$f":"IF(P79=\"INVALIDE\",IF(I79<'Balises-Taux'!C$34,\"Le coefficient est inférieur au minimum.\",\"Le coefficient est supérieur au maximum.\"),\"-\")","v":"-"},{"$f":"IF(AND($J$60=J78,J$60=J79), \"-\",IF(J79>0,IF(AND('Balises-Taux'!$C$40<=J79,'Balises-Taux'!$F$40>=J79),\"-\",\"INVALIDE\"),\"-\"))","v":"-"},{"$f":"IF(R79=\"INVALIDE\",IF(J79<'Balises-Taux'!C$40,\"Le coefficient est inférieur au minimum.\",\"Le coefficient est supérieur au maximum.\"),\"-\")","v":"-"},{"$f":"IF(AND($K$60=K$71,K$60=K79), \"-\",IF(K79>0,IF(AND('Balises-Taux'!$C$46<=K79,'Balises-Taux'!$F$46>=K79),\"-\",\"INVALIDE\"),\"-\"))","v":"-"},{"$f":"IF(T79=\"INVALIDE\",IF(K79<'Balises-Taux'!C53,\"Le coefficient est inférieur au minimum.\",\"Le coefficient est supérieur au maximum.\"),\"-\")","v":"-"}]
["Taux sous-catégorie non résidentielle 9 (TSCNR 9)",null,"SNR 9",null,null,null,4.8,4,3,2.5,4.5,{"$f":"IF(AND(G$60=G$71,G$60=G80), \"-\",IF(G80>0,IF(AND('Balises-Taux'!$C$22<=G80,'Balises-Taux'!$F$22>=G80),\"-\",\"INVALIDE\"),\"-\"))","v":"-"},{"$f":"IF(L80=\"INVALIDE\",IF(G80<'Balises-Taux'!C$22,\"Le coefficient est inférieur au minimum.\",\"Le coefficient est supérieur au maximum.\"),\"-\")","v":"-"},{"$f":"IF(AND($H$60=H$71,$H$60=H80), \"-\",IF(H80>0,IF(AND('Balises-Taux'!$C$28<=H80,'Balises-Taux'!$F$28>=H80),\"-\",\"INVALIDE\"),\"-\"))","v":"-"},{"$f":"IF(N80=\"INVALIDE\",IF(H80<'Balises-Taux'!C$28,\"Le coefficient est inférieur au minimum.\",\"Le coefficient est supérieur au maximum.\"),\"-\")","v":"-"},{"$f":"IF(AND($I$60=I$71,I$60=I80), \"-\",IF(I80>0,IF(AND('Balises-Taux'!$C$34<=I80,'Balises-Taux'!$F$34>=I80),\"-\",\"INVALIDE\"),\"-\"))","v":"-"},{"$f":"IF(P80=\"INVALIDE\",IF(I80<'Balises-Taux'!C$34,\"Le coefficient est inférieur au minimum.\",\"Le coefficient est supérieur au maximum.\"),\"-\")","v":"-"},{"$f":"IF(AND($J$60=J79,J$60=J80), \"-\",IF(J80>0,IF(AND('Balises-Taux'!$C$40<=J80,'Balises-Taux'!$F$40>=J80),\"-\",\"INVALIDE\"),\"-\"))","v":"-"},{"$f":"IF(R80=\"INVALIDE\",IF(J80<'Balises-Taux'!C$40,\"Le coefficient est inférieur au minimum.\",\"Le coefficient est supérieur au maximum.\"),\"-\")","v":"-"},{"$f":"IF(AND($K$60=K$71,K$60=K80), \"-\",IF(K80>0,IF(AND('Balises-Taux'!$C$46<=K80,'Balises-Taux'!$F$46>=K80),\"-\",\"INVALIDE\"),\"-\"))","v":"-"},{"$f":"IF(T80=\"INVALIDE\",IF(K80<'Balises-Taux'!C54,\"Le coefficient est inférieur au minimum.\",\"Le coefficient est supérieur au maximum.\"),\"-\")","v":"-"}]
["Taux sous-catégorie non résidentielle 10 (TSCNR 10)",null,"SNR 10",null,null,null,4.8,4,3,2.5,4.5,{"$f":"IF(AND(G$60=G$71,G$60=G81), \"-\",IF(G81>0,IF(AND('Balises-Taux'!$C$22<=G81,'Balises-Taux'!$F$22>=G81),\"-\",\"INVALIDE\"),\"-\"))","v":"-"},{"$f":"IF(L81=\"INVALIDE\",IF(G81<'Balises-Taux'!C$22,\"Le coefficient est inférieur au minimum.\",\"Le coefficient est supérieur au maximum.\"),\"-\")","v":"-"},{"$f":"IF(AND($H$60=H$71,$H$60=H81), \"-\",IF(H81>0,IF(AND('Balises-Taux'!$C$28<=H81,'Balises-Taux'!$F$28>=H81),\"-\",\"INVALIDE\"),\"-\"))","v":"-"},{"$f":"IF(N81=\"INVALIDE\",IF(H81<'Balises-Taux'!C$28,\"Le coefficient est inférieur au minimum.\",\"Le coefficient est supérieur au maximum.\"),\"-\")","v":"-"},{"$f":"IF(AND($I$60=I$71,I$60=I81), \"-\",IF(I81>0,IF(AND('Balises-Taux'!$C$34<=I81,'Balises-Taux'!$F$34>=I81),\"-\",\"INVALIDE\"),\"-\"))","v":"-"},{"$f":"IF(P81=\"INVALIDE\",IF(I81<'Balises-Taux'!C$34,\"Le coefficient est inférieur au minimum.\",\"Le coefficient est supérieur au maximum.\"),\"-\")","v":"-"},{"$f":"IF(AND($J$60=J80,J$60=J81), \"-\",IF(J81>0,IF(AND('Balises-Taux'!$C$40<=J81,'Balises-Taux'!$F$40>=J81),\"-\",\"INVALIDE\"),\"-\"))","v":"-"},{"$f":"IF(R81=\"INVALIDE\",IF(J81<'Balises-Taux'!C$40,\"Le coefficient est inférieur au minimum.\",\"Le coefficient est supérieur au maximum.\"),\"-\")","v":"-"},{"$f":"IF(AND($K$60=K$71,K$60=K81), \"-\",IF(K81>0,IF(AND('Balises-Taux'!$C$46<=K81,'Balises-Taux'!$F$46>=K81),\"-\",\"INVALIDE\"),\"-\"))","v":"-"},{"$f":"IF(T81=\"INVALIDE\",IF(K81<'Balises-Taux'!C55,\"Le coefficient est inférieur au minimum.\",\"Le coefficient est supérieur au maximum.\"),\"-\")","v":"-"}]
["Taux industriel (TIND)",null,null,null,null,null,5,4,3,2.5,5,{"$f":"IF(AND(G$60=G71,G$60=G82), \"-\",IF(G82>0,IF(AND('Balises-Taux'!C52<=G82,'Balises-Taux'!F52>=G82),\"-\",\"INVALIDE\"),\"-\"))","v":"-"},{"$f":"IF(L82=\"INVALIDE\",IF(G82<'Balises-Taux'!C52,\"Le coefficient est inférieur au minimum.\",\"Le coefficient est supérieur au maximum.\"),\"-\")","v":"-"},{"$f":"IF(AND($H$60=H71,H$60=H82), \"-\",IF(H82>0,IF(AND('Balises-Taux'!C57<=H82,'Balises-Taux'!F57>=H82),\"-\",\"INVALIDE\"),\"-\"))","v":"-"},{"$f":"IF(N82=\"INVALIDE\",IF(H82<'Balises-Taux'!C57,\"Le coefficient est inférieur au minimum.\",\"Le coefficient est supérieur au maximum.\"),\"-\")","v":"-"},{"$f":"IF(AND($I$60=I71,I$60=I82), \"-\",IF(I82>0,IF(AND('Balises-Taux'!D63<=I82,'Balises-Taux'!F63>=I82),\"-\",\"INVALIDE\"),\"-\"))","v":"-"},{"$f":"IF(P82=\"INVALIDE\",IF(I82<'Balises-Taux'!C63,\"Le coefficient est inférieur au minimum.\",\"Le coefficient est supérieur au maximum.\"),\"-\")","v":"-"},{"$f":"IF(AND($J$60=J$71,J$60=J82), \"-\",IF(J82>0,IF(AND('Balises-Taux'!C68<=J82,'Balises-Taux'!F68>=J82),\"-\",\"INVALIDE\"),\"-\"))","v":"-"},{"$f":"IF(R82=\"INVALIDE\",IF(J82<'Balises-Taux'!C$40,\"Le coefficient est inférieur au minimum.\",\"Le coefficient est supérieur au maximum.\"),\"-\")","v":"-"},{"$f":"IF(AND(K60=K71,K$60=K82), \"-\",IF(K82>0,IF(AND('Balises-Taux'!C73<=K82,'Balises-Taux'!F73>=K82),\"-\",\"INVALIDE\"),\"-\"))","v":"-"},{"$f":"IF(T82=\"INVALIDE\",IF(K82<'Balises-Taux'!C56,\"Le coefficient est inférieur au minimum.\",\"Le coefficient est supérieur au maximum.\"),\"-\")","v":"-"}]
["Taux des terrains vagues desservis (TTVD) ",null,null,null,1,4,4,2,2,3,4,{"$f":"IF(G$60=G83, \"-\",IF(G83>0,IF(AND($E83<=G83,$F83>=G83),\"-\",\"INVALIDE\"),\"-\"))","v":"-"},{"$f":"IF(L83=\"INVALIDE\",IF(G83<'Balises-Taux'!E$82,\"Le coefficient est inférieur au minimum.\",\"Le coefficient est supérieur au maximum.\"),\"-\")","v":"-"},{"$f":"IF(H$60=H83, \"-\",IF(H83>0,IF(AND($E83<=H83,$F83>=H83),\"-\",\"INVALIDE\"),\"-\"))","v":"-"},{"$f":"IF(N83=\"INVALIDE\",IF(H83<$E83,\"Le coefficient est inférieur au minimum.\",\"Le coefficient est supérieur au maximum.\"),\"-\")","v":"-"},{"$f":"IF(I$60=I83, \"-\",IF(I83>0,IF(AND($E83<=I83,$F83>=I83),\"-\",\"INVALIDE\"),\"-\"))","v":"-"},{"$f":"IF(P83=\"INVALIDE\",IF(I83<$E83,\"Le coefficient est inférieur au minimum.\",\"Le coefficient est supérieur au maximum.\"),\"-\")","v":"-"},{"$f":"IF(J$60=J83, \"-\",IF(J83>0,IF(AND($E83<=J83,$F83>=J83),\"-\",\"INVALIDE\"),\"-\"))","v":"-"},{"$f":"IF(R83=\"INVALIDE\",IF(J83<'Balises-Taux'!C68,\"Le coefficient est inférieur au minimum.\",\"Le coefficient est supérieur au maximum.\"),\"-\")","v":"-"},{"$f":"IF(K$60=K83, \"-\",IF(K83>0,IF(AND($E83<=K83,$F83>=K83),\"-\",\"INVALIDE\"),\"-\"))","v":"-"},{"$f":"IF(T83=\"INVALIDE\",IF(K83<'Balises-Taux'!C73,\"Le coefficient est inférieur au minimum.\",\"Le coefficient est supérieur au maximum.\"),\"-\")","v":"-"}]
["Taux forestier (TFOREST)",null,null,null,0.66600000000000004,1,1,0.66600000000000004,1.22,0.9,1.214,{"$f":"IF(G$60=G84, \"-\",IF(G84>0,IF(AND($E84<=G84,$F84>=G84),\"-\",\"INVALIDE\"),\"-\"))","v":"-"},null,{"$f":"IF(H$60=H84, \"-\",IF(H84>0,IF(AND($E84<=H84,$F84>=H84),\"-\",\"INVALIDE\"),\"-\"))","v":"-"},{"$f":"IF(N84=\"INVALIDE\",IF(H84<$E84,\"Le coefficient est inférieur au minimum.\",\"Le coefficient est supérieur au maximum.\"),\"-\")","v":"-"},{"$f":"IF(I$60=I84, \"-\",IF(I84>0,IF(AND($E84<=I84,$F84>=I84),\"-\",\"INVALIDE\"),\"-\"))","v":"-"},{"$f":"IF(P84=\"INVALIDE\",IF(I84<$E84,\"Le coefficient est inférieur au minimum.\",\"Le coefficient est supérieur au maximum.\"),\"-\")","v":"-"},{"$f":"IF(J$60=J84, \"-\",IF(J84>0,IF(AND($E84<=J84,$F84>=J84),\"-\",\"INVALIDE\"),\"-\"))","v":"-"},{"$f":"IF(R84=\"INVALIDE\",IF(J84<$E84,\"Le coefficient est inférieur au minimum.\",\"Le coefficient est supérieur au maximum.\"),\"-\")","v":"-"},{"$f":"IF(K$60=K84, \"-\",IF(K84>0,IF(AND($E84<=K84,$F84>=K84),\"-\",\"INVALIDE\"),\"-\"))","v":"-"},{"$f":"IF(T84=\"INVALIDE\",IF(K84<$E84,\"Le coefficient est inférieur au minimum.\",\"Le coefficient est supérieur au maximum.\"),\"-\")","v":"-"}]
["Taux agricole (TAGRI) ",null,null,null,0.66600000000000004,1,{"$f":"ROUND(IF(B$90=0,0,C127/$H$97),4)","v":1},0.66600000000000004,1.22,0.9,1.214,{"$f":"IF(G$60=G85, \"-\",IF(G85>0,IF(AND($E85<=G85,$F85>=G85),\"-\",\"INVALIDE\"),\"-\"))","v":"-"},{"$f":"IF(L85=\"INVALIDE\",IF(G85<$E85,\"Le coefficient est inférieur au minimum.\",\"Le coefficient est supérieur au maximum.\"),\"-\")","v":"-"},{"$f":"IF(H$60=H85, \"-\",IF(H85>0,IF(AND($E85<=H85,$F85>=H85),\"-\",\"INVALIDE\"),\"-\"))","v":"-"},{"$f":"IF(N85=\"INVALIDE\",IF(H85<$E85,\"Le coefficient est inférieur au minimum.\",\"Le coefficient est supérieur au maximum.\"),\"-\")","v":"-"},{"$f":"IF(I$60=I85, \"-\",IF(I85>0,IF(AND($E85<=I85,$F85>=I85),\"-\",\"INVALIDE\"),\"-\"))","v":"-"},{"$f":"IF(P85=\"INVALIDE\",IF(I85<$E85,\"Le coefficient est inférieur au minimum.\",\"Le coefficient est supérieur au maximum.\"),\"-\")","v":"-"},{"$f":"IF(J$60=J85, \"-\",IF(J85>0,IF(AND($E85<=J85,$F85>=J85),\"-\",\"INVALIDE\"),\"-\"))","v":"-"},{"$f":"IF(R85=\"INVALIDE\",IF(J85<$E85,\"Le coefficient est inférieur au minimum.\",\"Le coefficient est supérieur au maximum.\"),\"-\")","v":"-"},{"$f":"IF(K$60=K85, \"-\",IF(K85>0,IF(AND($E85<=K85,$F85>=K85),\"-\",\"INVALIDE\"),\"-\"))","v":"-"},{"$f":"IF(T85=\"INVALIDE\",IF(K85<$E85,\"Le coefficient est inférieur au minimum.\",\"Le coefficient est supérieur au maximum.\"),\"-\")","v":"-"}]
[]
[]
[null,"Secteur 1","Secteur 2","Secteur 3","Secteur 4","Secteur 5","Total"]
["Assiette totale \n(imposable+ compensation pleine taxes)",{"$f":"'Sommaire du rôle_sec_1'!$F$23+'Sommaire du rôle_sec_1'!$I$23+'Sommaire du rôle_sec_1'!$L$23+'Sommaire du rôle_sec_1'!$N$23+'Sommaire du rôle_sec_1'!$P$23+'Sommaire du rôle_sec_1'!$L$6+'Sommaire du rôle_sec_1'!$N$6","v":10616425371},{"$f":"'Sommaire du rôle_sec_2'!$F$23+'Sommaire du rôle_sec_2'!$I$23+'Sommaire du rôle_sec_2'!$L$23+'Sommaire du rôle_sec_2'!$N$23+'Sommaire du rôle_sec_2'!$P$23+'Sommaire du rôle_sec_2'!$L$6+'Sommaire du rôle_sec_2'!$N$6","v":10295821071},{"$f":"'Sommaire du rôle_sec_3'!$F$23+'Sommaire du rôle_sec_3'!$I$23+'Sommaire du rôle_sec_3'!$L$23+'Sommaire du rôle_sec_3'!$N$23+'Sommaire du rôle_sec_3'!$P$23+'Sommaire du rôle_sec_3'!$L$6+'Sommaire du rôle_sec_3'!$N$6","v":10295821071},{"$f":"'Sommaire du rôle_sec_4'!$F$23+'Sommaire du rôle_sec_4'!$I$23+'Sommaire du rôle_sec_4'!$L$23+'Sommaire du rôle_sec_4'!$N$23+'Sommaire du rôle_sec_4'!$P$23+'Sommaire du rôle_sec_4'!$L$6+'Sommaire du rôle_sec_4'!$N$6","v":10295821071},{"$f":"'Sommaire du rôle_sec_5'!$F$23+'Sommaire du rôle_sec_5'!$I$23+'Sommaire du rôle_sec_5'!$L$23+'Sommaire du rôle_sec_5'!$N$23+'Sommaire du rôle_sec_5'!$P$23+'Sommaire du rôle_sec_5'!$L$6+'Sommaire du rôle_sec_5'!$N$6","v":10295821071},{"$f":"SUM(B89:F89)","v":51799709655},null,null,null,{"$f":"G15/E210","v":1}]
["Part du secteur pour le calcul du TBU",{"$f":"IF(B89>0,B89/$G$89,0)","v":0.2049514455140434},{"$f":"IF(C89>0,C89/$G$89,0)","v":0.19876213862148914},0.19876213862148914,0.19876213862148914,0.19876213862148914,1]
[]
[]
[]
[null,null,"Secteur 1","Secteur 2","Secteur 3","Secteur 4","Secteur 5","TBU"]
["Taux de base sectoriel",null,{"$f":"C102","v":0.64114166176177556},{"$f":"D102","v":0.42700034673334253},0.78219282734936613,0.57702749558559807,0.77834597737879552,null,null,null,"Mamh"]
["Poids sectoriel",null,{"$f":"B90","v":0.2049514455140434},{"$f":"C90","v":0.19876213862148914},{"$f":"D90","v":0.19876213862148914},{"$f":"E90","v":0.19876213862148914},{"$f":"F90","v":0.19876213862148914}]
["Taux de base sectoriel X Poids sectoriel",null,{"$f":"IF(C95=\"-\",0,C95*C96)","v":0.1314029103573518},{"$f":"IF(D95=\"-\",0,D95*D96)","v":8.4871502108836552E-2},{"$f":"IF(E95=\"-\",0,E95*E96)","v":0.15547031917834925},0.11469121906599536,0.15470571105124262,{"$f":"C95*B90+D95*C90+E95*D90+F95*E90+G95*F90","v":0.64114166176177556},"$/100 $"]
[]
["TAUX en $ / 100 $ SELON LA CATÉGORIE D'IMMEUBLES NÉCESSAIRES POUR OBTENIR LES RECETTES"]
[null,null,"Taux généré"]
[null,null,"Secteur 1","Secteur 2","Secteur 3","Secteur 4","Secteur 5"]
["TB \n(catégorie résiduelle ou sous-catégorie résiduelle)","=",{"$f":"IF(B$90>0,$E$207*B168,0)","v":0.64114166176177556},0.42700034673334253,0.78219282734936613,0.57702749558559807,0.77834597737879552,{"$f":"IF(OR(G90=0,E210=1),\"-\",\"Vérifier si vos taux respectent les balises. Voir les lignes 58 à 85.\")","v":"-"}]
["TSCR 1","=",0.64114166176177556,0.42700034673334253,0.78219282734936613,0.57702749558559807,0.77834597737879552]
["TSCR 2","=",0.85464183512844683,0.42700034673334253,0.78219282734936613,0.57702749558559807,0.77834597737879552]
["TSCR 3","=",0.85464183512844683,0.42700034673334253,0.78219282734936613,0.57702749558559807,0.77834597737879552]
["TSCR 4","=",0.85464183512844683,0.42700034673334253,0.78219282734936613,0.57702749558559807,0.77834597737879552]
["TSCR 5","=",0.85464183512844683,0.42700034673334253,0.78219282734936613,0.57702749558559807,0.77834597737879552]
["TSCR 6","=",0.85464183512844683,0.42700034673334253,0.78219282734936613,0.57702749558559807,0.77834597737879552]
["TSCR 7","=",0.85464183512844683,0.42700034673334253,0.78219282734936613,0.57702749558559807,0.77834597737879552]
["TSCR 8","=",0.85464183512844683,0.42700034673334253,0.78219282734936613,0.57702749558559807,0.77834597737879552]
["TSCR 9","=",0.85464183512844683,0.42700034673334253,0.78219282734936613,0.57702749558559807,0.77834597737879552]
["TSCR 10","=",{"$f":"IF(B$90>0,$E$207*B178,0)","v":0.85464183512844683},0.42700034673334253,0.78219282734936613,0.57702749558559807,0.77834597737879552]
["TINR \n(catégorie non résidentielle ou sous-catégorie de référence)","=",{"$f":"IF(B$90>0,$E$207*B179,0)","v":3.0774799764565226},2.5645666470471022,1.9234249852853267,1.6028541544044388,2.8851374779279899]
["TSCNR 1","=",3.0774799764565226,2.5645666470471022,1.9234249852853267,1.6028541544044388,2.8851374779279899]
["TSCNR 2","=",3.0774799764565226,2.5645666470471022,1.9234249852853267,1.6028541544044388,2.8851374779279899]
["TSCNR 3","=",3.0774799764565226,2.5645666470471022,1.9234249852853267,1.6028541544044388,2.8851374779279899]
["TSCNR 4","=",3.0774799764565226,2.5645666470471022,1.9234249852853267,1.6028541544044388,2.8851374779279899]
["TSCNR 5","=",3.0774799764565226,2.5645666470471022,1.9234249852853267,1.6028541544044388,2.8851374779279899]
["TSCNR 6","=",3.0774799764565226,2.5645666470471022,1.9234249852853267,1.6028541544044388,2.8851374779279899]
["TSCNR 7","=",3.0774799764565226,2.5645666470471022,1.9234249852853267,1.6028541544044388,2.8851374779279899]
["TSCNR 8","=",3.0774799764565226,2.5645666470471022,1.9234249852853267,1.6028541544044388,2.8851374779279899]
["TSCNR 9","=",{"$f":"IF(B$90>0,$E$207*B188,0)","v":3.0774799764565226},2.5645666470471022,1.9234249852853267,1.6028541544044388,2.8851374779279899]
["TSCNR 10","=",3.0774799764565226,2.5645666470471022,1.9234249852853267,1.6028541544044388,2.8851374779279899]
["TIND","=",3.2057083088088776,2.5645666470471022,1.9234249852853267,1.6028541544044388,3.2057083088088776]
["TTVD","=",2.5645666470471022,1.2822833235235511,1.2822833235235511,1.9234249852853267,2.5645666470471022]
["TFOREST","=",0.64114166176177556,0.42700034673334253,0.78219282734936613,0.57702749558559807,0.77834597737879552]
["TAGRI","=",{"$f":"IF(B$90>0,$E$207*B193,0)","v":0.64114166176177556},0.42700034673334253,0.78219282734936613,0.57702749558559807,0.77834597737879552]
["(TTVD − TBU)","=",{"$f":"IF(B$90>0,$E$207*B194,0)","v":1.9234249852853267},0.64114166176177556,0.64114166176177556,1.2822833235235511,1.9234249852853267]
[]
[]
["Revenus"]
[null,"Secteur 1","Secteur 2","Secteur 3","Secteur 4","Secteur 5","Total"]
["Résiduelle ou sous-catégorie résiduelle",{"$f":"C102/100*H168","v":4952182.450821735},{"$f":"D102/100*I168","v":35803559.336092934},{"$f":"E102/100*J168","v":65586099.684734792},{"$f":"F102/100*K168","v":48383188.292017482},{"$f":"G102/100*L168","v":65263545.096121348},{"$f":"B133+C133+D133+E133+F133","v":219988574.8597883}]
["Sous-catégorie résidentielle 1",4880691.5651419908,0,0,0,0,{"$f":"B134+C134+D134+E134+F134","v":4880691.5651419908}]
["Sous-catégorie résidentielle 2",6505961.8563342746,0,0,0,0,6505961.8563342746]
["Sous-catégorie résidentielle 3",6505961.8563342746,0,0,0,0,6505961.8563342746]
["Sous-catégorie résidentielle 4",6505961.8563342746,0,0,0,0,6505961.8563342746]
["Sous-catégorie résidentielle 5",6505961.8563342746,0,0,0,0,6505961.8563342746]
["Sous-catégorie résidentielle 6",6505961.8563342746,0,0,0,0,6505961.8563342746]
["Sous-catégorie résidentielle 7",6505961.8563342746,0,0,0,0,6505961.8563342746]
["Sous-catégorie résidentielle 8",6505961.8563342746,0,0,0,0,6505961.8563342746]
["Sous-catégorie résidentielle 9",6505961.8563342746,0,0,0,0,6505961.8563342746]
["Sous-catégorie résidentielle 10",6505961.8563342746,0,0,0,0,6505961.8563342746]
["Non résidentielle ou sous-catégorie de référence",3705921.0558234737,31915201.774842102,23936401.331131574,19947001.10927631,35904601.996697366,115409127.26777083]
["Sous-catégorie non résidentielle 1",3459232.1073987046,0,0,0,0,3459232.1073987046]
["Sous-catégorie non résidentielle 2",3459232.1073987046,0,0,0,0,3459232.1073987046]
["Sous-catégorie non résidentielle 3",3459232.1073987046,0,0,0,0,3459232.1073987046]
["Sous-catégorie non résidentielle 4",3459232.1073987046,0,0,0,0,3459232.1073987046]
["Sous-catégorie non résidentielle 5",3459232.1073987046,0,0,0,0,3459232.1073987046]
["Sous-catégorie non résidentielle 6",3459232.1073987046,0,0,0,0,3459232.1073987046]
["Sous-catégorie non résidentielle 7",3459232.1073987046,0,0,0,0,3459232.1073987046]
["Sous-catégorie non résidentielle 8",3459232.1073987046,0,0,0,0,3459232.1073987046]
["Sous-catégorie non résidentielle 9",3459232.1073987046,0,0,0,0,3459232.1073987046]
["Sous-catégorie non résidentielle 10",3459232.1073987046,0,0,0,0,3459232.1073987046]
["Industrielle",7673716.8378275139,6138973.4702620124,4604230.1026965091,3836858.418913757,7673716.8378275139,29927495.667527307]
["Terrains vagues desservis",1967443.207215243,983721.60360762151,983721.60360762151,1475582.4054114323,1967443.207215243,7377912.0270571616]
["Forestier",320570.83088088775,0,0,0,0,320570.83088088775]
["Agricole",1734956.9058188202,0,0,0,0,1734956.9058188202]
["TTVD − TBU",{"$f":"C128/100*H194","v":100562.42850567272},{"$f":"D128/100*I194","v":33520.809501890908},{"$f":"E128/100*J194","v":33520.809501890908},67041.619003781816,100562.42850567272,0]
["Total",{"$f":"SUM(B133:B159)","v":118482023.06303085},74874976.994306549,95143973.531672388,73709671.844622761,110909869.56636715,{"$f":"SUM(G133:G159)","v":472785306.9049806}]
[null,{"$f":"IF($G$160=0,0,B160/$G$160)","v":0.25060428345088803},{"$f":"IF($G$160=0,0,C160/$G$160)","v":0.15836993218859646},0.20124139253505657,0.15590516618875547,0.234588232642893,1]
[]
[]
["Calculs"]
[]
[null,"Coefficient X (X est la valeur pour obtenir les recettes)",null,null,null,null,null,"Assiette imposable "]
[null,"Secteur 1","Secteur 2","Secteur 3","Secteur 4","Secteur 5",null,"Secteur 1","Secteur 2","Secteur 3","Secteur 4","Secteur 5"]
["TB \n(catégorie résiduelle ou sous-catégorie résiduelle)",{"$f":"IF(G15>0,G15,1)","v":1},{"$f":"IF(H15>0,H15,1)","v":0.66600000000000004},{"$f":"IF(I15>0,I15,1)","v":1.22},{"$f":"IF(J15>0,J15,1)","v":0.9},{"$f":"IF(K15>0,K15,1)","v":1.214},null,{"$f":"IF('Sommaire du rôle_sec_1'!$F$66>0,'Sommaire du rôle_sec_1'!$F$83,'Sommaire du rôle_sec_1'!$O$71)","v":772400663.71818185},{"$f":"IF('Sommaire du rôle_sec_2'!$F$66>0,'Sommaire du rôle_sec_2'!$F$83,'Sommaire du rôle_sec_2'!$O$71)","v":8384901700.8999996},{"$f":"IF('Sommaire du rôle_sec_3'!$F$66>0,'Sommaire du rôle_sec_3'!$F$83,'Sommaire du rôle_sec_3'!$O$71)","v":8384901700.8999996},{"$f":"IF('Sommaire du rôle_sec_4'!$F$66>0,'Sommaire du rôle_sec_4'!$F$83,'Sommaire du rôle_sec_4'!$O$71)","v":8384901700.8999996},{"$f":"IF('Sommaire du rôle_sec_5'!$F$66>0,'Sommaire du rôle_sec_5'!$F$83,'Sommaire du rôle_sec_5'!$O$71)","v":8384901700.8999996}]
["TSCR 1",{"$f":"IF(G16>0,G16,B$168)","v":1},{"$f":"IF(H16>0,H16,C$168)","v":0.66600000000000004},1.22,0.9,1.214,null,{"$f":"'Sommaire du rôle_sec_1'!$G$83","v":761250103.71818185},{"$f":"'Sommaire du rôle_sec_2'!$G$83","v":0},{"$f":"'Sommaire du rôle_sec_3'!$G$83","v":0},{"$f":"'Sommaire du rôle_sec_4'!$G$83","v":0},{"$f":"'Sommaire du rôle_sec_3'!$G$83","v":0}]
["TSCR 2",{"$f":"IF(G17>0,G17,B$168)","v":1.333},0.66600000000000004,1.22,0.9,1.214,null,{"$f":"'Sommaire du rôle_sec_1'!$H$83","v":761250103.71818185},{"$f":"'Sommaire du rôle_sec_2'!$H$83","v":0},{"$f":"'Sommaire du rôle_sec_3'!$H$83","v":0},{"$f":"'Sommaire du rôle_sec_4'!$H$83","v":0},{"$f":"'Sommaire du rôle_sec_5'!$H$83","v":0}]
["TSCR 3",1.333,0.66600000000000004,1.22,0.9,1.214,null,{"$f":"'Sommaire du rôle_sec_1'!$I$83","v":761250103.71818185},{"$f":"'Sommaire du rôle_sec_2'!$I$83","v":0},{"$f":"'Sommaire du rôle_sec_3'!$I$83","v":0},{"$f":"'Sommaire du rôle_sec_4'!$I$83","v":0},{"$f":"'Sommaire du rôle_sec_5'!$I$83","v":0}]
["TSCR 4",1.333,0.66600000000000004,1.22,0.9,1.214,null,{"$f":"'Sommaire du rôle_sec_1'!$J$83","v":761250103.71818185},{"$f":"'Sommaire du rôle_sec_2'!$J$83","v":0},{"$f":"'Sommaire du rôle_sec_3'!$J$83","v":0},{"$f":"'Sommaire du rôle_sec_4'!$J$83","v":0},{"$f":"'Sommaire du rôle_sec_5'!$J$83","v":0}]
["TSCR 5",1.333,0.66600000000000004,1.22,0.9,1.214,null,{"$f":"'Sommaire du rôle_sec_1'!$K$83","v":761250103.71818185},{"$f":"'Sommaire du rôle_sec_2'!$K$83","v":0},{"$f":"'Sommaire du rôle_sec_3'!$K$83","v":0},{"$f":"'Sommaire du rôle_sec_4'!$K$83","v":0},{"$f":"'Sommaire du rôle_sec_5'!$K$83","v":0}]
["TSCR 6",1.333,0.66600000000000004,1.22,0.9,1.214,null,{"$f":"'Sommaire du rôle_sec_1'!$L$83","v":761250103.71818185},{"$f":"'Sommaire du rôle_sec_2'!$L$83","v":0},{"$f":"'Sommaire du rôle_sec_3'!$L$83","v":0},{"$f":"'Sommaire du rôle_sec_4'!$L$83","v":0},{"$f":"'Sommaire du rôle_sec_5'!$L$83","v":0}]
["TSCR 7",1.333,0.66600000000000004,1.22,0.9,1.214,null,{"$f":"'Sommaire du rôle_sec_1'!$M$83","v":761250103.71818185},{"$f":"'Sommaire du rôle_sec_2'!$M$83","v":0},{"$f":"'Sommaire du rôle_sec_3'!$M$83","v":0},{"$f":"'Sommaire du rôle_sec_4'!$M$83","v":0},{"$f":"'Sommaire du rôle_sec_5'!$M$83","v":0}]
["TSCR 8",1.333,0.66600000000000004,1.22,0.9,1.214,null,{"$f":"'Sommaire du rôle_sec_1'!$N$83","v":761250103.71818185},{"$f":"'Sommaire du rôle_sec_2'!$N$83","v":0},{"$f":"'Sommaire du rôle_sec_3'!$N$83","v":0},{"$f":"'Sommaire du rôle_sec_4'!$N$83","v":0},{"$f":"'Sommaire du rôle_sec_5'!$N$83","v":0}]
["TSCR 9",1.333,0.66600000000000004,1.22,0.9,1.214,null,{"$f":"'Sommaire du rôle_sec_1'!$O$83","v":761250103.71818185},{"$f":"'Sommaire du rôle_sec_2'!$O$83","v":0},{"$f":"'Sommaire du rôle_sec_3'!$O$83","v":0},{"$f":"'Sommaire du rôle_sec_4'!$O$83","v":0},{"$f":"'Sommaire du rôle_sec_5'!$O$83","v":0}]
["TSCR 10",1.333,0.66600000000000004,1.22,0.9,1.214,null,{"$f":"'Sommaire du rôle_sec_1'!$P$83","v":761250103.71818185},{"$f":"'Sommaire du rôle_sec_2'!$P$83","v":0},{"$f":"'Sommaire du rôle_sec_3'!$P$83","v":0},{"$f":"'Sommaire du rôle_sec_4'!$P$83","v":0},{"$f":"'Sommaire du rôle_sec_5'!$P$83","v":0}]
["TINR \n(catégorie non résidentielle ou sous-catégorie de référence)",4.8,4,3,2.5,4.5,null,{"$f":"IF('Sommaire du rôle_sec_1'!$F$46>0,'Sommaire du rôle_sec_1'!$F$77,'Sommaire du rôle_sec_1'!$F$71)","v":120420639.09999999},{"$f":"IF('Sommaire du rôle_sec_2'!$F$46>0,'Sommaire du rôle_sec_2'!$F$77,'Sommaire du rôle_sec_2'!$F$71)","v":1244467630.0999999},{"$f":"IF('Sommaire du rôle_sec_3'!$F$46>0,'Sommaire du rôle_sec_3'!$F$77,'Sommaire du rôle_sec_3'!$F$71)","v":1244467630.0999999},{"$f":"IF('Sommaire du rôle_sec_4'!$F$46>0,'Sommaire du rôle_sec_4'!$F$77,'Sommaire du rôle_sec_4'!$F$71)","v":1244467630.0999999},{"$f":"IF('Sommaire du rôle_sec_5'!$F$46>0,'Sommaire du rôle_sec_5'!$F$77,'Sommaire du rôle_sec_5'!$F$71)","v":1244467630.0999999}]
["TSCNR 1",{"$f":"IF(G27>0,G27,B$179)","v":4.8},{"$f":"IF(H27>0,H27,C$179)","v":4},3,2.5,4.5,null,{"$f":"'Sommaire du rôle_sec_1'!$G$77","v":112404699.09999999},{"$f":"'Sommaire du rôle_sec_2'!$G$77","v":0},{"$f":"'Sommaire du rôle_sec_3'!$G$77","v":0},{"$f":"'Sommaire du rôle_sec_4'!$G$77","v":0},{"$f":"'Sommaire du rôle_sec_5'!$G$77","v":0}]
["TSCNR 2",{"$f":"IF(G28>0,G28,B$179)","v":4.8},4,3,2.5,4.5,null,{"$f":"'Sommaire du rôle_sec_1'!$H$77","v":112404699.09999999},{"$f":"'Sommaire du rôle_sec_2'!$H$77","v":0},{"$f":"'Sommaire du rôle_sec_3'!$H$77","v":0},{"$f":"'Sommaire du rôle_sec_4'!$H$77","v":0},{"$f":"'Sommaire du rôle_sec_5'!$H$77","v":0}]
["TSCNR 3",4.8,4,3,2.5,4.5,null,{"$f":"'Sommaire du rôle_sec_1'!$I$77","v":112404699.09999999},{"$f":"'Sommaire du rôle_sec_2'!$I$77","v":0},{"$f":"'Sommaire du rôle_sec_3'!$I$77","v":0},{"$f":"'Sommaire du rôle_sec_4'!$I$77","v":0},{"$f":"'Sommaire du rôle_sec_5'!$I$77","v":0}]
["TSCNR 4",4.8,4,3,2.5,4.5,null,{"$f":"'Sommaire du rôle_sec_1'!$J$77","v":112404699.09999999},{"$f":"'Sommaire du rôle_sec_2'!$J$77","v":0},{"$f":"'Sommaire du rôle_sec_3'!$J$77","v":0},{"$f":"'Sommaire du rôle_sec_4'!$J$77","v":0},{"$f":"'Sommaire du rôle_sec_5'!$J$77","v":0}]
["TSCNR 5",4.8,4,3,2.5,4.5,null,{"$f":"'Sommaire du rôle_sec_1'!$K$77","v":112404699.09999999},{"$f":"'Sommaire du rôle_sec_2'!$K$77","v":0},{"$f":"'Sommaire du rôle_sec_3'!$K$77","v":0},{"$f":"'Sommaire du rôle_sec_4'!$K$77","v":0},{"$f":"'Sommaire du rôle_sec_5'!$K$77","v":0}]
["TSCNR 6",4.8,4,3,2.5,4.5,null,{"$f":"'Sommaire du rôle_sec_1'!$L$77","v":112404699.09999999},{"$f":"'Sommaire du rôle_sec_2'!$L$77","v":0},{"$f":"'Sommaire du rôle_sec_3'!$L$77","v":0},{"$f":"'Sommaire du rôle_sec_4'!$L$77","v":0},{"$f":"'Sommaire du rôle_sec_5'!$L$77","v":0}]
["TSCNR 7",4.8,4,3,2.5,4.5,null,{"$f":"'Sommaire du rôle_sec_1'!$M$77","v":112404699.09999999},{"$f":"'Sommaire du rôle_sec_2'!$M$77","v":0},{"$f":"'Sommaire du rôle_sec_3'!$M$77","v":0},{"$f":"'Sommaire du rôle_sec_4'!$M$77","v":0},{"$f":"'Sommaire du rôle_sec_5'!$M$77","v":0}]
["TSCNR 8",4.8,4,3,2.5,4.5,null,{"$f":"'Sommaire du rôle_sec_1'!$N$77","v":112404699.09999999},{"$f":"'Sommaire du rôle_sec_2'!$N$77","v":0},{"$f":"'Sommaire du rôle_sec_3'!$N$77","v":0},{"$f":"'Sommaire du rôle_sec_4'!$N$77","v":0},{"$f":"'Sommaire du rôle_sec_5'!$N$77","v":0}]
["TSCNR 9",4.8,4,3,2.5,4.5,null,{"$f":"'Sommaire du rôle_sec_1'!$O$77","v":112404699.09999999},{"$f":"'Sommaire du rôle_sec_2'!$O$77","v":0},{"$f":"'Sommaire du rôle_sec_3'!$O$77","v":0},{"$f":"'Sommaire du rôle_sec_4'!$O$77","v":0},{"$f":"'Sommaire du rôle_sec_5'!$O$77","v":0}]
["TSCNR 10",4.8,4,3,2.5,4.5,null,{"$f":"'Sommaire du rôle_sec_1'!$P$77","v":112404699.09999999},{"$f":"'Sommaire du rôle_sec_2'!$P$77","v":0},{"$f":"'Sommaire du rôle_sec_3'!$P$77","v":0},{"$f":"'Sommaire du rôle_sec_4'!$P$77","v":0},{"$f":"'Sommaire du rôle_sec_5'!$P$77","v":0}]
["TIND",5,4,3,2.5,5,null,{"$f":"'Sommaire du rôle_sec_1'!$H$71","v":239376640},{"$f":"'Sommaire du rôle_sec_2'!$H$71","v":239376640},{"$f":"'Sommaire du rôle_sec_3'!$H$71","v":239376640},{"$f":"'Sommaire du rôle_sec_4'!$H$71","v":239376640},{"$f":"'Sommaire du rôle_sec_5'!$H$71","v":239376640}]
["TTVD",4,{"$f":"IF(H38>0,H38,C$168)","v":2},{"$f":"IF(I38>0,I38,D$168)","v":2},{"$f":"IF(J38>0,J38,E$168)","v":3},{"$f":"IF(K38>0,K38,F$168)","v":4},null,{"$f":"'Sommaire du rôle_sec_1'!$L$23","v":76716400},{"$f":"'Sommaire du rôle_sec_2'!$L$23","v":76716400},{"$f":"'Sommaire du rôle_sec_3'!$L$23","v":76716400},{"$f":"'Sommaire du rôle_sec_4'!$L$23","v":76716400},{"$f":"'Sommaire du rôle_sec_5'!$L$23","v":76716400}]
["TFOREST",1,0.66600000000000004,1.22,0.9,1.214,null,{"$f":"'Sommaire du rôle_sec_1'!$N$6","v":50000000},{"$f":"'Sommaire du rôle_sec_2'!$N$6","v":0},{"$f":"'Sommaire du rôle_sec_3'!$N$6","v":0},{"$f":"'Sommaire du rôle_sec_4'!$N$6","v":0},{"$f":"'Sommaire du rôle_sec_5'!$N$6","v":0}]
["TAGRI",1,0.66600000000000004,1.22,0.9,1.214,null,{"$f":"'Sommaire du rôle_sec_1'!$L$6","v":270604300},{"$f":"'Sommaire du rôle_sec_2'!$L$6","v":0},{"$f":"'Sommaire du rôle_sec_3'!$L$6","v":0},{"$f":"'Sommaire du rôle_sec_4'!$L$6","v":0},{"$f":"'Sommaire du rôle_sec_5'!$L$6","v":0}]
["(TTVD − TBU)",{"$f":"IF(G38=G15,0,MAX(G38-1,0))","v":3},{"$f":"IF(H38=H15,0,MAX(H38-1,0))","v":1},1,2,3,null,{"$f":"'Sommaire du rôle_sec_1'!$L$22","v":5228300},{"$f":"'Sommaire du rôle_sec_2'!$L$22","v":5228300},{"$f":"'Sommaire du rôle_sec_3'!$L$22","v":5228300},{"$f":"'Sommaire du rôle_sec_4'!$L$22","v":5228300},{"$f":"'Sommaire du rôle_sec_5'!$L$22","v":5228300}]
[]
[]
[]
["D'où :",{"$f":"SUMPRODUCT(B168:F194,H168:L194)","v":73793444291.223434}]
[]
[null,"="]
[null,{"$f":"E9","v":473120515}]
[]
[]
[null,null,"soit X","=",{"$f":"B201","v":473120515}]
[null,null,null,null,{"$f":"B198","v":73793444291.223434}]
[]
[null,null,"X","=",{"$f":"IF(E205>0,E204/E205*100,0)","v":0.64114166176177556},"$/100 $"]
[null,null,null,null,null,null,{"$f":"IF(E207-E211=0,\"-\",\"Si X n'égale pas TBU, les coefficients choisis pour les taux de base ne permettent pas d'obtenir les recettes désirés. \")","v":"-"}]
[null,null,null,"Facteur d'ajustement=  ",{"$f":" (B90*B168+C90*C168+D90*D168+E90*E168+F90*F168)","v":1}]
[null,null,null,"Facteur d'ajustement arrondi =  ",{"$f":" ROUND((B90*B168+C90*C168+D90*D168+E90*E168+F90*F168),4)","v":1}]
[null,null,null,"TBU =",{"$f":"E207*E210","v":0.64114166176177556},"$/100 $"]
[]
[]
[]
[null,null,null,null,null,null,null,null,null,null,null,null,{"$f":"M$15","v":0}]

{"sheet":"Calculs taux de base","index":12,"n_rows":39,"n_cols":8,"rows_kept":39,"cut":false,"hidden":true,"merged":[]}
[null,"Coefficient choisis"]
[null,null,"Secteur 1","Secteur 2","Secteur 3","Secteur 4","Secteur 5","Total"]
[null,"Coefficient",{"$f":"'Scénario-taux variés'!G15","v":1},{"$f":"'Scénario-taux variés'!H15","v":0.66600000000000004},{"$f":"'Scénario-taux variés'!I15","v":1.22},{"$f":"'Scénario-taux variés'!J15","v":0.9},{"$f":"'Scénario-taux variés'!K15","v":1.214}]
[null,"Poids sectoriel",{"$f":"'Scénario-taux variés'!C96","v":0.2049514455140434},{"$f":"'Scénario-taux variés'!D96","v":0.19876213862148914},{"$f":"'Scénario-taux variés'!E96","v":0.19876213862148914},{"$f":"'Scénario-taux variés'!F96","v":0.19876213862148914},{"$f":"'Scénario-taux variés'!G96","v":0.19876213862148914}]
[null,null,{"$f":"C3*C4","v":0.2049514455140434},{"$f":"D3*D4","v":0.13237558432191177},0.24248980911821674,0.17888592475934023,0.2412972362864878,{"$f":"SUM(C5:G5)","v":1}]
[]
[]
[null,"Coefficient taux de base secteur 1"]
[null,null,"Secteur 1","Secteur 2","Secteur 3","Secteur 4","Secteur 5","Total"]
[null,"Coefficient",{"$f":"IF(C11>0,(H12-D12-E12-F12-G12)/C11,0)","v":1.0000000000000004},{"$f":"D3","v":0.66600000000000004},1.22,0.9,1.214]
[null,"Poids sectoriel",{"$f":"C4","v":0.2049514455140434},0.19876213862148914,0.19876213862148914,0.19876213862148914,0.19876213862148914]
[null,null,{"$f":"C10*C11","v":0.20495144551404348},{"$f":"D10*D11","v":0.13237558432191177},{"$f":"E10*E11","v":0.24248980911821674},0.17888592475934023,0.2412972362864878,1]
[]
[]
[null,"Coefficient taux de base secteur 2"]
[null,null,"Secteur 1","Secteur 2","Secteur 3","Secteur 4","Secteur 5","Total"]
[null,"Coefficient",{"$f":"C3","v":1},{"$f":"IF(D18>0,(H19-C19-E19-F19-G19)/D18,0)","v":0.66600000000000026},{"$f":"E10","v":1.22},0.9,1.214]
[null,"Poids sectoriel",{"$f":"C11","v":0.2049514455140434},{"$f":"D11","v":0.19876213862148914},0.19876213862148914,0.19876213862148914,0.19876213862148914]
[null,null,{"$f":"C17*C18","v":0.2049514455140434},{"$f":"D17*D18","v":0.13237558432191182},{"$f":"E17*E18","v":0.24248980911821674},{"$f":"F17*F18","v":0.17888592475934023},{"$f":"G17*G18","v":0.2412972362864878},1]
[]
[null,"Coefficient taux de base secteur 3"]
[null,null,"Secteur 1","Secteur 2","Secteur 3","Secteur 4","Secteur 5","Total"]
[null,"Coefficient",{"$f":"C3","v":1},{"$f":"D3","v":0.66600000000000004},{"$f":"IF(E24>0,(H25-C25-D25-F25-G25)/E24,0)","v":1.22},0.9,1.214]
[null,"Poids sectoriel",{"$f":"C18","v":0.2049514455140434},{"$f":"D18","v":0.19876213862148914},0.19876213862148914,0.19876213862148914,0.19876213862148914]
[null,null,{"$f":"C23*C24","v":0.2049514455140434},{"$f":"D23*D24","v":0.13237558432191177},{"$f":"E23*E24","v":0.24248980911821674},{"$f":"F23*F24","v":0.17888592475934023},{"$f":"G23*G24","v":0.2412972362864878},1]
[]
[]
[null,"Coefficient taux de base secteur 4"]
[null,null,"Secteur 1","Secteur 2","Secteur 3","Secteur 4","Secteur 5","Total"]
[null,"Coefficient",{"$f":"C3","v":1},{"$f":"D3","v":0.66600000000000004},1.22,{"$f":"IF(F31>0,(H32-C32-D32-E32-G32)/F31,0)","v":0.66027555555555606},1.214]
[null,"Poids sectoriel",{"$f":"C25","v":0.2049514455140434},{"$f":"D25","v":0.13237558432191177},0.24248980911821674,0.17888592475934023,0.2412972362864878]
[null,null,{"$f":"C30*C31","v":0.2049514455140434},{"$f":"D30*D31","v":8.8162139158393243E-2},{"$f":"E30*E31","v":0.29583756712422443},{"$f":"F30*F31","v":0.11811400335154278},{"$f":"G30*G31","v":0.29293484485179616},1]
[]
[]
[null,"Coefficient taux de base secteur 5"]
[null,null,"Secteur 1","Secteur 2","Secteur 3","Secteur 4","Secteur 5","Total"]
[null,"Coefficient",{"$f":"C3","v":1},{"$f":"D3","v":0.66600000000000004},1.22,0.9,{"$f":"IF(G38>0,(H39-C39-D39-E39-F39)/G38,0)","v":1.2140000000000002}]
[null,"Poids sectoriel",{"$f":"C4","v":0.2049514455140434},{"$f":"D4","v":0.19876213862148914},0.19876213862148914,0.19876213862148914,0.19876213862148914]
[null,null,{"$f":"C37*C38","v":0.2049514455140434},{"$f":"D37*D38","v":0.13237558432191177},{"$f":"E37*E38","v":0.24248980911821674},{"$f":"F37*F38","v":0.17888592475934023},{"$f":"G37*G38","v":0.24129723628648786},1]

{"sheet":"Balises-Taux","index":13,"n_rows":79,"n_cols":8,"rows_kept":79,"cut":false,"hidden":false,"merged":[[2,0,2,5],[13,1,13,2],[13,4,13,5],[3,1,3,2],[3,4,3,5],[9,1,9,2],[9,4,9,5],[12,1,12,2],[12,4,12,5]]}
["Nom du scénario",{"$f":"'Scénario-taux variés'!E10","v":0}]
["Population de la municipalité",{"$f":"'Scénario-taux variés'!E8","v":1000000},"habitants"]
["DÉTERMINATION DES COEFFICIENTS DU TAUX DE BASE POUR LES IMMEUBLES NON RÉSIDENTIELS ET INDUSTRIELS"]
[null,"Coefficient non résidentiel",null,null,"Coefficient industriel"]
["Population de la municipalité","Coefficient du taux de base ","Coefficient à retenir",null,"Coefficient du taux de base ","Coefficient à retenir"]
["Moins de 5 000 habitants",4.0999999999999996,{"$f":"IF($B$2<5000,B6,\"-\")","v":"-"},null,4.5,{"$f":"IF($B$2<5000,E6,\"-\")","v":"-"}]
["De 5 000 à 99 999 habitants",4.4000000000000004,{"$f":"IF(AND($B$2>=5000,$B$2<=99999),B7,\"-\")","v":"-"},null,5,{"$f":"IF(AND($B$2>=5000,$B$2<=99999),E7,\"-\")","v":"-"}]
["De 100 000 à 199 999 habitants",4.45,{"$f":"IF(AND($B$2>=100000,$B$2<=199999),B8,\"-\")","v":"-"},null,5,{"$f":"IF(AND($B$2>=100000,$B$2<=199999),E8,\"-\")","v":"-"}]
["200 000 habitants et plus",4.8,{"$f":"IF($B$2>=200000,B9,\"-\")","v":4.8},null,5,{"$f":"IF($B$2>=200000,E9,\"-\")","v":5}]
["Coefficient correspondant à la taille de la municipalité",{"$f":"SUM(C6:C9)","v":4.8},null,null,{"$f":"SUM(F6:F9)","v":5}]
[]
["TAUX EN $ PAR 100 $ D'ÉVALUATION SELON LA CATÉGORIE D'IMMEUBLES"]
[null,"Minimum",null,null,"Maximum",null,null," Taux choisi"]
["Taux de base uniformisé (TBU)",null,null,null,null,null,null,{"$f":"'Scénario-taux variés'!H97","v":0.64114166176177556}]
["Taux de base sectoriel","TBU X 66,6 %",{"$f":"0.666*H14","v":0.42700034673334253},null,"TBU X 133,3 %",{"$f":"H14*1.333","v":0.85464183512844683}]
["Taux sous-catégorie résidentielle","TBU X 66,6 %",{"$f":"0.666*H14","v":0.42700034673334253},null,"TBU X 133,3 %",{"$f":"H14*1.333","v":0.85464183512844683}]
[]
["Taux non résidentiel ou référence (TINR) Secteur 1","TBU",{"$f":"$H$14","v":0.64114166176177556},null,"TBU X Coefficient non résidentiel",{"$f":"$H$14*$B$10","v":3.0774799764565226},null,{"$f":"'Scénario-taux variés'!C113","v":3.0774799764565226}]
["Taux sous-catégorie non résidentielle secteur 1","TBU",{"$f":"$H$14","v":0.64114166176177556},null,"TBU X Coefficient non résidentiel",{"$f":"F18","v":3.0774799764565226}]
[null,"TINR X 66,6 %",{"$f":"H18*0.666","v":2.0496016643200443},null,"TINR X 133,3 %",{"$f":"H18*1.333","v":4.1022808086165448}]
[null,"Plus grand entre les deux balises ",{"$f":"MAX(C19:C20)","v":2.0496016643200443},null,"Plus petit entre les deux balises",{"$f":"MIN(F19:F20)","v":3.0774799764565226}]
["Coefficient",null,{"$f":"C21/$H$14","v":3.1968000000000005},null,null,{"$f":"IF(F20<$H$14,H14/$H$14,F21/$H$14)","v":4.8}]
[]
["Taux non résidentiel ou référence (TINR) Secteur 2","TBU",{"$f":"$H$14","v":0.64114166176177556},null,"TBU X Coefficient non résidentiel",{"$f":"$H$14*$B$10","v":3.0774799764565226},null,{"$f":"'Scénario-taux variés'!D113","v":2.5645666470471022}]
["Taux sous-catégorie non résidentielle secteur 2","TBU",{"$f":"$H$14","v":0.64114166176177556},null,"TBU X Coefficient non résidentiel",{"$f":"F24","v":3.0774799764565226}]
[null,"TINR X 66,6 %",{"$f":"H24*0.666","v":1.7080013869333701},null,"TINR X 133,3 %",{"$f":"H24*1.333","v":3.4185673405137873}]
[null,"Plus grand entre les deux balises ",{"$f":"MAX(C25:C26)","v":1.7080013869333701},null,"Plus petit entre les deux balises",{"$f":"MIN(F25:F26)","v":3.0774799764565226}]
["Coefficient",null,{"$f":"C27/$H$14","v":2.6640000000000001},null,null,{"$f":"IF(F26<$H$14,H20/$H$14,F27/$H$14)","v":4.8}]
[]
["Taux non résidentiel ou référence (TINR) Secteur 3","TBU",{"$f":"$H$14","v":0.64114166176177556},null,"TBU X Coefficient non résidentiel",{"$f":"$H$14*$B$10","v":3.0774799764565226},null,{"$f":"'Scénario-taux variés'!E113","v":1.9234249852853267}]
["Taux sous-catégorie non résidentielle secteur 3","TBU",{"$f":"$H$14","v":0.64114166176177556},null,"TBU X Coefficient non résidentiel",{"$f":"F30","v":3.0774799764565226}]
[null,"TINR X 66,6 %",{"$f":"H30*0.666","v":1.2810010402000276},null,"TINR X 133,3 %",{"$f":"H30*1.333","v":2.5639255053853405}]
[null,"Plus grand entre les deux balises ",{"$f":"MAX(C31:C32)","v":1.2810010402000276},null,"Plus petit entre les deux balises",{"$f":"MIN(F31:F32)","v":2.5639255053853405}]
["Coefficient",null,{"$f":"C33/$H$14","v":1.998},null,null,{"$f":"IF(F32<$H$14,H26/$H$14,F33/$H$14)","v":3.9990000000000001}]
[]
["Taux non résidentiel ou référence (TINR) Secteur 4","TBU",{"$f":"$H$14","v":0.64114166176177556},null,"TBU X Coefficient non résidentiel",{"$f":"$H$14*$B$10","v":3.0774799764565226},null,{"$f":"'Scénario-taux variés'!F113","v":1.6028541544044388}]
["Taux sous-catégorie non résidentielle secteur 4","TBU",{"$f":"$H$14","v":0.64114166176177556},null,"TBU X Coefficient non résidentiel",{"$f":"F36","v":3.0774799764565226}]
[null,"TINR X 66,6 %",{"$f":"H36*0.666","v":1.0675008668333563},null,"TINR X 133,3 %",{"$f":"H36*1.333","v":2.1366045878211168}]
[null,"Plus grand entre les deux balises ",{"$f":"MAX(C37:C38)","v":1.0675008668333563},null,"Plus petit entre les deux balises",{"$f":"MIN(F37:F38)","v":2.1366045878211168}]
["Coefficient",null,{"$f":"C39/$H$14","v":1.665},null,null,{"$f":"IF(F38<$H$14,H32/$H$14,F39/$H$14)","v":3.3324999999999996}]
[]
["Taux non résidentiel ou référence (TINR) Secteur 5","TBU",{"$f":"$H$14","v":0.64114166176177556},null,"TBU X Coefficient non résidentiel",{"$f":"$H$14*$B$10","v":3.0774799764565226},null,{"$f":"'Scénario-taux variés'!G113","v":2.8851374779279899}]
["Taux sous-catégorie non résidentielle secteur 5","TBU",{"$f":"$H$14","v":0.64114166176177556},null,"TBU X Coefficient non résidentiel",{"$f":"F42","v":3.0774799764565226}]
[null,"TINR X 66,6 %",{"$f":"H42*0.666","v":1.9215015603000414},null,"TINR X 133,3 %",{"$f":"H42*1.333","v":3.8458882580780105}]
[null,"Plus grand entre les deux balises ",{"$f":"MAX(C43:C44)","v":1.9215015603000414},null,"Plus petit entre les deux balises",{"$f":"MIN(F43:F44)","v":3.0774799764565226}]
["Coefficient",null,{"$f":"C45/$H$14","v":2.9969999999999999},null,null,{"$f":"IF(F44<$H$14,H38/$H$14,F45/$H$14)","v":4.8}]
[]
[]
["Taux industriel (TIND) secteur 1","TBU",{"$f":"$H$14","v":0.64114166176177556},null,"TBU X Coefficient industriel",{"$f":"$H$14*$E$10","v":3.2057083088088776}]
[null,"TINR X 66,6 %",{"$f":"H18*0.666","v":2.0496016643200443},null,"TINR X 133,3 %",{"$f":"$H$18*1.333","v":4.1022808086165448}]
[null,"Plus grand entre les deux balises ",{"$f":"MAX(C49:C50)","v":2.0496016643200443},null,"Plus petit entre les deux balises",{"$f":"MIN(F49:F50)","v":3.2057083088088776}]
["Coefficient",null,{"$f":"C51/$H$14","v":3.1968000000000005},null,null,{"$f":"IF(H18<$H$14,$H$14/$H$14,F51/$H$14)","v":5}]
[]
["Taux industriel (TIND) secteur 2","TBU",{"$f":"$H$14","v":0.64114166176177556},null,"TBU X Coefficient industriel",{"$f":"$H$14*$E$10","v":3.2057083088088776}]
[null,"TINR X 66,6 %",{"$f":"H24*0.666","v":1.7080013869333701},null,"TINR X 133,3 %",{"$f":"$H$24*1.333","v":3.4185673405137873}]
[null,"Plus grand entre les deux balises ",{"$f":"MAX(C54:C55)","v":1.7080013869333701},null,"Plus petit entre les deux balises",{"$f":"MIN(F54:F55)","v":3.2057083088088776}]
["Coefficient",null,{"$f":"C56/$H$14","v":2.6640000000000001},null,null,{"$f":"IF(H24<$H$14,$H$14/$H$14,F56/$H$14)","v":5}]
[]
[]
["Taux industriel (TIND) secteur  3","TBU",{"$f":"$H$14","v":0.64114166176177556},null,"TBU X Coefficient industriel",{"$f":"$H$14*$E$10","v":3.2057083088088776}]
[null,"TINR X 66,6 %",{"$f":"H30*0.666","v":1.2810010402000276},null,"TINR X 133,3 %",{"$f":"$H$30*1.333","v":2.5639255053853405}]
[null,"Plus grand entre les deux balises ",{"$f":"MAX(C60:C61)","v":1.2810010402000276},null,"Plus petit entre les deux balises",{"$f":"MIN(F60:F61)","v":2.5639255053853405}]
["Coefficient",null,{"$f":"C62/$H$14","v":1.998},null,null,{"$f":"IF(H30<$H$14,$H$14/$H$14,F62/$H$14)","v":3.9990000000000001}]
[]
["Taux industriel (TIND) secteur 4","TBU",{"$f":"$H$14","v":0.64114166176177556},null,"TBU X Coefficient industriel",{"$f":"$H$14*$E$10","v":3.2057083088088776}]
[null,"TINR X 66,6 %",{"$f":"H36*0.666","v":1.0675008668333563},null,"TINR X 133,3 %",{"$f":"$H$36*1.333","v":2.1366045878211168}]
[null,"Plus grand entre les deux balises ",{"$f":"MAX(C65:C66)","v":1.0675008668333563},null,"Plus petit entre les deux balises",{"$f":"MIN(F65:F66)","v":2.1366045878211168}]
["Coefficient",null,{"$f":"C67/$H$14","v":1.665},null,null,{"$f":"IF(H36<$H$14,$H$14/$H$14,F67/$H$14)","v":3.3324999999999996}]
[]
["Taux industriel (TIND) secteur 5","TBU",{"$f":"$H$14","v":0.64114166176177556},null,"TBU X Coefficient industriel",{"$f":"$H$14*$E$10","v":3.2057083088088776}]
[null,"TINR X 66,6 %",{"$f":"H42*0.666","v":1.9215015603000414},null,"TINR X 133,3 %",{"$f":"$H$42*1.333","v":3.8458882580780105}]
[null,"Plus grand entre les deux balises ",{"$f":"MAX(C70:C71)","v":1.9215015603000414},null,"Plus petit entre les deux balises",{"$f":"MIN(F70:F71)","v":3.2057083088088776}]
["Coefficient",null,{"$f":"C72/$H$14","v":2.9969999999999999},null,null,{"$f":"IF(H42<$H$14,$H$14/$H$14,F72/$H$14)","v":5}]
[]
["Taux des terrains vagues desservis (TTVD)","TBU",{"$f":"H14","v":0.64114166176177556},null,"TBU X 4",{"$f":"H14*4","v":2.5645666470471022}]
[]
["Taux des immeubles forestiers (TFOREST)","TBU X 66,6%",{"$f":"H14*0.666","v":0.42700034673334253},null,"TBU",{"$f":"H14","v":0.64114166176177556}]
[]
["Taux des immeubles agricoles (TAGRI)","TBU X 66,6%",{"$f":"0.666*H14","v":0.42700034673334253},null,"TBU",{"$f":"H14","v":0.64114166176177556}]

{"sheet":"Résultats du scénario","index":14,"n_rows":102,"n_cols":12,"rows_kept":102,"cut":false,"hidden":false,"merged":[[99,2,99,11],[35,2,35,6],[35,7,35,11],[67,2,67,6],[67,7,67,11],[98,2,98,6],[98,7,98,11]]}
[null,"Municipalité de ",{"$f":"'Scénario-taux variés'!E7","v":0}]
[null,"Année :",{"$f":"'Scénario-taux variés'!G7","v":2025}]
[null,"Nom du scénario :",{"$f":"'Scénario-taux variés'!E10","v":0}]
[]
["Taux de la taxe foncière générale"]
[null,null,"Secteur 1","Secteur 2","Secteur 3","Secteur 4","Secteur 5"]
["TB",null,{"$f":"'Scénario-taux variés'!C102","v":0.64114166176177556},{"$f":"'Scénario-taux variés'!D102","v":0.42700034673334253},{"$f":"'Scénario-taux variés'!E102","v":0.78219282734936613},{"$f":"'Scénario-taux variés'!F102","v":0.57702749558559807},{"$f":"'Scénario-taux variés'!G102","v":0.77834597737879552}]
["TSCR 1",{"$f":"'Scénario-taux variés'!C16","v":"SR1"},{"$f":"'Scénario-taux variés'!C103","v":0.64114166176177556},{"$f":"'Scénario-taux variés'!D103","v":0.42700034673334253},{"$f":"'Scénario-taux variés'!E103","v":0.78219282734936613},{"$f":"'Scénario-taux variés'!F103","v":0.57702749558559807},{"$f":"'Scénario-taux variés'!G103","v":0.77834597737879552}]
["TSCR 2",{"$f":"'Scénario-taux variés'!C17","v":"SR2"},{"$f":"'Scénario-taux variés'!C104","v":0.85464183512844683},{"$f":"'Scénario-taux variés'!D104","v":0.42700034673334253},{"$f":"'Scénario-taux variés'!E104","v":0.78219282734936613},{"$f":"'Scénario-taux variés'!F104","v":0.57702749558559807},{"$f":"'Scénario-taux variés'!G104","v":0.77834597737879552}]
["TSCR 3",{"$f":"'Scénario-taux variés'!C18","v":"SR3"},{"$f":"'Scénario-taux variés'!C105","v":0.85464183512844683},{"$f":"'Scénario-taux variés'!D105","v":0.42700034673334253},{"$f":"'Scénario-taux variés'!E105","v":0.78219282734936613},{"$f":"'Scénario-taux variés'!F105","v":0.57702749558559807},{"$f":"'Scénario-taux variés'!G105","v":0.77834597737879552}]
["TSCR 4",{"$f":"'Scénario-taux variés'!C19","v":"SR4"},{"$f":"'Scénario-taux variés'!C106","v":0.85464183512844683},{"$f":"'Scénario-taux variés'!D106","v":0.42700034673334253},{"$f":"'Scénario-taux variés'!E106","v":0.78219282734936613},{"$f":"'Scénario-taux variés'!F106","v":0.57702749558559807},{"$f":"'Scénario-taux variés'!G106","v":0.77834597737879552}]
["TSCR 5",{"$f":"'Scénario-taux variés'!C20","v":"SR5"},{"$f":"'Scénario-taux variés'!C107","v":0.85464183512844683},{"$f":"'Scénario-taux variés'!D107","v":0.42700034673334253},{"$f":"'Scénario-taux variés'!E107","v":0.78219282734936613},{"$f":"'Scénario-taux variés'!F107","v":0.57702749558559807},{"$f":"'Scénario-taux variés'!G107","v":0.77834597737879552}]
["TSCR 6",{"$f":"'Scénario-taux variés'!C21","v":"SR6"},{"$f":"'Scénario-taux variés'!C108","v":0.85464183512844683},{"$f":"'Scénario-taux variés'!D108","v":0.42700034673334253},{"$f":"'Scénario-taux variés'!E108","v":0.78219282734936613},{"$f":"'Scénario-taux variés'!F108","v":0.57702749558559807},{"$f":"'Scénario-taux variés'!G108","v":0.77834597737879552}]
["TSCR 7",{"$f":"'Scénario-taux variés'!C22","v":"SR7"},{"$f":"'Scénario-taux variés'!C109","v":0.85464183512844683},{"$f":"'Scénario-taux variés'!D109","v":0.42700034673334253},{"$f":"'Scénario-taux variés'!E109","v":0.78219282734936613},{"$f":"'Scénario-taux variés'!F109","v":0.57702749558559807},{"$f":"'Scénario-taux variés'!G109","v":0.77834597737879552}]
["TSCR 8",{"$f":"'Scénario-taux variés'!C23","v":"SR8"},{"$f":"'Scénario-taux variés'!C110","v":0.85464183512844683},{"$f":"'Scénario-taux variés'!D110","v":0.42700034673334253},{"$f":"'Scénario-taux variés'!E110","v":0.78219282734936613},{"$f":"'Scénario-taux variés'!F110","v":0.57702749558559807},{"$f":"'Scénario-taux variés'!G110","v":0.77834597737879552}]
["TSCR 9",{"$f":"'Scénario-taux variés'!C24","v":"SR9"},{"$f":"'Scénario-taux variés'!C111","v":0.85464183512844683},{"$f":"'Scénario-taux variés'!D111","v":0.42700034673334253},{"$f":"'Scénario-taux variés'!E111","v":0.78219282734936613},{"$f":"'Scénario-taux variés'!F111","v":0.57702749558559807},{"$f":"'Scénario-taux variés'!G111","v":0.77834597737879552}]
["TSCR 10",{"$f":"'Scénario-taux variés'!C25","v":"SR10"},{"$f":"'Scénario-taux variés'!C112","v":0.85464183512844683},{"$f":"'Scénario-taux variés'!D112","v":0.42700034673334253},{"$f":"'Scénario-taux variés'!E112","v":0.78219282734936613},{"$f":"'Scénario-taux variés'!F112","v":0.57702749558559807},{"$f":"'Scénario-taux variés'!G112","v":0.77834597737879552}]
["TINR ou Taux sous-catégorie de référence",null,{"$f":"'Scénario-taux variés'!C113","v":3.0774799764565226},{"$f":"'Scénario-taux variés'!D113","v":2.5645666470471022},{"$f":"'Scénario-taux variés'!E113","v":1.9234249852853267},{"$f":"'Scénario-taux variés'!F113","v":1.6028541544044388},{"$f":"'Scénario-taux variés'!G113","v":2.8851374779279899}]
["TSCNR 1",{"$f":"'Scénario-taux variés'!C27","v":"SNR 1"},{"$f":"'Scénario-taux variés'!C114","v":3.0774799764565226},{"$f":"'Scénario-taux variés'!D114","v":2.5645666470471022},{"$f":"'Scénario-taux variés'!E114","v":1.9234249852853267},{"$f":"'Scénario-taux variés'!F114","v":1.6028541544044388},{"$f":"'Scénario-taux variés'!G114","v":2.8851374779279899}]
["TSCNR 2",{"$f":"'Scénario-taux variés'!C28","v":"SNR 2"},{"$f":"'Scénario-taux variés'!C115","v":3.0774799764565226},{"$f":"'Scénario-taux variés'!D115","v":2.5645666470471022},{"$f":"'Scénario-taux variés'!E115","v":1.9234249852853267},{"$f":"'Scénario-taux variés'!F115","v":1.6028541544044388},{"$f":"'Scénario-taux variés'!G115","v":2.8851374779279899}]
["TSCNR 3",{"$f":"'Scénario-taux variés'!C29","v":"SNR 3"},{"$f":"'Scénario-taux variés'!C116","v":3.0774799764565226},{"$f":"'Scénario-taux variés'!D116","v":2.5645666470471022},{"$f":"'Scénario-taux variés'!E116","v":1.9234249852853267},{"$f":"'Scénario-taux variés'!F116","v":1.6028541544044388},{"$f":"'Scénario-taux variés'!G116","v":2.8851374779279899}]
["TSCNR 4",{"$f":"'Scénario-taux variés'!C30","v":"SNR 4"},{"$f":"'Scénario-taux variés'!C117","v":3.0774799764565226},{"$f":"'Scénario-taux variés'!D117","v":2.5645666470471022},{"$f":"'Scénario-taux variés'!E117","v":1.9234249852853267},{"$f":"'Scénario-taux variés'!F117","v":1.6028541544044388},{"$f":"'Scénario-taux variés'!G117","v":2.8851374779279899}]
["TSCNR 5",{"$f":"'Scénario-taux variés'!C31","v":"SNR 5"},{"$f":"'Scénario-taux variés'!C118","v":3.0774799764565226},{"$f":"'Scénario-taux variés'!D118","v":2.5645666470471022},{"$f":"'Scénario-taux variés'!E118","v":1.9234249852853267},{"$f":"'Scénario-taux variés'!F118","v":1.6028541544044388},{"$f":"'Scénario-taux variés'!G118","v":2.8851374779279899}]
["TSCNR 6",{"$f":"'Scénario-taux variés'!C32","v":"SNR 6"},{"$f":"'Scénario-taux variés'!C119","v":3.0774799764565226},{"$f":"'Scénario-taux variés'!D119","v":2.5645666470471022},{"$f":"'Scénario-taux variés'!E119","v":1.9234249852853267},{"$f":"'Scénario-taux variés'!F119","v":1.6028541544044388},{"$f":"'Scénario-taux variés'!G119","v":2.8851374779279899}]
["TSCNR 7",{"$f":"'Scénario-taux variés'!C33","v":"SNR 7"},{"$f":"'Scénario-taux variés'!C120","v":3.0774799764565226},{"$f":"'Scénario-taux variés'!D120","v":2.5645666470471022},{"$f":"'Scénario-taux variés'!E120","v":1.9234249852853267},{"$f":"'Scénario-taux variés'!F120","v":1.6028541544044388},{"$f":"'Scénario-taux variés'!G120","v":2.8851374779279899}]
["TSCNR 8",{"$f":"'Scénario-taux variés'!C34","v":"SNR 8"},{"$f":"'Scénario-taux variés'!C121","v":3.0774799764565226},{"$f":"'Scénario-taux variés'!D121","v":2.5645666470471022},{"$f":"'Scénario-taux variés'!E121","v":1.9234249852853267},{"$f":"'Scénario-taux variés'!F121","v":1.6028541544044388},{"$f":"'Scénario-taux variés'!G121","v":2.8851374779279899}]
["TSCNR 9",{"$f":"'Scénario-taux variés'!C35","v":"SNR 9"},{"$f":"'Scénario-taux variés'!C122","v":3.0774799764565226},{"$f":"'Scénario-taux variés'!D122","v":2.5645666470471022},{"$f":"'Scénario-taux variés'!E122","v":1.9234249852853267},{"$f":"'Scénario-taux variés'!F122","v":1.6028541544044388},{"$f":"'Scénario-taux variés'!G122","v":2.8851374779279899}]
["TSCNR 10",{"$f":"'Scénario-taux variés'!C36","v":"SNR 10"},{"$f":"'Scénario-taux variés'!C123","v":3.0774799764565226},{"$f":"'Scénario-taux variés'!D123","v":2.5645666470471022},{"$f":"'Scénario-taux variés'!E123","v":1.9234249852853267},{"$f":"'Scénario-taux variés'!F123","v":1.6028541544044388},{"$f":"'Scénario-taux variés'!G123","v":2.8851374779279899}]
["TIND",null,{"$f":"'Scénario-taux variés'!C124","v":3.2057083088088776},{"$f":"'Scénario-taux variés'!D124","v":2.5645666470471022},{"$f":"'Scénario-taux variés'!E124","v":1.9234249852853267},{"$f":"'Scénario-taux variés'!F124","v":1.6028541544044388},{"$f":"'Scénario-taux variés'!G124","v":3.2057083088088776}]
["TTVD",null,{"$f":"'Scénario-taux variés'!C125","v":2.5645666470471022},{"$f":"'Scénario-taux variés'!D125","v":1.2822833235235511},{"$f":"'Scénario-taux variés'!E125","v":1.2822833235235511},{"$f":"'Scénario-taux variés'!F125","v":1.9234249852853267},{"$f":"'Scénario-taux variés'!G125","v":2.5645666470471022}]
["TFOREST",null,{"$f":"'Scénario-taux variés'!C126","v":0.64114166176177556},{"$f":"'Scénario-taux variés'!D126","v":0.42700034673334253},{"$f":"'Scénario-taux variés'!E126","v":0.78219282734936613},{"$f":"'Scénario-taux variés'!F126","v":0.57702749558559807},{"$f":"'Scénario-taux variés'!G126","v":0.77834597737879552}]
["TAGRI",null,{"$f":"'Scénario-taux variés'!C127","v":0.64114166176177556},{"$f":"'Scénario-taux variés'!D127","v":0.42700034673334253},{"$f":"'Scénario-taux variés'!E127","v":0.78219282734936613},{"$f":"'Scénario-taux variés'!F127","v":0.57702749558559807},{"$f":"'Scénario-taux variés'!G127","v":0.77834597737879552}]
["(TTVD − TBU)",null,{"$f":"'Scénario-taux variés'!C128","v":1.9234249852853267},{"$f":"'Scénario-taux variés'!D128","v":0.64114166176177556},{"$f":"'Scénario-taux variés'!E128","v":0.64114166176177556},{"$f":"'Scénario-taux variés'!F128","v":1.2822833235235511},{"$f":"'Scénario-taux variés'!G128","v":1.9234249852853267}]
[]
["Assiette"]
[null,null,"Assiette imposable",null,null,null,null,"Assiette compensable"]
[null,null,"Secteur 1","Secteur 2","Secteur 3","Secteur 4","Secteur 5","Secteur 1","Secteur 2","Secteur 3","Secteur 4","Secteur 5"]
["TB",null,{"$f":"'Scénario-taux variés'!H168","v":772400663.71818185},{"$f":"'Scénario-taux variés'!I168","v":8384901700.8999996},{"$f":"'Scénario-taux variés'!J168","v":8384901700.8999996},{"$f":"'Scénario-taux variés'!K168","v":8384901700.8999996},{"$f":"'Scénario-taux variés'!L168","v":8384901700.8999996},{"$f":"IF('Sommaire du rôle_sec_1'!$F$66>0,'Sommaire du rôle_sec_1'!$F$84,'Sommaire du rôle_sec_1'!$O$72)","v":5708197},{"$f":"IF('Sommaire du rôle_sec_2'!$F$66>0,'Sommaire du rôle_sec_2'!$F$84,'Sommaire du rôle_sec_2'!$O$72)","v":62790167},{"$f":"IF('Sommaire du rôle_sec_3'!$F$66>0,'Sommaire du rôle_sec_3'!$F$84,'Sommaire du rôle_sec_3'!$O$72)","v":62790167},{"$f":"IF('Sommaire du rôle_sec_4'!$F$66>0,'Sommaire du rôle_sec_4'!$F$84,'Sommaire du rôle_sec_4'!$O$72)","v":62790167},{"$f":"IF('Sommaire du rôle_sec_5'!$F$66>0,'Sommaire du rôle_sec_5'!$F$84,'Sommaire du rôle_sec_5'!$O$72)","v":62790167}]
["TSCR 1",{"$f":"B8","v":"SR1"},{"$f":"'Scénario-taux variés'!H169","v":761250103.71818185},{"$f":"'Scénario-taux variés'!I169","v":0},{"$f":"'Scénario-taux variés'!J169","v":0},{"$f":"'Scénario-taux variés'!K169","v":0},{"$f":"'Scénario-taux variés'!L169","v":0},{"$f":"'Sommaire du rôle_sec_1'!$G$84","v":5708197},{"$f":"'Sommaire du rôle_sec_2'!$G$84","v":0},{"$f":"'Sommaire du rôle_sec_4'!$G$84","v":0},{"$f":"'Sommaire du rôle_sec_4'!$G$84","v":0},{"$f":"'Sommaire du rôle_sec_3'!$G$84","v":0}]
["TSCR 2","SR2",{"$f":"'Scénario-taux variés'!H170","v":761250103.71818185},{"$f":"'Scénario-taux variés'!I170","v":0},{"$f":"'Scénario-taux variés'!J170","v":0},{"$f":"'Scénario-taux variés'!K170","v":0},{"$f":"'Scénario-taux variés'!L170","v":0},{"$f":"'Sommaire du rôle_sec_1'!$H$84","v":5708197},{"$f":"'Sommaire du rôle_sec_2'!$H$84","v":0},{"$f":"'Sommaire du rôle_sec_3'!$H$84","v":0},{"$f":"'Sommaire du rôle_sec_4'!$H$84","v":0},{"$f":"'Sommaire du rôle_sec_5'!$H$84","v":0}]
["TSCR 3","SR3",{"$f":"'Scénario-taux variés'!H171","v":761250103.71818185},{"$f":"'Scénario-taux variés'!I171","v":0},{"$f":"'Scénario-taux variés'!J171","v":0},{"$f":"'Scénario-taux variés'!K171","v":0},{"$f":"'Scénario-taux variés'!L171","v":0},{"$f":"'Sommaire du rôle_sec_1'!$I$84","v":5708197},{"$f":"'Sommaire du rôle_sec_2'!$I$84","v":0},{"$f":"'Sommaire du rôle_sec_3'!$I$84","v":0},{"$f":"'Sommaire du rôle_sec_4'!$I$84","v":0},{"$f":"'Sommaire du rôle_sec_5'!$I$84","v":0}]
["TSCR 4","SR4",{"$f":"'Scénario-taux variés'!H172","v":761250103.71818185},{"$f":"'Scénario-taux variés'!I172","v":0},{"$f":"'Scénario-taux variés'!J172","v":0},{"$f":"'Scénario-taux variés'!K172","v":0},{"$f":"'Scénario-taux variés'!L172","v":0},{"$f":"'Sommaire du rôle_sec_1'!$J$84","v":5708197},{"$f":"'Sommaire du rôle_sec_2'!$J$84","v":0},{"$f":"'Sommaire du rôle_sec_3'!$J$84","v":0},{"$f":"'Sommaire du rôle_sec_4'!$J$84","v":0},{"$f":"'Sommaire du rôle_sec_5'!$J$84","v":0}]
["TSCR 5","SR5",{"$f":"'Scénario-taux variés'!H173","v":761250103.71818185},{"$f":"'Scénario-taux variés'!I173","v":0},{"$f":"'Scénario-taux variés'!J173","v":0},{"$f":"'Scénario-taux variés'!K173","v":0},{"$f":"'Scénario-taux variés'!L173","v":0},{"$f":"'Sommaire du rôle_sec_1'!$K$84","v":5708197},{"$f":"'Sommaire du rôle_sec_2'!$K$84","v":0},{"$f":"'Sommaire du rôle_sec_3'!$K$84","v":0},{"$f":"'Sommaire du rôle_sec_4'!$K$84","v":0},{"$f":"'Sommaire du rôle_sec_5'!$K$84","v":0}]
["TSCR 6","SR6",{"$f":"'Scénario-taux variés'!H174","v":761250103.71818185},{"$f":"'Scénario-taux variés'!I174","v":0},{"$f":"'Scénario-taux variés'!J174","v":0},{"$f":"'Scénario-taux variés'!K174","v":0},{"$f":"'Scénario-taux variés'!L174","v":0},{"$f":"'Sommaire du rôle_sec_1'!$L$84","v":5708197},{"$f":"'Sommaire du rôle_sec_2'!$L$84","v":0},{"$f":"'Sommaire du rôle_sec_3'!$L$84","v":0},{"$f":"'Sommaire du rôle_sec_4'!$L$84","v":0},{"$f":"'Sommaire du rôle_sec_5'!$L$84","v":0}]
["TSCR 7","SR7",{"$f":"'Scénario-taux variés'!H175","v":761250103.71818185},{"$f":"'Scénario-taux variés'!I175","v":0},{"$f":"'Scénario-taux variés'!J175","v":0},{"$f":"'Scénario-taux variés'!K175","v":0},{"$f":"'Scénario-taux variés'!L175","v":0},{"$f":"'Sommaire du rôle_sec_1'!$M$84","v":5708197},{"$f":"'Sommaire du rôle_sec_2'!$M$84","v":0},{"$f":"'Sommaire du rôle_sec_3'!$M$84","v":0},{"$f":"'Sommaire du rôle_sec_4'!$M$84","v":0},{"$f":"'Sommaire du rôle_sec_5'!$M$84","v":0}]
["TSCR 8","SR8",{"$f":"'Scénario-taux variés'!H176","v":761250103.71818185},{"$f":"'Scénario-taux variés'!I176","v":0},{"$f":"'Scénario-taux variés'!J176","v":0},{"$f":"'Scénario-taux variés'!K176","v":0},{"$f":"'Scénario-taux variés'!L176","v":0},{"$f":"'Sommaire du rôle_sec_1'!$N$84","v":5708197},{"$f":"'Sommaire du rôle_sec_2'!$N$84","v":0},{"$f":"'Sommaire du rôle_sec_3'!$N$84","v":0},{"$f":"'Sommaire du rôle_sec_4'!$N$84","v":0},{"$f":"'Sommaire du rôle_sec_5'!$N$84","v":0}]
["TSCR 9","SR9",{"$f":"'Scénario-taux variés'!H177","v":761250103.71818185},{"$f":"'Scénario-taux variés'!I177","v":0},{"$f":"'Scénario-taux variés'!J177","v":0},{"$f":"'Scénario-taux variés'!K177","v":0},{"$f":"'Scénario-taux variés'!L177","v":0},{"$f":"'Sommaire du rôle_sec_1'!$O$84","v":5708197},{"$f":"'Sommaire du rôle_sec_2'!$O$84","v":0},{"$f":"'Sommaire du rôle_sec_3'!$O$84","v":0},{"$f":"'Sommaire du rôle_sec_4'!$O$84","v":0},{"$f":"'Sommaire du rôle_sec_5'!$O$84","v":0}]
["TSCR 10","SR10",{"$f":"'Scénario-taux variés'!H178","v":761250103.71818185},{"$f":"'Scénario-taux variés'!I178","v":0},{"$f":"'Scénario-taux variés'!J178","v":0},{"$f":"'Scénario-taux variés'!K178","v":0},{"$f":"'Scénario-taux variés'!L178","v":0},{"$f":"'Sommaire du rôle_sec_1'!$P$84","v":5708197},{"$f":"'Sommaire du rôle_sec_2'!$P$84","v":0},{"$f":"'Sommaire du rôle_sec_3'!$P$84","v":0},{"$f":"'Sommaire du rôle_sec_4'!$P$84","v":0},{"$f":"'Sommaire du rôle_sec_5'!$P$84","v":0}]
["TINR ou Taux sous-catégorie de référence",null,{"$f":"'Scénario-taux variés'!H179","v":120420639.09999999},{"$f":"'Scénario-taux variés'!I179","v":1244467630.0999999},{"$f":"'Scénario-taux variés'!J179","v":1244467630.0999999},{"$f":"'Scénario-taux variés'!K179","v":1244467630.0999999},{"$f":"'Scénario-taux variés'!L179","v":1244467630.0999999},{"$f":"IF('Sommaire du rôle_sec_1'!$F$46>0,'Sommaire du rôle_sec_1'!$F$78,'Sommaire du rôle_sec_1'!$F$72)","v":25925903},{"$f":"IF('Sommaire du rôle_sec_2'!$F$46>0,'Sommaire du rôle_sec_2'!$F$78,'Sommaire du rôle_sec_2'!$F$72)","v":285184933},{"$f":"IF('Sommaire du rôle_sec_3'!$F$46>0,'Sommaire du rôle_sec_3'!$F$78,'Sommaire du rôle_sec_3'!$F$72)","v":285184933},{"$f":"IF('Sommaire du rôle_sec_4'!$F$46>0,'Sommaire du rôle_sec_4'!$F$78,'Sommaire du rôle_sec_4'!$F$72)","v":285184933},{"$f":"IF('Sommaire du rôle_sec_5'!$F$46>0,'Sommaire du rôle_sec_5'!$F$78,'Sommaire du rôle_sec_5'!$F$72)","v":285184933}]
["TSCNR 1",{"$f":"B19","v":"SNR 1"},{"$f":"'Scénario-taux variés'!H180","v":112404699.09999999},{"$f":"'Scénario-taux variés'!I180","v":0},{"$f":"'Scénario-taux variés'!J180","v":0},{"$f":"'Scénario-taux variés'!K180","v":0},{"$f":"'Scénario-taux variés'!L180","v":0},{"$f":"'Sommaire du rôle_sec_1'!$G$78","v":25925903},{"$f":"'Sommaire du rôle_sec_2'!$G$78","v":0},{"$f":"'Sommaire du rôle_sec_3'!$G$78","v":0},{"$f":"'Sommaire du rôle_sec_4'!$G$78","v":0},{"$f":"'Sommaire du rôle_sec_5'!$G$78","v":0}]
["TSCNR 2","SNR 2",{"$f":"'Scénario-taux variés'!H181","v":112404699.09999999},{"$f":"'Scénario-taux variés'!I181","v":0},{"$f":"'Scénario-taux variés'!J181","v":0},{"$f":"'Scénario-taux variés'!K181","v":0},{"$f":"'Scénario-taux variés'!L181","v":0},{"$f":"'Sommaire du rôle_sec_1'!$H$78","v":25925903},{"$f":"'Sommaire du rôle_sec_2'!$H$78","v":0},{"$f":"'Sommaire du rôle_sec_3'!$H$78","v":0},{"$f":"'Sommaire du rôle_sec_4'!$H$78","v":0},{"$f":"'Sommaire du rôle_sec_5'!$H$78","v":0}]
["TSCNR 3","SNR 3",{"$f":"'Scénario-taux variés'!H182","v":112404699.09999999},{"$f":"'Scénario-taux variés'!I182","v":0},{"$f":"'Scénario-taux variés'!J182","v":0},{"$f":"'Scénario-taux variés'!K182","v":0},{"$f":"'Scénario-taux variés'!L182","v":0},{"$f":"'Sommaire du rôle_sec_1'!$I$78","v":25925903},{"$f":"'Sommaire du rôle_sec_2'!$I$78","v":0},{"$f":"'Sommaire du rôle_sec_3'!$I$78","v":0},{"$f":"'Sommaire du rôle_sec_4'!$I$78","v":0},{"$f":"'Sommaire du rôle_sec_5'!$I$78","v":0}]
["TSCNR 4","SNR 4",{"$f":"'Scénario-taux variés'!H183","v":112404699.09999999},{"$f":"'Scénario-taux variés'!I183","v":0},{"$f":"'Scénario-taux variés'!J183","v":0},{"$f":"'Scénario-taux variés'!K183","v":0},{"$f":"'Scénario-taux variés'!L183","v":0},{"$f":"'Sommaire du rôle_sec_1'!$J$78","v":25925903},{"$f":"'Sommaire du rôle_sec_2'!$J$78","v":0},{"$f":"'Sommaire du rôle_sec_3'!$J$78","v":0},{"$f":"'Sommaire du rôle_sec_4'!$J$78","v":0},{"$f":"'Sommaire du rôle_sec_5'!$J$78","v":0}]
["TSCNR 5","SNR 5",{"$f":"'Scénario-taux variés'!H184","v":112404699.09999999},{"$f":"'Scénario-taux variés'!I184","v":0},{"$f":"'Scénario-taux variés'!J184","v":0},{"$f":"'Scénario-taux variés'!K184","v":0},{"$f":"'Scénario-taux variés'!L184","v":0},{"$f":"'Sommaire du rôle_sec_1'!$K$78","v":25925903},{"$f":"'Sommaire du rôle_sec_2'!$K$78","v":0},{"$f":"'Sommaire du rôle_sec_3'!$K$78","v":0},{"$f":"'Sommaire du rôle_sec_4'!$K$78","v":0},{"$f":"'Sommaire du rôle_sec_5'!$K$78","v":0}]
["TSCNR 6","SNR 6",{"$f":"'Scénario-taux variés'!H185","v":112404699.09999999},{"$f":"'Scénario-taux variés'!I185","v":0},{"$f":"'Scénario-taux variés'!J185","v":0},{"$f":"'Scénario-taux variés'!K185","v":0},{"$f":"'Scénario-taux variés'!L185","v":0},{"$f":"'Sommaire du rôle_sec_1'!$L$78","v":25925903},{"$f":"'Sommaire du rôle_sec_2'!$L$78","v":0},{"$f":"'Sommaire du rôle_sec_3'!$L$78","v":0},{"$f":"'Sommaire du rôle_sec_4'!$L$78","v":0},{"$f":"'Sommaire du rôle_sec_5'!$L$78","v":0}]
["TSCNR 7","SNR 7",{"$f":"'Scénario-taux variés'!H186","v":112404699.09999999},{"$f":"'Scénario-taux variés'!I186","v":0},{"$f":"'Scénario-taux variés'!J186","v":0},{"$f":"'Scénario-taux variés'!K186","v":0},{"$f":"'Scénario-taux variés'!L186","v":0},{"$f":"'Sommaire du rôle_sec_1'!$M$78","v":25925903},{"$f":"'Sommaire du rôle_sec_2'!$M$78","v":0},{"$f":"'Sommaire du rôle_sec_3'!$M$78","v":0},{"$f":"'Sommaire du rôle_sec_4'!$M$78","v":0},{"$f":"'Sommaire du rôle_sec_5'!$M$78","v":0}]
["TSCNR 8","SNR 8",{"$f":"'Scénario-taux variés'!H187","v":112404699.09999999},{"$f":"'Scénario-taux variés'!I187","v":0},{"$f":"'Scénario-taux variés'!J187","v":0},{"$f":"'Scénario-taux variés'!K187","v":0},{"$f":"'Scénario-taux variés'!L187","v":0},{"$f":"'Sommaire du rôle_sec_1'!$N$78","v":25925903},{"$f":"'Sommaire du rôle_sec_2'!$N$78","v":0},{"$f":"'Sommaire du rôle_sec_3'!$N$78","v":0},{"$f":"'Sommaire du rôle_sec_4'!$N$78","v":0},{"$f":"'Sommaire du rôle_sec_5'!$N$78","v":0}]
["TSCNR 9","SNR 9",{"$f":"'Scénario-taux variés'!H188","v":112404699.09999999},{"$f":"'Scénario-taux variés'!I188","v":0},{"$f":"'Scénario-taux variés'!J188","v":0},{"$f":"'Scénario-taux variés'!K188","v":0},{"$f":"'Scénario-taux variés'!L188","v":0},{"$f":"'Sommaire du rôle_sec_1'!$O$78","v":25925903},{"$f":"'Sommaire du rôle_sec_2'!$O$78","v":0},{"$f":"'Sommaire du rôle_sec_3'!$O$78","v":0},{"$f":"'Sommaire du rôle_sec_4'!$O$78","v":0},{"$f":"'Sommaire du rôle_sec_5'!$O$78","v":0}]
["TSCNR 10","SNR 10",{"$f":"'Scénario-taux variés'!H189","v":112404699.09999999},{"$f":"'Scénario-taux variés'!I189","v":0},{"$f":"'Scénario-taux variés'!J189","v":0},{"$f":"'Scénario-taux variés'!K189","v":0},{"$f":"'Scénario-taux variés'!L189","v":0},{"$f":"'Sommaire du rôle_sec_1'!$P$78","v":25925903},{"$f":"'Sommaire du rôle_sec_2'!$P$78","v":0},{"$f":"'Sommaire du rôle_sec_3'!$P$78","v":0},{"$f":"'Sommaire du rôle_sec_4'!$P$78","v":0},{"$f":"'Sommaire du rôle_sec_5'!$P$78","v":0}]
["TIND",null,{"$f":"'Scénario-taux variés'!H190","v":239376640},{"$f":"'Scénario-taux variés'!I190","v":239376640},{"$f":"'Scénario-taux variés'!J190","v":239376640},{"$f":"'Scénario-taux variés'!K190","v":239376640},{"$f":"'Scénario-taux variés'!L190","v":239376640},{"$f":"'Sommaire du rôle_sec_1'!$H$72","v":2325200},{"$f":"'Sommaire du rôle_sec_2'!$H$72","v":2325200},{"$f":"'Sommaire du rôle_sec_3'!$H$72","v":2325200},{"$f":"'Sommaire du rôle_sec_4'!$H$72","v":2325200},{"$f":"'Sommaire du rôle_sec_5'!$H$72","v":2325200}]
["TTVD",null,{"$f":"'Scénario-taux variés'!H191","v":76716400},{"$f":"'Scénario-taux variés'!I191","v":76716400},{"$f":"'Scénario-taux variés'!J191","v":76716400},{"$f":"'Scénario-taux variés'!K191","v":76716400},{"$f":"'Scénario-taux variés'!L191","v":76716400},{"$f":"'Sommaire du rôle_sec_1'!$N$23","v":58400},{"$f":"'Sommaire du rôle_sec_2'!$N$23","v":58400},{"$f":"'Sommaire du rôle_sec_3'!$N$23","v":58400},{"$f":"'Sommaire du rôle_sec_4'!$N$23","v":58400},{"$f":"'Sommaire du rôle_sec_5'!$N$23","v":58400}]
["TFOREST",null,{"$f":"'Scénario-taux variés'!H192","v":50000000},{"$f":"'Scénario-taux variés'!I192","v":0},{"$f":"'Scénario-taux variés'!J192","v":0},{"$f":"'Scénario-taux variés'!K192","v":0},{"$f":"'Scénario-taux variés'!L192","v":0}]
["TAGRI",null,{"$f":"'Scénario-taux variés'!H193","v":270604300},{"$f":"'Scénario-taux variés'!I193","v":0},{"$f":"'Scénario-taux variés'!J193","v":0},{"$f":"'Scénario-taux variés'!K193","v":0},{"$f":"'Scénario-taux variés'!L193","v":0}]
["(TTVD − TBU)",null,{"$f":"'Scénario-taux variés'!H194","v":5228300},{"$f":"'Scénario-taux variés'!I194","v":5228300},{"$f":"'Scénario-taux variés'!J194","v":5228300},{"$f":"'Scénario-taux variés'!K194","v":5228300},{"$f":"'Scénario-taux variés'!L194","v":5228300},{"$f":"'Sommaire du rôle_sec_1'!$N$22","v":0},{"$f":"'Sommaire du rôle_sec_2'!$N$22","v":0},{"$f":"'Sommaire du rôle_sec_2'!$N$22","v":0},{"$f":"'Sommaire du rôle_sec_2'!$N$22","v":0},{"$f":"'Sommaire du rôle_sec_2'!$N$22","v":0}]
[]
[]
[]
[null,null,"Recettes avec assiette imposable",null,null,null,null,"Recettes avec assiette compensable"]
[null,null,"Secteur 1","Secteur 2","Secteur 3","Secteur 4","Secteur 5","Secteur 1","Secteur 2","Secteur 3","Secteur 4","Secteur 5"]
["TB",null,{"$f":"C7/100*C38","v":4952182.450821735},35803559.336092934,65586099.684734792,48383188.292017482,65263545.096121348,{"$f":"C7/100*H38","v":36597.629102435814},{"$f":"D7/100*I38","v":268114.23080444481},{"$f":"E7/100*J38","v":491140.1825546886},{"$f":"F7/100*K38","v":362316.52811411466},{"$f":"G7/100*L38","v":488724.73903392791}]
["TSCR 1",{"$f":"B39","v":"SR1"},4880691.5651419908,0,0,0,0,36597.629102435814,0,0,0,0]
["TSCR 2","SR2",6505961.8563342746,0,0,0,0,48784.639593546948,0,0,0,0]
["TSCR 3","SR3",6505961.8563342746,0,0,0,0,48784.639593546948,0,0,0,0]
["TSCR 4","SR4",6505961.8563342746,0,0,0,0,48784.639593546948,0,0,0,0]
["TSCR 5","SR5",6505961.8563342746,0,0,0,0,48784.639593546948,0,0,0,0]
["TSCR 6","SR6",6505961.8563342746,0,0,0,0,48784.639593546948,0,0,0,0]
["TSCR 7","SR7",6505961.8563342746,0,0,0,0,48784.639593546948,0,0,0,0]
["TSCR 8","SR8",6505961.8563342746,0,0,0,0,48784.639593546948,0,0,0,0]
["TSCR 9","SR9",6505961.8563342746,0,0,0,0,48784.639593546948,0,0,0,0]
["TSCR 10","SR10",{"$f":"C17/100*C48","v":6505961.8563342746},0,0,0,0,48784.639593546948,0,0,0,0]
["TINR ou Taux sous-catégorie de référence",null,3705921.0558234737,31915201.774842102,23936401.331131574,19947001.10927631,35904601.996697366,797864.4735405409,7313757.6741216248,5485318.2555912184,4571098.5463260151,8227977.383386828]
["TSCNR 1",{"$f":"B50","v":"SNR 1"},3459232.1073987046,0,0,0,0,797864.4735405409,0,0,0,0]
["TSCNR 2","SNR 2",3459232.1073987046,0,0,0,0,797864.4735405409,0,0,0,0]
["TSCNR 3","SNR 3",3459232.1073987046,0,0,0,0,797864.4735405409,0,0,0,0]
["TSCNR 4","SNR 4",3459232.1073987046,0,0,0,0,797864.4735405409,0,0,0,0]
["TSCNR 5","SNR 5",3459232.1073987046,0,0,0,0,797864.4735405409,0,0,0,0]
["TSCNR 6","SNR 6",3459232.1073987046,0,0,0,0,797864.4735405409,0,0,0,0]
["TSCNR 7","SNR 7",3459232.1073987046,0,0,0,0,797864.4735405409,0,0,0,0]
["TSCNR 8","SNR 8",3459232.1073987046,0,0,0,0,797864.4735405409,0,0,0,0]
["TSCNR 9","SNR 9",{"$f":"C27/100*C58","v":3459232.1073987046},0,0,0,0,797864.4735405409,0,0,0,0]
["TSCNR 10","SNR 10",3459232.1073987046,0,0,0,0,797864.4735405409,0,0,0,0]
["TIND",null,7673716.8378275139,6138973.4702620124,4604230.1026965091,3836858.418913757,7673716.8378275139,74539.129596424013,59631.303677139214,44723.477757854416,37269.564798212006,74539.129596424013]
["TTVD",null,1967443.207215243,983721.60360762151,983721.60360762151,1475582.4054114323,1967443.207215243,1497.7069218755075,748.85346093775377,748.85346093775377,1123.2801914066308,1497.7069218755075]
["TFOREST",null,320570.83088088775,0,0,0,0]
["TAGRI",null,1734956.9058188202,0,0,0,0]
["(TTVD − TBu)",null,100562.42850567272,33520.809501890908,33520.809501890908,67041.619003781816,100562.42850567272,{"$f":"C33/100*H64","v":0},{"$f":"D33/100*I64","v":0},{"$f":"E33/100*J64","v":0},{"$f":"F33/100*K64","v":0},{"$f":"G33/100*L64","v":0}]
["Total des secteurs",null,{"$f":"SUM(C70:C96)","v":118482023.06303085},{"$f":"SUM(D70:D96)","v":74874976.994306549},95143973.531672388,73709671.844622761,110909869.56636715,{"$f":"SUM(H70:H96)","v":9364803.0600110423},{"$f":"SUM(I70:I96)","v":7642252.0620641466},{"$f":"SUM(J70:J96)","v":6021930.7693646988},{"$f":"SUM(K70:K96)","v":4971807.9194297483},{"$f":"SUM(L70:L96)","v":8792738.958939055}]
["Part des secteurs",null,{"$f":"C97/$C$99","v":0.25042672914538688},{"$f":"D97/$C$99","v":0.15825772635182941},0.20109881206836372,0.15579470665021325,0.23442202578420687,{"$f":"H97/$H$99","v":0.25452307389453577},{"$f":"I97/$H$99","v":0.2077063953025754},0.16366818611954695,0.13512722332304594,0.23897512136029583]
["Total selon l'assiette",null,{"$f":"SUM(C97:G97)","v":473120514.99999964},null,null,null,null,{"$f":"SUM(H97:L97)","v":36793532.769808695}]
["Grand total",null,{"$f":"C99+H99","v":509914047.76980835}]
[]
[null,null,{"$f":"(C97+H97)/$C$100","v":0.25072230640085458},{"$f":"(D97+I97)/$C$100","v":0.16182576145386296},0.19839795499555768,0.15430341664086075,0.23475056050886409]