{"text_format":"3","workbook":"xlsx","n_sheets":4,"sheets":["Financement PFI","RB PFI 2025-2026","macros","Annexe III"],"not_rendered":{"macros":1,"external_links":4,"defined_names":13},"read":"whole","date_system":"1900"}

{"sheet":"Financement PFI","index":0,"n_rows":40,"n_cols":12,"rows_kept":40,"merged":[[0,1,0,11],[1,1,1,11],[3,1,3,11],[5,1,5,7],[13,3,13,4],[15,3,15,4],[17,3,17,6],[20,1,20,3],[21,1,21,3]]}
[null,"Dans le cadre du Programme de financement des infrastructures (PFI), le calcul des enveloppes de financement doit être réalisé selon les paramètres définis dans les règles budgétaires en vigueur. Ce calcul nécessite une compréhension rigoureuse des barèmes établis, des limites de financement admissibles et des particularités de chaque projet."]
[null,"Le présent outil a été conçu pour faciliter ce calcul . Vous devez remplir les cases bleues selon votre situation. Certaines cases contiennent des listes déroulantes.\nToutes les informations et le détail du calcul se trouvent dans les règles budgétaires du PFI.\n\nNote:\nSi la salle multifonctionnelle est admissible au financement, l'outil prend pour hypothèse que celui-ci correspond au maximum autorisé. Ainsi, si la superficie de la salle est inférieure à celles indiquées dans les règles administratives, sans être en deçà de 27,9 m2,  le financement sera ajusté.\n"]
[]
[]
[]
[null,"Hypothèses",{"$nulls":8},"Financement selon le PFI","Montants"]
[null,"Nombre de places","0-17 mois","18 mois et plus","Total",{"$nulls":5},"Enveloppe achat-construction"]
[null,"Places avant",null,null,{"$f":"C8+D8","v":{"v":0,"d":"0 places"}},{"$nulls":5},"Ajustement pour les installations de 18 places ou moins (agrand,réam)",{"$f":"IFERROR(_xlfn.XLOOKUP(B4,macros!AK13:AK30,macros!AN13:AN30),0)","v":0}]
[null,"Nouvelles places",null,null,{"$f":"C9+D9","v":{"v":0,"d":"0 places"}},"",{"$nulls":4},"Montant de l'annexe 2",{"$f":"IF(E10=0,0,_xlfn.XLOOKUP(B4,macros!AA4:AA23,macros!AD4:AD23))","v":0}]
[null,"Places après",{"$f":"C8+C9","v":{"v":0,"d":"0 places"}},{"$f":"D8+D9","v":{"v":0,"d":"0 places"}},{"$f":"C10+D10","v":{"v":0,"d":"0 places"}},{"$nulls":5},"Nombre de places 17 mois ou moins (poupons)",{"$f":"IFERROR(_xlfn.XLOOKUP(B4,macros!AF6:AF23,macros!AI6:AI23),0)","v":0}]
[{"$nulls":10},"Sous-total ",{"$f":"L9+L10+L8","v":0}]
[null,"Salle multifonctionnelle",{"$nulls":8},"Salle multifonctionnelle selon l’annexe 3",{"$f":"IF(C12=\"oui\",VLOOKUP($B$4,macros!$G$4:$J$23,4,FALSE),0)","v":0}]
[{"$nulls":10},"Total avant indice régional de modulation ",{"$f":"L11+L12","v":0}]
[null,"Bail en emphytéose",null,"Si oui, durée restante",{"$nulls":6},"Indice régional de modulation ",{"$f":"IFERROR(VLOOKUP($C$18,'RB PFI 2025-2026'!$L$8:$N$36,3),0)","v":0}]
[{"$nulls":10},"Sous-total ",{"$f":"L13*L14","v":0}]
{"$rows_left_out":26}
{"sheet":"RB PFI 2025-2026","index":1,"n_rows":317,"n_cols":37,"rows_kept":317,"hidden":true,"merged":[[4,2,4,3],[4,8,4,9],[4,11,4,13],[4,25,5,28],[109,21,109,22]]}
["Règles Budgétaires PFI 2025-2026"]
["Dernière MAJ 2025-03-20",{"$nulls":33}," "]
[null,null,"Enveloppe Achat-Construction",{"$nulls":13},"Possibilité de retirer cette section ultérieurement",null,null,"Enveloppe Mobilier-Équipement",{"$nulls":5},"Enveloppe Aménagement Extérieur",{"$nulls":4},"Enveloppe Honoraire professionnels - Élément 1",null,null,"Enveloppe Jeux Extérieurs"]
[]
[null,null," Annexe 2",null,null,"Poupons",{"v":9745,"d":"9,745 $"},null,"Annexe 3",null,null,"Annexe 4",{"$nulls":3},"Facteur selon la durée du bail",{"$nulls":4},"Élément 1","Élément 2","Élément 3",null,null,"% de l'enveloppe Achat-Construction ajusté selon l'indice régional de modulation",{"$nulls":7},"Nouvelles places ou victimes sinistres",{"v":872,"d":"872 $"}]
[{"$nulls":15},"5 ans ou plus avant fin de bail + option renouv. 5 ans",null,{"v":0.2,"d":"20%"},null,"Pour A) Nouvelles places ou sinistres",{"$nulls":13},"Changement d'emplacement - montant lié aux nbr. places avant",{"v":219,"d":"219 $"}]
[null,null,"Nombre de places subventionnée(s)","Montant maximal Achat-Construction",{"$nulls":4},"Nombre de places subventionnée(s)","Montant maximal pour une salle multifonctionnelle",null,"#","Région administrative","Indice",null,"Durée du bail 10 ans ou plus",null,{"v":0.25,"d":"25%"},null,"Nombre de places subventionnée(s)","Montant de base","Ajout 1088$, si enfants <= 59 mois","Ajout 1088$, si enfants <= 17 mois",null,null,{"v":0.07,"d":"7%"},{"$nulls":4},"Coût du projet","Élément 1",null,"Changement d'emplacement - montant lié aux nouv. places",{"v":872,"d":"872 $"}]
[null,null,1,{"v":791882,"d":"791,882 $"},{"$nulls":4},1,{"v":113053,"d":"113,053 $"},null,1,"Bas-Saint-Laurent",1.08,{"$nulls":5},1,{"v":32709,"d":"32,709.00 "},{"v":1088,"d":"1,088 $"},{"v":1088,"d":"1,088 $"},{"$nulls":7},"Moins de 626 000 $","9,00 % du coût estimé du projet"]
[null,null,2,{"v":791882,"d":"791,882 $"},{"$nulls":4},2,{"v":113053,"d":"113,053 $"},null,2,"Saguenay-Lac-St-Jean",1.05,{"$nulls":5},2,{"v":32709,"d":"32,709.00 "},{"$f":"T9*V$8","v":{"v":2176,"d":"2,176 $"}},{"$f":"T9*W$8","v":{"v":2176,"d":"2,176 $"}},{"$nulls":7},"Entre 626 000 $ et 1 252 000 $","56 340 $ plus 7,20 % de l’excédent de 626 000 $",{"$nulls":4}," "]
[null,null,3,{"v":791882,"d":"791,882 $"},{"$nulls":4},3,{"v":113053,"d":"113,053 $"},null,3,"Capitale-Nationale",1.02,{"$nulls":5},3,{"v":32709,"d":"32,709.00 "},{"$f":"T10*V$8","v":{"v":3264,"d":"3,264 $"}},{"$f":"T10*W$8","v":{"v":3264,"d":"3,264 $"}},{"$nulls":3}," ",{"$nulls":3},"Entre 1 252 000 $ et 2 608 000 $","101 412 $ plus 6,30 % de l’excédent de 1 252 000 $"]
[null,null,4,{"v":791882,"d":"791,882 $"},{"$nulls":4},4,{"v":113053,"d":"113,053 $"},null,4,"Mauricie",{"$nulls":6},4,{"v":32709,"d":"32,709.00 "},{"v":4352,"d":"4,352 $"},{"v":4352,"d":"4,352 $"},{"$nulls":7},"Plus de  2 608 000 $","186 840 $ plus 5,76 % de l’excédent de 2 608 000 $"]
[null,null,5,{"v":791882,"d":"791,882 $"},{"$nulls":4},5,{"v":113053,"d":"113,053 $"},null,4.1,"Mauricie (sauf la région de la Tuque)",{"v":1,"d":"1.00"},{"$nulls":5},5,{"v":32709,"d":"32,709.00 "},{"v":5440,"d":"5,440 $"},{"v":5440,"d":"5,440 $"}]
[null,null,6,{"v":791882,"d":"791,882 $"},{"$nulls":4},6,{"v":113053,"d":"113,053 $"},null,4.2,"Région de la Tuque",1.03,{"$nulls":5},6,{"v":32709,"d":"32,709.00 "},{"v":6528,"d":"6,528 $"},{"v":6528,"d":"6,528 $"}]
[null,null,7,{"v":791882,"d":"791,882 $"},null," ",null,null,7,{"v":113053,"d":"113,053 $"},null,5,"Estrie",{"v":1,"d":"1.00"},{"$nulls":5},7,{"v":32709,"d":"32,709.00 "},{"v":7616,"d":"7,616 $"},{"v":7616,"d":"7,616 $"},{"$nulls":7},"Enveloppe Honoraire professionnels - Élément 2"]
[null,null,8,{"v":791882,"d":"791,882 $"},{"$nulls":4},8,{"v":113053,"d":"113,053 $"},null,6,"Montréal",1.07,{"$nulls":5},8,{"v":32709,"d":"32,709.00 "},{"v":8704,"d":"8,704 $"},{"v":8704,"d":"8,704 $"}]
{"$rows_left_out":303}
{"sheet":"macros","index":2,"n_rows":117,"n_cols":40,"rows_kept":117,"hidden":true,"merged":[[1,0,1,2],[2,1,2,4],[2,6,2,9],[2,11,2,14],[2,16,2,19],[2,21,2,24],[2,26,2,29],[2,31,2,34],[10,36,10,39],[28,0,28,2],[29,1,29,4],[29,5,29,8],[29,9,29,12],[31,14,31,15],[51,0,51,2],[51,6,51,8],[52,1,52,4],[52,6,52,9],[74,9,74,12],[75,9,75,12],[76,1,76,3],[88,3,88,5],[88,6,88,8],[89,3,89,5],[89,6,89,8],[90,6,90,8],[97,0,97,1],[98,1,98,4]]}
[]
["Enveloppe Achat construction:"]
[null,"Financement travaux de rénovation (G77)",{"$nulls":4},"Salle multifonctionnelle ",{"$nulls":4},"Montant de base avant nouvelles places ",{"$nulls":4},"Contrat de location ",{"$nulls":4},"Bail emphytéotique ",{"$nulls":4},"Montant de base après nouvelles places ",{"$nulls":4},"Montant de base poupons",{"$nulls":4},"Minimum entre 19 places et le nombre de places après ajout des nouvelles places",null,null,{"$f":"IF('Financement PFI'!E9<=19,'Financement PFI'!E9,19)","v":0}]
[{"$nulls":3},1,null,null,"Nouv. Places","après","Avant",{"$nulls":4},1,null,null,{"$f":"VLOOKUP('Financement PFI'!$F$16,'Annexe III'!$H$6:$K$86,4)","v":{"v":0,"d":"0.0%"}},{"$f":"VLOOKUP('Financement PFI'!$F$16,'Annexe III'!$H$6:$K$86,2)","v":{"v":0,"d":"0.00%"}},{"$f":"VLOOKUP('Financement PFI'!$F$16,'Annexe III'!$H$6:$K$86,3)","v":{"v":0,"d":"0.0%"}},null,null,{"$f":"VLOOKUP('Financement PFI'!$F$14,'Annexe III'!$B$6:$F$86,2)","v":{"v":0,"d":"0.0%"}},{"$f":"VLOOKUP('Financement PFI'!$F$14,'Annexe III'!$B$6:$F$86,5)","v":{"v":0,"d":"0.0%"}},{"$f":"VLOOKUP('Financement PFI'!$F$14,'Annexe III'!$B$6:$F$86,3)","v":{"v":0,"d":"0.00%"}},null,null,{"$f":"VLOOKUP('Financement PFI'!$E$10,'RB PFI 2025-2026'!C8:D107,2)","v":{"$error":"#N/A"}},{"$f":"+'RB PFI 2025-2026'!D26","v":{"v":791882,"d":"$791,882.00"}},1,{"$nulls":4},1,null,null,"Moins"]
[{"$nulls":6},{"$f":"VLOOKUP('Financement PFI'!$E$9,'RB PFI 2025-2026'!$I$8:$J$107,2)","v":{"$error":"#N/A"}},{"$f":"VLOOKUP('Financement PFI'!$E$10,'RB PFI 2025-2026'!$I$8:$J$107,2)","v":{"$error":"#N/A"}},{"$f":"VLOOKUP('Financement PFI'!$E$8,'RB PFI 2025-2026'!$I$8:$J$107,2)","v":{"$error":"#N/A"}},{"$nulls":14},{"$f":"VLOOKUP('Financement PFI'!$F$14,'Annexe III'!$B$6:$F$86,4)","v":{"v":0,"d":"0.0%"}},{"$nulls":12},"Nombre de places avant l'ajout de nouvelles places",null,null,{"$f":"'Financement PFI'!E8","v":{"v":0,"d":"0 Places"}}]
[null,"5.1 Financement de la construction d'une installation"," ",2,{"v":1,"d":"100.0%"},null,"5.1 Financement de la construction d'une installation",null,2,{"$f":"$G$5","v":{"$error":"#N/A"}},null,"5.1 Financement de la construction d'une installation"," ",2,null,null,"5.1 Financement de la construction d'une installation",null,2,{"v":1,"d":"100.0%"},null,"5.1 Financement de la construction d'une installation",null,2,{"$f":"IF('Financement PFI'!$C$14=\"oui\",$V$4,1)","v":{"v":1,"d":"100.0%"}},null,"5.1 Financement de la construction d'une installation"," ",2,{"$f":"IF('Financement PFI'!$E$10<=19,791882,IF('Financement PFI'!$E$10>=20,macros!$AA$4:$AB$4))","v":{"v":791882,"d":"791,882.00 $"}},null,"5.1 Financement de la construction d'une installation"," ",2,{"$f":"'Financement PFI'!$C$9*'RB PFI 2025-2026'!$G$5","v":{"v":0,"d":"0.00 $"}},{"$nulls":4},{"$f":"AN3-AN5","v":{"v":0,"d":"0 Places"}}]
[null,"5.1 Financement de la construction d'une installation - Reloc. + nouvelles places",null,3,{"v":1,"d":"100.0%"},null,"5.1 Financement de la construction d'une installation - Reloc. + nouvelles places",null,3,{"$f":"$H$5","v":{"$error":"#N/A"}},null,"5.1 Financement de la construction d'une installation - Reloc. + nouvelles places",null,3,null,null,"5.1 Financement de la construction d'une installation - Reloc. + nouvelles places",null,3,{"v":1,"d":"100.0%"},null,"5.1 Financement de la construction d'une installation - Reloc. + nouvelles places",null,3,{"$f":"IF('Financement PFI'!$C$14=\"oui\",$V$4,1)","v":{"v":1,"d":"100.0%"}},null,"5.1 Financement de la construction d'une installation - Reloc. + nouvelles places",null,3,{"$f":"IF('Financement PFI'!$E$10<=19,791882,IF('Financement PFI'!$E$10>=20,macros!$AA$4:$AB$4))","v":{"v":791882,"d":"791,882.00 $"}},null,"5.1 Financement de la construction d'une installation - Reloc. + nouvelles places",null,3,{"$f":"'Financement PFI'!$C$10*'RB PFI 2025-2026'!$G$5","v":{"v":0,"d":"0.00 $"}},null,"Différence",null,null,{"$f":"IF($AN$6<0,0,$AN$6)","v":0}]
[null,"5.1 Financement de la construction d'une installation - Reloc. sans nouvelles places",null,4,{"v":1,"d":"100.0%"},null,"5.1 Financement de la construction d'une installation - Reloc. sans nouvelles places",null,4,{"$f":"$I$5","v":{"$error":"#N/A"}},null,"5.1 Financement de la construction d'une installation - Reloc. sans nouvelles places",null,4,null,null,"5.1 Financement de la construction d'une installation - Reloc. sans nouvelles places",null,4,{"v":1,"d":"100.0%"},null,"5.1 Financement de la construction d'une installation - Reloc. sans nouvelles places",null,4,{"$f":"IF('Financement PFI'!$C$14=\"oui\",$V$4,1)","v":{"v":1,"d":"100.0%"}},null,"5.1 Financement de la construction d'une installation - Reloc. sans nouvelles places",null,4,{"$f":"IF('Financement PFI'!$E$10<=19,791882,IF('Financement PFI'!$E$10>=20,macros!$AA$4:$AB$4))","v":{"v":791882,"d":"791,882.00 $"}},null,"5.1 Financement de la construction d'une installation - Reloc. sans nouvelles places",null,4,{"$f":"'Financement PFI'!$C$8*'RB PFI 2025-2026'!$G$5","v":{"v":0,"d":"0.00 $"}},null,"Montant d'ajustement",null,null,{"$f":"'RB PFI 2025-2026'!B116","v":{"v":26148,"d":"26,148.00 $"}}]
[null,"5.2 Financement de l'acquisition d'une installation ",null,5,{"v":1,"d":"100.0%"},null,"5.2 Financement de l'acquisition d'une installation ",null,5,{"$f":"$G$5","v":{"$error":"#N/A"}},null,"5.2 Financement de l'acquisition d'une installation ",null,5,null,null,"5.2 Financement de l'acquisition d'une installation ",null,5,{"v":1,"d":"100.0%"},null,"5.2 Financement de l'acquisition d'une installation ",null,5,{"$f":"IF('Financement PFI'!$C$14=\"oui\",$V$4,1)","v":{"v":1,"d":"100.0%"}},null,"5.2 Financement de l'acquisition d'une installation ",null,5,{"$f":"IF('Financement PFI'!$E$10<=19,791882,IF('Financement PFI'!$E$10>=20,macros!$AA$4:$AB$4))","v":{"v":791882,"d":"791,882.00 $"}},null,"5.2 Financement de l'acquisition d'une installation ",null,5,{"$f":"'Financement PFI'!$C$9*'RB PFI 2025-2026'!$G$5","v":{"v":0,"d":"0.00 $"}}]
[null,"5.2 Financement de l'acquisition  d'une installation - Reloc. + nouvelles places",null,6,{"v":1,"d":"100.0%"},null,"5.2 Financement de l'acquisition  d'une installation - Reloc. + nouvelles places",null,6,{"$f":"$H$5","v":{"$error":"#N/A"}},null,"5.2 Financement de l'acquisition  d'une installation - Reloc. + nouvelles places",null,6,null,null,"5.2 Financement de l'acquisition  d'une installation - Reloc. + nouvelles places",null,6,{"v":1,"d":"100.0%"},null,"5.2 Financement de l'acquisition  d'une installation - Reloc. + nouvelles places",null,6,{"$f":"IF('Financement PFI'!$C$14=\"oui\",$V$4,1)","v":{"v":1,"d":"100.0%"}},null,"5.2 Financement de l'acquisition  d'une installation - Reloc. + nouvelles places",null,6,{"$f":"IF('Financement PFI'!$E$10<=19,791882,IF('Financement PFI'!$E$10>=20,macros!$AA$4:$AB$4))","v":{"v":791882,"d":"791,882.00 $"}},null,"5.2 Financement de l'acquisition  d'une installation - Reloc. + nouvelles places",null,6,{"$f":"'Financement PFI'!$C$10*'RB PFI 2025-2026'!$G$5","v":{"v":0,"d":"0.00 $"}}]
[null,"5.2 Financement de l'acquisition  d'une installation - Reloc. sans nouvelles places",null,7,{"v":1,"d":"100.0%"},null,"5.2 Financement de l'acquisition  d'une installation - Reloc. sans nouvelles places",null,7,{"$f":"$I$5","v":{"$error":"#N/A"}},null,"5.2 Financement de l'acquisition  d'une installation - Reloc. sans nouvelles places",null,7,null,null,"5.2 Financement de l'acquisition  d'une installation - Reloc. sans nouvelles places",null,7,{"v":1,"d":"100.0%"},null,"5.2 Financement de l'acquisition  d'une installation - Reloc. sans nouvelles places",null,7,{"$f":"IF('Financement PFI'!$C$14=\"oui\",$V$4,1)","v":{"v":1,"d":"100.0%"}},null,"5.2 Financement de l'acquisition  d'une installation - Reloc. sans nouvelles places",null,7,{"$f":"IF('Financement PFI'!$E$10<=19,791882,IF('Financement PFI'!$E$10>=20,macros!$AA$4:$AB$4))","v":{"v":791882,"d":"791,882.00 $"}},null,"5.2 Financement de l'acquisition  d'une installation - Reloc. sans nouvelles places",null,7,{"$f":"'Financement PFI'!$C$8*'RB PFI 2025-2026'!$G$5","v":{"v":0,"d":"0.00 $"}},null,"Ajustement pour les installations de 18 places ou moins (agr. Réam.) (F73)"]
[null,"5.3 Financement des améliorations locatives ",null,8,{"v":1,"d":"100.0%"},null,"5.3 Financement des améliorations locatives ",null,8,{"$f":"$G$5","v":{"$error":"#N/A"}},null,"5.3 Financement des améliorations locatives ",null,8,null,null,"5.3 Financement des améliorations locatives ",null,8,{"$f":"IF('Financement PFI'!$C$16=\"oui\",$Q$4,FALSE)","v":false},null,"5.3 Financement des améliorations locatives ",null,8,{"v":1,"d":"100.0%"},null,"5.3 Financement des améliorations locatives ",null,8,{"$f":"IF('Financement PFI'!$E$10<=19,791882,IF('Financement PFI'!$E$10>=20,macros!$AA$4:$AB$4))","v":{"v":791882,"d":"791,882.00 $"}},null,"5.3 Financement des améliorations locatives ",null,8,{"$f":"'Financement PFI'!$C$9*'RB PFI 2025-2026'!$G$5","v":{"v":0,"d":"0.00 $"}},{"$nulls":3},1]
[null,"5.3 Financement des améliorations locatives - Reloc. + nouvelles places",null,9,{"v":1,"d":"100.0%"},null,"5.3 Financement des améliorations locatives - Reloc. + nouvelles places",null,9,{"$f":"$H$5","v":{"$error":"#N/A"}},null,"5.3 Financement des améliorations locatives - Reloc. + nouvelles places",null,9,null,null,"5.3 Financement des améliorations locatives - Reloc. + nouvelles places",null,9,{"$f":"IF('Financement PFI'!$C$16=\"oui\",$Q$4,FALSE)","v":false},null,"5.3 Financement des améliorations locatives - Reloc. + nouvelles places",null,9,{"v":1,"d":"100.0%"},null,"5.3 Financement des améliorations locatives - Reloc. + nouvelles places",null,9,{"$f":"IF('Financement PFI'!$E$10<=19,791882,IF('Financement PFI'!$E$10>=20,macros!$AA$4:$AB$4))","v":{"v":791882,"d":"791,882.00 $"}},null,"5.3 Financement des améliorations locatives - Reloc. + nouvelles places",null,9,{"$f":"'Financement PFI'!$C$10*'RB PFI 2025-2026'!$G$5","v":{"v":0,"d":"0.00 $"}},null,"5.1 Financement de la construction d'une installation"," ",2]
[null,"5.3 Financement des améliorations locatives - Reloc. sans nouvelles places",null,10,{"v":1,"d":"100.0%"},null,"5.3 Financement des améliorations locatives - Reloc. sans nouvelles places",null,10,{"$f":"$I$5","v":{"$error":"#N/A"}},null,"5.3 Financement des améliorations locatives - Reloc. sans nouvelles places",null,10,null,null,"5.3 Financement des améliorations locatives - Reloc. sans nouvelles places",null,10,{"$f":"IF('Financement PFI'!$C$16=\"oui\",$Q$4,FALSE)","v":false},null,"5.3 Financement des améliorations locatives - Reloc. sans nouvelles places",null,10,{"v":1,"d":"100.0%"},null,"5.3 Financement des améliorations locatives - Reloc. sans nouvelles places",null,10,{"$f":"IF('Financement PFI'!$E$10<=19,791882,IF('Financement PFI'!$E$10>=20,macros!$AA$4:$AB$4))","v":{"v":791882,"d":"791,882.00 $"}},null,"5.3 Financement des améliorations locatives - Reloc. sans nouvelles places",null,10,{"$f":"'Financement PFI'!$C$8*'RB PFI 2025-2026'!$G$5","v":{"v":0,"d":"0.00 $"}},null,"5.1 Financement de la construction d'une installation - Reloc. + nouvelles places",null,3]
[null,"5.4 Financement de l'agrandissement d'une installation - Propriétaire",null,11,{"v":1,"d":"100.0%"},null,"5.4 Financement de l'agrandissement d'une installation - Propriétaire",null,11,0,null,"5.4 Financement de l'agrandissement d'une installation - Propriétaire",null,11,{"$f":"VLOOKUP('Financement PFI'!$E$8,'RB PFI 2025-2026'!$C$8:$D$107,2)","v":{"$error":"#N/A"}},null,"5.4 Financement de l'agrandissement d'une installation - Propriétaire",null,11,{"v":1,"d":"100.0%"},null,"5.4 Financement de l'agrandissement d'une installation - Propriétaire",null,11,{"$f":"IF('Financement PFI'!$C$14=\"oui\",$W$4,1)","v":{"v":1,"d":"100.0%"}},null,"5.4 Financement de l'agrandissement d'une installation - Propriétaire",null,11,{"$f":"IF('Financement PFI'!$E$10<=19,791882,IF('Financement PFI'!$E$10>=20,macros!$AA$4:$AB$4))-O15","v":{"$error":"#N/A"}},null,"5.4 Financement de l'agrandissement d'une installation - Propriétaire",null,11,{"$f":"'Financement PFI'!$C$9*'RB PFI 2025-2026'!$G$5","v":{"v":0,"d":"0.00 $"}},null,"5.1 Financement de la construction d'une installation - Reloc. sans nouvelles places",null,4]
{"$rows_left_out":103}
{"sheet":"Annexe III","index":3,"n_rows":86,"n_cols":11,"rows_kept":86,"hidden":true,"merged":[[0,10,0,11],[3,1,3,5],[3,7,3,10]]}
[{"$nulls":10},"Document interne "]
["Annexe III"]
[]
[null,"Bail en emphytéose",{"$nulls":5},"Bail en location"]
[null,"Duré restante du bail","Facteur\nR 5.1","Facteur\nR 5.6","Facteur\nR 5.8","Facteur\nR 5.4",null,"Duré restante du bail","Facteur\nR 5.7","Facteur\nR 5.8","Facteur\nR 5.3 5.5"]
[null,0,{"v":0,"d":"0.0"},{"v":0,"d":"0.0"},{"v":0,"d":"0.0%"},{"v":0,"d":"0.0"},null,0,{"v":0,"d":"0.0%"},{"v":0,"d":"0.0%"},{"v":0,"d":"0.0%"}]
[null,1,{"v":0,"d":"0.0%"},{"v":0,"d":"0.0%"},{"v":0.08,"d":"8.0%"},{"v":0.2,"d":"20.0%"},null,1,{"v":0,"d":"0.0%"},{"v":0,"d":"0.0%"},{"v":0,"d":"0.0%"}]
[null,2,{"v":0,"d":"0.0%"},{"v":0,"d":"0.0%"},{"v":0.08,"d":"8.0%"},{"v":0.2,"d":"20.0%"},null,2,{"v":0,"d":"0.0%"},{"v":0,"d":"0.0%"},{"v":0,"d":"0.0%"}]
[null,3,{"v":0,"d":"0.0%"},{"v":0,"d":"0.0%"},{"v":0.08,"d":"8.0%"},{"v":0.2,"d":"20.0%"},null,3,{"v":0,"d":"0.0%"},{"v":0,"d":"0.0%"},{"v":0,"d":"0.0%"}]
[null,4,{"v":0,"d":"0.0%"},{"v":0,"d":"0.0%"},{"v":0.08,"d":"8.0%"},{"v":0.2,"d":"20.0%"},null,4,{"v":0,"d":"0.0%"},{"v":0,"d":"0.0%"},{"v":0,"d":"0.0%"}]
[null,5,{"v":0,"d":"0.0%"},{"v":0.05,"d":"5.0%"},{"v":0.08,"d":"8.0%"},{"v":0.2,"d":"20.0%"},null,5,{"v":0.05,"d":"5.0%"},{"v":0.08,"d":"8.0%"},{"v":0.2,"d":"20.0%"}]
[null,6,{"v":0,"d":"0.0%"},{"v":0.05,"d":"5.0%"},{"v":0.08,"d":"8.0%"},{"v":0.2,"d":"20.0%"},null,6,{"v":0.05,"d":"5.0%"},{"v":0.08,"d":"8.0%"},{"v":0.2,"d":"20.0%"}]
[null,7,{"v":0,"d":"0.0%"},{"v":0.05,"d":"5.0%"},{"v":0.08,"d":"8.0%"},{"v":0.2,"d":"20.0%"},null,7,{"v":0.05,"d":"5.0%"},{"v":0.08,"d":"8.0%"},{"v":0.2,"d":"20.0%"}]
[null,8,{"v":0,"d":"0.0%"},{"v":0.05,"d":"5.0%"},{"v":0.08,"d":"8.0%"},{"v":0.2,"d":"20.0%"},null,8,{"v":0.05,"d":"5.0%"},{"v":0.08,"d":"8.0%"},{"v":0.2,"d":"20.0%"}]
[null,9,{"v":0,"d":"0.0%"},{"v":0.05,"d":"5.0%"},{"v":0.08,"d":"8.0%"},{"v":0.2,"d":"20.0%"},null,9,{"v":0.05,"d":"5.0%"},{"v":0.08,"d":"8.0%"},{"v":0.2,"d":"20.0%"}]
{"$rows_left_out":71}