{"text_format":"1","workbook":"xlsx","n_sheets":3,"sheets":["Barème","Calcul-Subv-CPE","Divisions régionales"],"not_rendered":{"charts":0,"images":2,"macros":1,"external_links":0,"defined_names":3,"comments":0,"pivot_tables":0},"unopened":[],"bounds":{"document_bytes":16777216,"sheet_cells":100000,"rows_first":2000,"rows_last":500,"rows_between":2000,"halvings":0,"cell_chars":16384,"cell_head_chars":4096},"cells_cut":0,"cells_raw":0,"read":"whole","date_system":"1900"}

{"sheet":"Barème","index":0,"n_rows":205,"n_cols":6,"rows_kept":205,"cut":false,"hidden":true,"merged":[[1,1,1,3],[2,1,2,3],[45,1,45,3]]}
["Information et note pour les formules","L'information provieent du fichier des paramètres de financement"]
["Pour la formule d'index parfois c'est la colonne A qui est utilisé et parfois la colonne B, pour facilité les formule aurait tout mis dans la même colonne - Phase 2","ANNEXE À LA DEMANDE D'APPROBATION DES RÈGLES BUDGÉTAIRES\n BARÈMES"]
[null,"CENTRES DE LA PETITE ENFANCE"]
["Cette ligne sert au formule, les années ne doivent pas changé de lignes"," ","2023-2024","2024-2025"]
[null,"Services directs / jour d'occupation"," "," "]
["0-17 mois - CPE","0-17 mois",66.86,66.86]
["18-47 mois - CPE","18-47 mois",42.09,42.089999999999996]
["48-59 mois - CPE","48-59 mois",33.83,33.83]
[null,"Services auxiliaires / jour d'occupation",null," "]
[null,"Volet A",8.68,8.9899999999999984]
[null,"Volet B ",1.1200000000000001,1.1200000000000001]
[null,"Services administratifs / place annualisée ",null," "]
[null,"Services administratifs (moins 60 places)",2358.1999999999998,2387.0500000000002]
[null,"Services administratifs (61 places et plus)",2078.42,2122.0700000000002]
[null,"Coûts d'occupation des locaux / place annualisée",null," "]
[null,"Volet A",587.83000000000004,625.45000000000005]
[null,"Volet B (CPE locataire seulement) : dépense admissible 2021-2022 moins le montant du volet A plus indexation de 6,46 %. Ne peut dépasser le maximum établi pour la région. L'indexation de 2022-2023 était de 3,8 %.",null,"S.O"]
[null," ",null," "]
[null,"Contribution parentale de base",null," "]
[null,"1er avril au 31 décembre",8.85,9.1]
[null,"1er janvier au 31 mars ",9.1,9.35]
[null," ",null," "]
[null,"Allocations supplémentaires\n(par jour d'occupation à moins indication contraire)",null," "]
[null," ",null," "]
[null,"Exemption de la contribution de base ",null," "]
[null,"1er avril au 31 décembre",8.85,9.1]
[null,"1er janvier au 31 mars",9.1,9.35]
[null,"Intégration des enfants AISG",null," "]
["AISG - volet A (forfaitaire pour gestion du dossier et équipement)","Inscription AISG - Volet A - CPE",2200,2200]
["AISG - volet B (fonctionnement)","AISG ( récurrent) -  Volet B - CPE",50.77,51.08]
[null,"Allocation compensatoire liée au protocole CPE-CISSS/CIUSSS",null," "]
[null,"0-17 mois (protocole) - CPE",75.540000000000006,75.849999999999994]
[null,"18 mois et plus (protocole) - CPE",50.77,51.08]
[null,"Mesure transitoire enfants AISG âgés de 5 ans **",null," "]
[null,"1er avril au 31 août*",null," "]
[null,"1er janvier au 31 mars",null," "]
[null,"PCRS** / jour classe ",null," "]
[null,"1er avril au 31 août*",null," "]
[null,"1er janvier au 31 mars",null," "]
[null,"PCRS**/ jour pédagogique",null," "]
{"$rows_left_out":166}
{"sheet":"Calcul-Subv-CPE","index":1,"n_rows":268,"n_cols":59,"rows_kept":268,"cut":false,"hidden":false,"merged":[[205,2,205,4],[204,2,204,4],[138,2,138,4],[187,49,192,49],[28,6,28,7],[117,6,117,7],[28,10,28,11],[90,11,94,11],[28,18,28,19],[90,19,94,19],[28,26,28,27],[90,27,94,27],[28,34,28,35],[117,10,117,11],[28,14,28,15],[90,15,94,15],[1,2,1,8],[90,7,94,7],[81,4,82,4],[99,4,101,4],[69,2,69,4],[28,54,28,55],[117,54,117,55],[28,50,28,51],[117,50,117,51],[90,55,94,55],[90,51,94,51],[117,14,117,15],[117,18,117,19],[28,22,28,23],[90,23,94,23],[117,22,117,23],[117,26,117,27],[28,30,28,31],[90,31,94,31],[117,30,117,31],[90,35,94,35],[117,34,117,35],[28,38,28,39],[90,39,94,39],[117,38,117,39],[28,42,28,43],[90,43,94,43],[117,42,117,43],[28,46,28,47],[90,47,94,47],[117,46,117,47],[187,45,192,45],[187,41,192,41],[187,37,192,37],[187,33,192,33],[187,29,192,29],[144,2,144,4],[187,25,192,25],[187,21,192,21],[187,13,192,13],[187,9,192,9],[187,17,192,17]]}
["Masqué","non","non","non","non","non","oui","oui","non","non","oui","oui","non","non","oui","oui","non","non","oui","oui","non","non","oui","oui","non","non","oui","oui","non","non","oui","oui","non","non","oui","oui","non","non","oui","oui","non","non","oui","oui","non","non","oui","oui","non","non","oui","oui","non","non","oui","oui","non","non","non"]
["non",null,"Estimation d'une subvention de fonctionnement \npour un centre de la petite enfance (CPE)"]
["non"]
["non",null,"Cet outil sert à produire une estimation selon certaines hypothèses. Il ne reflète pas le montant réel de votre subvention de fonctionnement."]
["non"]
["non",null,"Par exemple, le calcul prend uniquement en compte les principaux paramètres sur un exercice financier complet de 12 mois."]
["non"]
["non",null,"Toutes les informations et le détail du calcul se trouvent dans les règles budgétaires des centres de la petite enfance (CPE)."]
["non",null,"La subvention sera octroyée sur la base des particularités de chaque service de garde."]
["non"]
["non",null,"Vous devez remplir les cases bleues selon votre situation."]
["non",null,"Il y a une colonne par installation, une colonne pour les calculs effectués par division et une dernière colonne pour le total."]
["non",null,"Pour vous aider, vous pouvez consulter la promesse de subvention déposée dans votre dossier en ligne."]
["non",null,"Par contre, vous devrez estimer vous-même les jours de présence annuels."]
["non",null,"Pour les nouveaux CPE n'ayant pas de promesse de subvention, vous pouvez indiquer vos prévisions à l'aide des explications et des règles budgétaires des CPE."]
["non"]
["non",null,"Veuillez sélectionner l'exercice financier",null,"2023-2024"]
["non"]
["non",null,"Veuillez indiquer le nombre d'installations",null,3]
["non"]
["non",null,"Identification des installations à chacune des colonnes",null,null,null,null,null,1,null,null,null,2,null,null,null,3,null,null,null,4,null,null,null,5,null,null,null,6,null,null,null,7,null,null,null,8,null,null,null,9,null,null,null,10,null,null,null,11,null,null,null,12,null,null,null,"Taux pour l'ensemble des installations",null,"Total de la division"]
["non",null,"Allocation de base"]
["oui",null,"Places annualisées de 0 à 17 mois"]
["oui"]
["oui",null,"Places annualisées de 18 à 47 mois NON REQUIS",null,null,null,"non nécessaire de distinguer 18-47 et 48 et plus",null,null,null,"non nécessaire de distinguer 18-47 et 48 et plus",null,null,null,"non nécessaire de distinguer 18-47 et 48 et plus",null,null,null,"non nécessaire de distinguer 18-47 et 48 et plus",null,null,null,"non nécessaire de distinguer 18-47 et 48 et plus",null,null,null,"non nécessaire de distinguer 18-47 et 48 et plus",null,null,null,"non nécessaire de distinguer 18-47 et 48 et plus",null,null,null,"non nécessaire de distinguer 18-47 et 48 et plus",null,null,null,"non nécessaire de distinguer 18-47 et 48 et plus",null,null,null,"non nécessaire de distinguer 18-47 et 48 et plus",null,null,null,"non nécessaire de distinguer 18-47 et 48 et plus",null,null,null,"non nécessaire de distinguer 18-47 et 48 et plus"]
["oui"]
["oui",null,"Places annualisées de 18 mois et plus",null,null,null,"car on y va avec le JO, objectif alléger le texte",null,null,null,"car on y va avec le JO, objectif alléger le texte",null,null,null,"car on y va avec le JO, objectif alléger le texte",null,null,null,"car on y va avec le JO, objectif alléger le texte",null,null,null,"car on y va avec le JO, objectif alléger le texte",null,null,null,"car on y va avec le JO, objectif alléger le texte",null,null,null,"car on y va avec le JO, objectif alléger le texte",null,null,null,"car on y va avec le JO, objectif alléger le texte",null,null,null,"car on y va avec le JO, objectif alléger le texte",null,null,null,"car on y va avec le JO, objectif alléger le texte",null,null,null,"car on y va avec le JO, objectif alléger le texte",null,null,null,"car on y va avec le JO, objectif alléger le texte"]
["non",null,"Nombre de places subventionnées annualisées",null,null,null,null,null,null,null,null,null,null,null,null,null,null,null,null,null,null,null,null,null,null,null,null,null,null,null,null,null,null,null,null,null,null,null,null,null,null,null,null,null,null,null,null,null,null,null,null,null,null,null,null,null,null,null,{"$f":"+IF(BE28<>0,+BE28,+I28+M28+Q28+U28+Y28+AC28+AG28+AK28+AO28+AS28+AW28+BA28)","v":0}]
["oui"]
["oui",null,"Nombre de jours d'ouverture considéré",null,null,null,null,null,{"$f":"INDEX(Barème!$C$5:$XFD$9234,_xlfn.XMATCH('Calcul-Subv-CPE'!$C30,Barème!$B$5:$B$9234),_xlfn.XMATCH('Calcul-Subv-CPE'!$E$17,Barème!$C$4:$XFD$4))","v":260},null,null,null,{"$f":"INDEX(Barème!$C$5:$XFD$9234,_xlfn.XMATCH('Calcul-Subv-CPE'!$C30,Barème!$B$5:$B$9234),_xlfn.XMATCH('Calcul-Subv-CPE'!$E$17,Barème!$C$4:$XFD$4))","v":260},null,null,null,{"$f":"INDEX(Barème!$C$5:$XFD$9234,_xlfn.XMATCH('Calcul-Subv-CPE'!$C30,Barème!$B$5:$B$9234),_xlfn.XMATCH('Calcul-Subv-CPE'!$E$17,Barème!$C$4:$XFD$4))","v":260},null,null,null,{"$f":"INDEX(Barème!$C$5:$XFD$9234,_xlfn.XMATCH('Calcul-Subv-CPE'!$C30,Barème!$B$5:$B$9234),_xlfn.XMATCH('Calcul-Subv-CPE'!$E$17,Barème!$C$4:$XFD$4))","v":260},null,null,null,{"$f":"INDEX(Barème!$C$5:$XFD$9234,_xlfn.XMATCH('Calcul-Subv-CPE'!$C30,Barème!$B$5:$B$9234),_xlfn.XMATCH('Calcul-Subv-CPE'!$E$17,Barème!$C$4:$XFD$4))","v":260},null,null,null,{"$f":"INDEX(Barème!$C$5:$XFD$9234,_xlfn.XMATCH('Calcul-Subv-CPE'!$C30,Barème!$B$5:$B$9234),_xlfn.XMATCH('Calcul-Subv-CPE'!$E$17,Barème!$C$4:$XFD$4))","v":260},null,null,null,{"$f":"INDEX(Barème!$C$5:$XFD$9234,_xlfn.XMATCH('Calcul-Subv-CPE'!$C30,Barème!$B$5:$B$9234),_xlfn.XMATCH('Calcul-Subv-CPE'!$E$17,Barème!$C$4:$XFD$4))","v":260},null,null,null,{"$f":"INDEX(Barème!$C$5:$XFD$9234,_xlfn.XMATCH('Calcul-Subv-CPE'!$C30,Barème!$B$5:$B$9234),_xlfn.XMATCH('Calcul-Subv-CPE'!$E$17,Barème!$C$4:$XFD$4))","v":260},null,null,null,{"$f":"INDEX(Barème!$C$5:$XFD$9234,_xlfn.XMATCH('Calcul-Subv-CPE'!$C30,Barème!$B$5:$B$9234),_xlfn.XMATCH('Calcul-Subv-CPE'!$E$17,Barème!$C$4:$XFD$4))","v":260},null,null,null,{"$f":"INDEX(Barème!$C$5:$XFD$9234,_xlfn.XMATCH('Calcul-Subv-CPE'!$C30,Barème!$B$5:$B$9234),_xlfn.XMATCH('Calcul-Subv-CPE'!$E$17,Barème!$C$4:$XFD$4))","v":260},null,null,null,{"$f":"INDEX(Barème!$C$5:$XFD$9234,_xlfn.XMATCH('Calcul-Subv-CPE'!$C30,Barème!$B$5:$B$9234),_xlfn.XMATCH('Calcul-Subv-CPE'!$E$17,Barème!$C$4:$XFD$4))","v":260},null,null,null,{"$f":"INDEX(Barème!$C$5:$XFD$9234,_xlfn.XMATCH('Calcul-Subv-CPE'!$C30,Barème!$B$5:$B$9234),_xlfn.XMATCH('Calcul-Subv-CPE'!$E$17,Barème!$C$4:$XFD$4))","v":260},null,null,null,{"$f":"INDEX(Barème!$C$5:$XFD$9234,_xlfn.XMATCH('Calcul-Subv-CPE'!$C30,Barème!$B$5:$B$9234),_xlfn.XMATCH('Calcul-Subv-CPE'!$E$17,Barème!$C$4:$XFD$4))","v":260},null,{"$f":"INDEX(Barème!$C$5:$XFD$9234,_xlfn.XMATCH('Calcul-Subv-CPE'!$C30,Barème!$B$5:$B$9234),_xlfn.XMATCH('Calcul-Subv-CPE'!$E$17,Barème!$C$4:$XFD$4))","v":260}]
["oui",null,"Pourcentage d'ouverture pendant l'année ",null,null,null,"Pour l'instant on met 100%",null,1,null,"Pour l'instant on met 100%",null,1,null,"Pour l'instant on met 100%",null,1,null,"Pour l'instant on met 100%",null,1,null,"Pour l'instant on met 100%",null,1,null,"Pour l'instant on met 100%",null,1,null,"Pour l'instant on met 100%",null,1,null,"Pour l'instant on met 100%",null,1,null,"Pour l'instant on met 100%",null,1,null,"Pour l'instant on met 100%",null,1,null,"Pour l'instant on met 100%",null,1,null,"Pour l'instant on met 100%",null,1,null,"Pour l'instant on met 100%",null,1,null,1]
["oui"]
["non"]
["non",null,"Jours d'occupation annuels 0 à 17 mois",null,"\"Jours d'occupation\" représente les",null,null,null,null,null,null,null,null,null,null,null,null,null,null,null,null,null,null,null,null,null,null,null,null,null,null,null,null,null,null,null,null,null,null,null,null,null,null,null,null,null,null,null,null,null,null,null,null,null,"Somme des installations",null,null,null,{"$f":"+IF(BE34<>0,+BE34,+I34+M34+Q34+U34+Y34+AC34+AG34+AK34+AO34+AS34+AW34+BA34)","v":0}]
["non"]
["non",null,"Jours d'occupation annuels 18 à 47 mois ",null,"jours associés aux ententes de ",null,null,null,null,null,null,null,null,null,null,null,null,null,null,null,null,null,null,null,null,null,null,null,null,null,null,null,null,null,null,null,null,null,null,null,null,null,null,null,null,null,null,null,null,null,null,null,null,null,"Somme des installations",null,null,null,{"$f":"+IF(BE36<>0,+BE36,+I36+M36+Q36+U36+Y36+AC36+AG36+AK36+AO36+AS36+AW36+BA36)","v":0}]
["non"]
["non",null,"Jours d'occupation annuels 48 mois et plus",null,"service conclues avec les parents",null,null,null,null,null,null,null,null,null,null,null,null,null,null,null,null,null,null,null,null,null,null,null,null,null,null,null,null,null,null,null,null,null,null,null,null,null,null,null,null,null,null,null,null,null,null,null,null,null,"Somme des installations",null,null,null,{"$f":"+IF(BE38<>0,+BE38,+I38+M38+Q38+U38+Y38+AC38+AG38+AK38+AO38+AS38+AW38+BA38)","v":0}]
["non",null,"Total des jours d'occupation annuels",null,null,null,null,null,{"$f":"I34+I36+I38","v":0},null,null,null,{"$f":"M34+M36+M38","v":0},null,null,null,{"$f":"Q34+Q36+Q38","v":0},null,null,null,{"$f":"U34+U36+U38","v":0},null,null,null,{"$f":"Y34+Y36+Y38","v":0},null,null,null,{"$f":"AC34+AC36+AC38","v":0},null,null,null,{"$f":"AG34+AG36+AG38","v":0},null,null,null,{"$f":"AK34+AK36+AK38","v":0},null,null,null,{"$f":"AO34+AO36+AO38","v":0},null,null,null,{"$f":"AS34+AS36+AS38","v":0},null,null,null,{"$f":"AW34+AW36+AW38","v":0},null,null,null,{"$f":"BA34+BA36+BA38","v":0},null,null,null,null,null,{"$f":"+IF(BE39<>0,+BE39,+I39+BA39)","v":0}]
["oui",null,null,null,null,null,"Pondération",null,null,null,"Pondération",null,null,null,"Pondération",null,null,null,"Pondération",null,null,null,"Pondération",null,null,null,"Pondération",null,null,null,"Pondération",null,null,null,"Pondération",null,null,null,"Pondération",null,null,null,"Pondération",null,null,null,"Pondération",null,null,null,"Pondération",null,null,null,"Pondération"]
{"$rows_left_out":229}
{"sheet":"Divisions régionales","index":2,"n_rows":2,"n_cols":1,"rows_kept":2,"cut":false,"hidden":false,"merged":[]}
[]
["Divisions régionales"]