{"text_format":"1","workbook":"xlsx","n_sheets":5,"sheets":["Accueil","Calcul de l'aide - AIPL","Versions du fichier","Menus","Log"],"not_rendered":{"charts":0,"images":4,"macros":1,"external_links":0,"defined_names":54,"comments":1,"pivot_tables":0},"unopened":[],"bounds":{"document_bytes":16777216,"sheet_cells":100000,"rows_first":2000,"rows_last":500,"rows_between":2000,"halvings":0,"cell_chars":16384,"cell_head_chars":4096},"cells_cut":0,"cells_raw":0,"read":"whole","date_system":"1900"}

{"sheet":"Accueil","index":0,"n_rows":22,"n_cols":4,"rows_kept":22,"cut":false,"hidden":false,"merged":[[14,3,14,13],[21,3,21,13],[17,3,18,13]]}
[]
[]
[]
[]
[]
[]
[]
[]
[]
[]
[]
[]
[]
[]
[null,null,null,"Programme d’investissement en aménagement forestier (PIAF) - Volet II\nForêt publique\nAnnexe au rapport et au calcul de l'aide à la récolte et au transport des volumes de feuillus durs\net de peuplier de trituration dans les aires d’intensification de la production ligneuse (AIPL)\n2023-2024"]
[]
[]
[null,null,null,"L'activation du contenu de ce fichier est requise afin d'assurer l'exécution des macro-commandes qui sont nécessaires\nà son bon fonctionnement."]
[]
[]
[]
[null,null,null,"https://support.office.com/fr-fr/article/activer-ou-d%C3%A9sactiver-les-macros-dans-les-fichiers-office-12b036fd-d140-4e74-b45e-16fed1a7e5c6"]

{"sheet":"Calcul de l'aide - AIPL","index":1,"n_rows":171,"n_cols":102,"rows_kept":171,"cut":false,"hidden":true,"merged":[[1,0,1,8],[19,0,19,5],[17,0,17,5],[2,0,2,6],[7,0,7,5],[11,4,11,5],[9,0,9,4],[8,6,8,8],[8,0,8,5],[10,0,10,5],[12,0,12,5],[13,0,13,8],[33,0,33,5],[14,0,14,5],[27,0,27,5],[28,0,28,5],[15,0,15,5],[16,0,16,8],[25,0,25,5],[23,0,23,5],[30,0,30,5],[18,0,18,5],[20,0,20,5],[22,0,22,5],[31,0,31,5],[21,0,21,5],[32,0,32,8],[26,0,26,8],[56,0,56,5],[56,6,56,8],[57,0,58,5],[57,6,58,8],[24,0,24,5],[35,0,35,5],[53,6,55,8],[48,0,48,5],[48,6,48,8],[38,0,38,8],[46,0,47,5],[46,6,47,8],[49,0,49,8],[50,0,50,8],[51,0,51,8],[53,0,55,5],[59,0,59,5],[59,6,59,8],[70,0,70,5],[70,6,70,8],[60,0,60,8],[61,0,61,8],[62,0,62,8],[63,0,63,8],[64,0,66,5],[64,6,66,8],[67,0,67,5],[67,6,67,8],[68,0,69,5],[68,6,69,8],[37,0,37,8],[39,0,39,8],[40,0,40,8],[41,0,41,8],[42,0,44,5],[42,6,44,8],[29,0,29,8],[52,0,52,8],[0,0,0,8],[5,0,5,5],[6,0,6,5],[3,0,3,5],[5,6,5,8],[6,6,6,8],[7,6,7,8],[3,6,3,8],[4,0,4,8],[36,0,36,5],[34,0,34,8],[2,7,2,8],[45,0,45,5],[45,6,45,8]]}
[]
["Programme d’investissement en aménagement forestier (PIAF) - Volet II\nForêt publique\nAnnexe au rapport et au calcul de l'aide à la récolte et au transport des volumes de feuillus durs\net de peuplier de trituration dans les aires d’intensification de la production ligneuse (AIPL)\n2023-2024\n\n"]
[" *** Veuillez saisir les informations dans les cellules blanches (Planification et BGAD) et jaunes (Ministère) ***",null,null,null,null,null,null,"Version 1 : 2023-07-05"]
["Contexte d'utilisation"]
["Identification"]
["Unité d'aménagement (UA)"]
["Secteur d'intervention"]
["Unité de compilation"]
["Numéro de la prescription"]
["Zone de tarification\nValeur requise pour déterminer l'admissibilité et établir le montant de l'aide",null,null,null,null,{"$f":"IFERROR(IF(ISNUMBER(VLOOKUP(I10,Menus!$A$190:$A$211,1,FALSE)),\"Question\",\"Non_admissible\"),\"Question\")","v":"Non_admissible"}]
["Traitement (code DICA)"]
["Traitement (code RATF)",null,null,null,{"$f":"IFERROR(VLOOKUP($I$11,Codes_DICA_INDIRECT,3,FALSE),\"RATF_Inscrire_une_valeur\")","v":"RATF_Inscrire_une_valeur"}]
["Inscrire les renseignements dans la colonne associée au contexte d'utilisation",null,null,null,null,null,"Planification","BGAD","Ministère"]
["Admissibilité"]
["Secteur identifié en tant que aire d'intensification de la production ligneuse (AIPL)\nau Registre officiel des AIPL disponible sur le site de Données Québec"]
["Est-ce que les bois de trituration ont été récoltés et transportés ?"]
["Intrants pour le calcul"]
["Volume total net (m³/ha)"]
["Volume net pour les feuillus durs (m³/ha)"]
["Volume net pour les peupliers (m³/ha) "]
["Volume net pour le SEPM (m³/ha)",null,null,null,null,null,{"$f":"IFERROR(IF($G$18-$G$19-$G$20<0,\"Valider G18\",IF(AND(ISBLANK($G$18),OR(ISBLANK($G$19)=FALSE,ISBLANK($G$20)=FALSE)),\"Valider G18\",$G$18-$G$19-$G$20)),0)","v":0},{"$f":"IFERROR(IF(OR(EXACT(UPPER($G$4),UPPER(Menus!$A$254)),EXACT(UPPER($G$4),UPPER(Menus!$A$255))),IF($H$18-$H$19-$H$20<0,\"Valider H18\",IF(AND(ISBLANK($H$18),OR(ISBLANK($H$19)=FALSE,ISBLANK($H$20)=FALSE)),\"Valider H18\",$H$18-$H$19-$H$20)),0),0)","v":0},{"$f":"IFERROR(IF(EXACT(UPPER($G$4),UPPER(Menus!$A$255)),IF($I$18-$I$19-$I$20<0,\"Valider I18\",IF(AND(ISBLANK($I$18),OR(ISBLANK($I$19)=FALSE,ISBLANK($I$20)=FALSE)),\"Valider I18\",$I$18-$I$19-$I$20)),0),0)","v":0}]
["Pourcentage de diminution du taux (%)\nLes réponses de la section « Récolte » sont utilisées pour établir le calcul",null,null,null,null,null,{"$f":"IFERROR(IF(EXACT(Menus!$C$238,Penalite_1),Menus!$D$238,IF(EXACT(Menus!$C$239,Penalite_2),Menus!$D$239,IF(EXACT(Menus!$C$240,Penalite_3),Menus!$D$240,0))),0)","v":0},{"$f":"IFERROR(IF(OR(EXACT(UPPER($G$4),UPPER(Menus!$A$254)),EXACT(UPPER($G$4),UPPER(Menus!$A$255))),IF(EXACT(Menus!$C$243,Penalite_1),Menus!$D$243,IF(EXACT(Menus!$C$244,Penalite_2),Menus!$D$244,IF(EXACT(Menus!$C$245,Penalite_3),Menus!$D$245,0))),0),0)","v":0},{"$f":"IFERROR(IF(EXACT(UPPER($G$4),UPPER(Menus!$A$255)),IF(EXACT(Menus!$C$248,Penalite_1),Menus!$D$248,IF(EXACT(Menus!$C$249,Penalite_2),Menus!$D$249,IF(EXACT(Menus!$C$250,Penalite_3),Menus!$D$250,0))),0),0)","v":0}]
["Proportion du volume PEU laissé en forêt selon la moyenne régionale",null,null,null,null,null,{"$f":"IFERROR(IF(EXACT(UPPER($G$28),UPPER(Menus!$A$3)),VLOOKUP('Calcul de l''aide - AIPL'!$I$10,Menus!$A$190:$B$212,2,FALSE),\"S/O\"),0)","v":"S/O"},{"$f":"IFERROR(IF(EXACT(UPPER($H$28),UPPER(Menus!$A$3)),VLOOKUP('Calcul de l''aide - AIPL'!$I$10,Menus!$A$190:$B$212,2,FALSE),\"S/O\"),0)","v":"S/O"},{"$f":"IFERROR(IF(EXACT(UPPER($I$28),UPPER(Menus!$A$3)),VLOOKUP('Calcul de l''aide - AIPL'!$I$10,Menus!$A$190:$B$212,2,FALSE),\"S/O\"),0)","v":"S/O"}]
["Taux d'aide ($/m³)",null,null,null,null,null,{"$f":"IFERROR(IF(SUM($G$19:$G$20)<=Menus!$B$230,0,IF(OR(ISBLANK($G$15),EXACT(UPPER($G$15),UPPER(Menus!$A$3))),0,IF(ISBLANK($G$28),0,IF(EXACT(VLOOKUP($I$10,Menus!$A$190:$C$212,2,FALSE),Menus!$B$190),0,Menus!$B$215+$G$19*Menus!$B$216+$G$20*Menus!$B$217)))),0)","v":0},{"$f":"IFERROR(IF(SUM($H$19:$H$20)<=Menus!$B$230,0,IF(OR(ISBLANK($H$15),EXACT(UPPER($H$15),UPPER(Menus!$A$3))),0,IF(ISBLANK($H$28),0,IF(EXACT(VLOOKUP($I$10,Menus!$A$190:$C$212,2,FALSE),Menus!$B$190),0,Menus!$B$215+$H$19*Menus!$B$216+$H$20*Menus!$B$217)))),0)","v":0},{"$f":"IFERROR(IF(SUM($I$19:$I$20)<=Menus!$B$230,0,IF(OR(ISBLANK($I$15),EXACT(UPPER($I$15),UPPER(Menus!$A$3))),0,IF(ISBLANK($I$28),0,IF(EXACT(VLOOKUP($I$10,Menus!$A$190:$C$212,2,FALSE),Menus!$B$190),0,Menus!$B$215+$I$19*Menus!$B$216+$I$20*Menus!$B$217)))),0)","v":0}]
["Taux d'aide ($/ha)",null,null,null,null,null,{"$f":"IF($G$24*($G$19+$G$20)>Menus!$B$229,Menus!$B$229,$G$24*($G$19+$G$20))","v":0},{"$f":"IF($H$24*($H$19+$H$20)>Menus!$B$229,Menus!$B$229,$H$24*($H$19+$H$20))","v":0},{"$f":"IF($I$24*($I$19+$I$20)>Menus!$B$229,Menus!$B$229,$I$24*($I$19+$I$20))","v":0}]
["Taux d'aide théorique ($/m³) \nL'aide finale $/ha est modulée en fonction de la zone de tarification et de la\nproportion du volume laissé en forêt",null,null,null,null,null,{"$f":"IFERROR(IF(ISBLANK($I$10),\"Valider I10\",IF(ISBLANK($G$15),\"Valider G15\",IF(ISBLANK($G$28),\"Valider G21\",IF(ISNUMBER($G$21),IF($G$22=0,$G$25,(1+$G$22)*$G$25),0)))),0)","v":"Valider I10"},{"$f":"IFERROR(IF(ISBLANK($I$10),\"Valider I10\",IF(ISBLANK($H$15),\"Valider H15\",IF(ISBLANK($H$28),\"Valider H21\",IF(OR(EXACT($G$4,Menus!$A$254),EXACT($G$4,Menus!$A$255)),IF(ISNUMBER($H$21),IF($H$22=0,$H$25,(1+$H$22)*$H$25),0),0)))),0)","v":"Valider I10"},{"$f":"IFERROR(IF(ISBLANK($I$10),\"Valider I10\",IF(ISBLANK($I$15),\"Valider I15\",IF(ISBLANK($I$28),\"Valider I21\",IF(EXACT($G$4,Menus!$A$255),IF(ISNUMBER($I$21),IF($I$22=0,$I$25,(1+$I$22)*$I$25),0),0)))),0)","v":"Valider I10"}]
["Récolte"]
["Est-ce que tout le volume des peupliers est récolté ?"]
["Est-ce que tout le volume de SEPM est récolté ?"]
["Mesurage"]
["Numéro du projet de mesurage 1\nLa saisie d'une valeur est optionnelle"]
["Numéro du projet de mesurage 2\nLa saisie d'une valeur est optionnelle"]
["Superficie"]
["Superficie (hectare)"]
["Résumé de l'aide à la récolte et au transport des volumes de feuillus durs et de peupliers de trituration\ndans les aires d’intensification de la production ligneuse (AIPL)"]
["Aide finale ($/ha) - taux à inscrire à l'état d'avancement et au RATF",null,null,null,null,null,{"$f":"IFERROR(IF(AND(ISNUMBER($G$21)=TRUE,$G$21>=0),IF(SUM($G$19:$G$20)>Seuil_MLNU,IF(ROUND(IF(AND(EXACT(UPPER($G$15),UPPER(Menus!$A$2)),ISBLANK($G$18)=FALSE,ISBLANK($G$19)=FALSE,ISBLANK($G$20)=FALSE,ISBLANK($G$28)=FALSE,ISBLANK($G$29)=FALSE,EXACT(UPPER($G$16),UPPER(Menus!$A$2))),(Menus!$B$215+(Menus!$B$216*$G$19)+(Menus!$B$217*$G$20))*(1+$G$22)*VLOOKUP($I$10,Tableau_AIPL,3,FALSE)*SUM($G$19:$G$20),0),2)>Menus!$B$229,Menus!$B$229,ROUND(IF(AND(ISNUMBER($G$21)=TRUE,$G$21>=0),IF(SUM($G$19:$G$20)>Seuil_MLNU,IF(AND(EXACT(UPPER($G$15),UPPER(Menus!$A$2)),ISBLANK($G$18)=FALSE,ISBLANK($G$19)=FALSE,ISBLANK($G$20)=FALSE,ISBLANK($G$28)=FALSE,ISBLANK($G$29)=FALSE,EXACT(UPPER($G$16),UPPER(Menus!$A$2))),(Menus!$B$215+(Menus!$B$216*$G$19)+(Menus!$B$217*$G$20))*(1+$G$22)*VLOOKUP($I$10,Tableau_AIPL,3,FALSE)*SUM($G$19:$G$20),0),0),0),2)),0),0),0)","v":0},{"$f":"IFERROR(IF(AND(ISNUMBER($H$21)=TRUE,$H$21>=0),IF(SUM($H$19:$H$20)>Seuil_MLNU,IF(ROUND(IF(OR(EXACT(UPPER($G$4),UPPER(Menus!$A$254)),EXACT(UPPER($G$4),UPPER(Menus!$A$255))),IF(AND(EXACT(UPPER($H$15),UPPER(Menus!$A$2)),ISBLANK($H$18)=FALSE,ISBLANK($H$19)=FALSE,ISBLANK($H$20)=FALSE,ISBLANK($H$28)=FALSE,ISBLANK($H$29)=FALSE,EXACT(UPPER($H$16),UPPER(Menus!$A$2))),(Menus!$B$215+(Menus!$B$216*$H$19)+(Menus!$B$217*$H$20))*(1+$H$22)*VLOOKUP($I$10,Tableau_AIPL,3,FALSE)*SUM($H$19:$H$20),0),0),2)>Menus!$B$229,Menus!$B$229,ROUND(IF(AND(ISNUMBER($H$21)=TRUE,$H$21>=0),IF(SUM($H$19:$H$20)>Seuil_MLNU,IF(OR(EXACT(UPPER($G$4),UPPER(Menus!$A$254)),EXACT(UPPER($G$4),UPPER(Menus!$A$255))),IF(AND(EXACT(UPPER($H$15),UPPER(Menus!$A$2)),ISBLANK($H$18)=FALSE,ISBLANK($H$19)=FALSE,ISBLANK($H$20)=FALSE,ISBLANK($H$28)=FALSE,ISBLANK($H$29)=FALSE,EXACT(UPPER($H$16),UPPER(Menus!$A$2))),(Menus!$B$215+(Menus!$B$216*$H$19)+(Menus!$B$217*$H$20))*(1+$H$22)*VLOOKUP($I$10,Tableau_AIPL,3,FALSE)*SUM($H$19:$H$20),0),0),0),0),2)),0),0),0)","v":0},{"$f":"IFERROR(IF(AND(ISNUMBER($I$21)=TRUE,$I$21>=0),IF(SUM($I$19:$I$20)>Seuil_MLNU,IF(ROUND(IF(EXACT(UPPER($G$4),UPPER(Menus!$A$255)),IF(AND(EXACT(UPPER($I$15),UPPER(Menus!$A$2)),ISBLANK($I$18)=FALSE,ISBLANK($I$19)=FALSE,ISBLANK($I$20)=FALSE,ISBLANK($I$28)=FALSE,ISBLANK($I$29)=FALSE,EXACT(UPPER($I$16),UPPER(Menus!$A$2))),(Menus!$B$215+(Menus!$B$216*$I$19)+(Menus!$B$217*$I$20))*(1+$I$22)*VLOOKUP($I$10,Tableau_AIPL,3,FALSE)*SUM($I$19:$I$20),0),0),2)>Menus!$B$229,Menus!$B$229,ROUND(IF(AND(ISNUMBER($I$21)=TRUE,$I$21>=0),IF(SUM($I$19:$I$20)>Seuil_MLNU,IF(EXACT(UPPER($G$4),UPPER(Menus!$A$255)),IF(AND(EXACT(UPPER($I$15),UPPER(Menus!$A$2)),ISBLANK($I$18)=FALSE,ISBLANK($I$19)=FALSE,ISBLANK($I$20)=FALSE,ISBLANK($I$28)=FALSE,ISBLANK($I$29)=FALSE,EXACT(UPPER($I$16),UPPER(Menus!$A$2))),(Menus!$B$215+(Menus!$B$216*$I$19)+(Menus!$B$217*$I$20))*(1+$I$22)*VLOOKUP($I$10,Tableau_AIPL,3,FALSE)*SUM($I$19:$I$20),0),0),0),0),2)),0),0),0)","v":0}]
["Aide finale ($)",null,null,null,null,null,{"$f":"IFERROR(ROUND($G$34*$G$36,2),0)","v":0},{"$f":"IFERROR(ROUND($H$34*$H$36,2),0)","v":0},{"$f":"IFERROR(ROUND($I$34*$I$36,2),0)","v":0}]
[]
["Section réservée à l'usage de la Planification"]
["Remarques"]
[]
["J'atteste que les renseignements fournis dans ce document afin de calculer l'aide supplémentaire sont complets et conformes à la vérité, au meilleur de mes connaissances."]
[]
[]
[]
["Nom et prénom de l'ingénieur forestier",null,null,null,null,null,"No de permis"]
[null,null,null,null,null,null,{"$f":"TODAY()","v":"2023-07-05"}]
[]
["Signature de l'ingénieur forestier",null,null,null,null,null,"Date (AAAA-MM-JJ)"]
["Section réservée à l'usage du BGAD"]
["Remarques"]
[]
["J'atteste que les renseignements fournis dans ce document afin de calculer l'aide supplémentaire sont complets et conformes à la vérité, au meilleur de mes connaissances."]
[]
[]
[]
["Nom et prénom de l'ingénieur forestier",null,null,null,null,null,"No de permis"]
[null,null,null,null,null,null,{"$f":"TODAY()","v":"2023-07-05"}]
[]
["Signature de l'ingénieur forestier",null,null,null,null,null,"Date (AAAA-MM-JJ)"]
["Section réservée à l'usage du Ministère"]
["Remarques"]
[]
["J'atteste que les renseignements fournis dans ce document afin de calculer l'aide supplémentaire sont complets et conformes à la vérité, au meilleur de mes connaissances."]
[]
[]
[]
["Nom et prénom de l'ingénieur forestier",null,null,null,null,null,"No de permis"]
[null,null,null,null,null,null,{"$f":"TODAY()","v":"2023-07-05"}]
[]
["Signature de l'ingénieur forestier",null,null,null,null,null,"Date (AAAA-MM-JJ)"]
[null,null,null,null,null,null,null,null,null,null,null,null,null,null,null,null,null,null,null,null,null,null,null,null,null,null,null,null,null,null,null,null,null,null,null,null,null,null,null,null,null,null,null,null,null,null,null,null,null,null,null,null,null,null,null,null,null,null,null,null,null,null,null,null,null,null,null,null,null,null,null,null,null,null,null,null,null,null,null,null,null,null,null,null,null,null,null,null,null,null,null,null,null,null,null,null,null,null,null,null,455,0]
[null,null,null,null,null,null,null,null,null,null,null,null,null,null,null,null,null,null,null,null,null,null,null,null,null,null,null,null,null,null,null,null,null,null,null,null,null,null,null,null,null,null,null,null,null,null,null,null,null,null,null,null,null,null,null,null,null,null,null,null,null,null,null,null,null,null,null,null,null,null,null,null,null,null,null,null,null,null,null,null,null,null,null,null,null,null,null,null,null,null,null,null,null,null,null,null,null,null,null,null,456,0]
[null,null,null,null,null,null,null,null,null,null,null,null,null,null,null,null,null,null,null,null,null,null,null,null,null,null,null,null,null,null,null,null,null,null,null,null,null,null,null,null,null,null,null,null,null,null,null,null,null,null,null,null,null,null,null,null,null,null,null,null,null,null,null,null,null,null,null,null,null,null,null,null,null,null,null,null,null,null,null,null,null,null,null,null,null,null,null,null,null,null,null,null,null,null,null,null,null,null,null,null,457,0]
[null,null,null,null,null,null,null,null,null,null,null,null,null,null,null,null,null,null,null,null,null,null,null,null,null,null,null,null,null,null,null,null,null,null,null,null,null,null,null,null,null,null,null,null,null,null,null,null,null,null,null,null,null,null,null,null,null,null,null,null,null,null,null,null,null,null,null,null,null,null,null,null,null,null,null,null,null,null,null,null,null,null,null,null,null,null,null,null,null,null,null,null,null,null,null,null,null,null,null,null,458,60]
[null,null,null,null,null,null,null,null,null,null,null,null,null,null,null,null,null,null,null,null,null,null,null,null,null,null,null,null,null,null,null,null,null,null,null,null,null,null,null,null,null,null,null,null,null,null,null,null,null,null,null,null,null,null,null,null,null,null,null,null,null,null,null,null,null,null,null,null,null,null,null,null,null,null,null,null,null,null,null,null,null,null,null,null,null,null,null,null,null,null,null,null,null,null,null,null,null,null,null,null,459,60]
[null,null,null,null,null,null,null,null,null,null,null,null,null,null,null,null,null,null,null,null,null,null,null,null,null,null,null,null,null,null,null,null,null,null,null,null,null,null,null,null,null,null,null,null,null,null,null,null,null,null,null,null,null,null,null,null,null,null,null,null,null,null,null,null,null,null,null,null,null,null,null,null,null,null,null,null,null,null,null,null,null,null,null,null,null,null,null,null,null,null,null,null,null,null,null,null,null,null,null,null,460,200]
[null,null,null,null,null,null,null,null,null,null,null,null,null,null,null,null,null,null,null,null,null,null,null,null,null,null,null,null,null,null,null,null,null,null,null,null,null,null,null,null,null,null,null,null,null,null,null,null,null,null,null,null,null,null,null,null,null,null,null,null,null,null,null,null,null,null,null,null,null,null,null,null,null,null,null,null,null,null,null,null,null,null,null,null,null,null,null,null,null,null,null,null,null,null,null,null,null,null,null,null,461,240]
[null,null,null,null,null,null,null,null,null,null,null,null,null,null,null,null,null,null,null,null,null,null,null,null,null,null,null,null,null,null,null,null,null,null,null,null,null,null,null,null,null,null,null,null,null,null,null,null,null,null,null,null,null,null,null,null,null,null,null,null,null,null,null,null,null,null,null,null,null,null,null,null,null,null,null,null,null,null,null,null,null,null,null,null,null,null,null,null,null,null,null,null,null,null,null,null,null,null,null,null,551,0]
[null,null,null,null,null,null,null,null,null,null,null,null,null,null,null,null,null,null,null,null,null,null,null,null,null,null,null,null,null,null,null,null,null,null,null,null,null,null,null,null,null,null,null,null,null,null,null,null,null,null,null,null,null,null,null,null,null,null,null,null,null,null,null,null,null,null,null,null,null,null,null,null,null,null,null,null,null,null,null,null,null,null,null,null,null,null,null,null,null,null,null,null,null,null,null,null,null,null,null,null,650,0]
{"$rows_left_out":92}
{"sheet":"Versions du fichier","index":2,"n_rows":10,"n_cols":33,"rows_kept":10,"cut":false,"hidden":true,"merged":[[0,0,0,16],[0,19,0,24]]}
["Programme d’investissement en aménagement forestier (PIAF) - Volet II\nForêt publique\nSuivi des versions du fichier de l'annexe au rapport et au calcul de l'aide à la récolte et au transport des volumes de feuillus durs\net de peuplier de trituration dans les aires d’intensification de la production ligneuse (AIPL) pour l’exercice 2023-2024",null,null,null,null,null,null,null,null,null,null,null,null,null,null,null,null,null,null,"Version 1 : 2023-07-05",null,null,null,null,null,null,null,null,null,null,null,null,{"$f":"TODAY()","v":"2023-07-05"}]
[]
["Version 1","Nom du fichier :","Calcul_aide_PIAF_Volet_II_AIPL_2023-2024_2023-03-22_Consultation"]
[{"$f":"A3","v":"Version 1"},"Date de mise en ligne :","2023-04-19 ou dans les jours suivants."]
[{"$f":"A4","v":"Version 1"},"Remarques :","• Version initiale proposée pour la période de consultation"]
[{"$f":"A5","v":"Version 1"}]
["Version 1","Nom du fichier :","Calcul_aide_PIAF_Volet_II_AIPL_2023-2024_2023-04-19_Consultation"]
["Version 1","Date de mise en ligne :","2023-07-05 ou dans les jours suivants."]
["Version 1","Remarques :","• Version officielle"]
[{"$f":"A9","v":"Version 1"}]

{"sheet":"Menus","index":3,"n_rows":256,"n_cols":5,"rows_kept":256,"cut":false,"hidden":true,"merged":[]}
["Question"]
["Oui"]
["Non"]
["Sans objet"]
["Non admissible"]
[]
["UA (R01 et R11 seulement)"]
["01171"]
["01272"]
["11161"]
["11262"]
["11263"]
[]
["Codes_Dica (fonction INDIRECT pour RATF)","Code_RATF","Indirect"]
["CPHRS-BOUQ","CPHRSBOUQ","RATF_CPHRSBOUQ"]
["CPHRS-ILOT","CPHRSILOT","RATF_CPHRSILOT"]
["CPHRS-SLEG","CPHRSSLEG","RATF_CPHRSSLEG"]
["CPHRS-TIGE","CPHRSTIGE","RATF_CPHRSTIGE"]
["CPPTM_DIS","CPPTMDIS","RATF_CPPTMDIS"]
["CPPTM_DIS-BOUQ","CPPTMBOUQ","RATF_CPPTMBOUQ"]
["CPPTM_DIS-ILOT","CPPTMILOT","RATF_CPPTMILOT"]
["CPPTM_U","CPPTMU","RATF_CPPTMU"]
["CPRS_BA","CPRSBA","RATF_CPRSBA"]
["CPRS_DA","CPRSDA","RATF_CPRSDA"]
["CPRS_PA","CPRSPA","RATF_CPRSPA"]
["CPRS_T","CPRST","RATF_CPRST"]
["CPRS_U-BOUQ","CPRSBOUQ","RATF_CPRSBOUQ"]
["CPRS_U-ILOT","CPRSILOT","RATF_CPRSILOT"]
["CPRS_U-SLEG","CPRSSLEG","RATF_CPRSSLEG"]
["CPRS_U-TIGE","CPRSTIGE","RATF_CPRSTIGE"]
["CRS-BOUQ","CRSBOUQ","RATF_CRSBOUQ"]
["CRS-ILOT","CRSILOT","RATF_CRSILOT"]
["CRS-SLEG","CRSSLEG","RATF_CRSSLEG"]
["CRS-TIGE","CRSTIGE","RATF_CRSTIGE"]
["CS-BOUQ","CSBOUQ","RATF_CSBOUQ"]
["CS-ILOT","CSILOT","RATF_CSILOT"]
["CS-SLEG","CSSLEG","RATF_CSSLEG"]
["CS-TIGE","CSTIGE","RATF_CSTIGE"]
["CTSP_BA","CTSPBA","RATF_CTSPBA"]
["CTSP_DA","CTSPDA","RATF_CTSPDA"]
["CTSP_PA","CTSPPA","RATF_CTSPPA"]
["CTSP_T","CTSPT","RATF_CTSPT"]
["CTSP_U-BOUQ","CTSPBOUQ","RATF_CTSPBOUQ"]
["CTSP_U-ILOT","CTSPILOT","RATF_CTSPILOT"]
["CTSP_U-SLEG","CTSPSLEG","RATF_CTSPSLEG"]
["CTSP_U-TIGE","CTSPTIGE","RATF_CTSPTIGE"]
["Inscrire une valeur",null,"RATF_Inscrire_une_valeur"]
[]
["Codes_RATF"]
["CPHRSBOUQ"]
["CPHRSILOT"]
["CPHRSSLEG"]
["CPHRSTIGE"]
["CPPTMDIS"]
["CPPTMBOUQ"]
["CPPTMILOT"]
["CPPTMU"]
["CPRSBA"]
["CPRSDA"]
["CPRSPA"]
["CPRST"]
["CPRSBOUQ"]
["CPRSILOT"]
["CPRSSLEG"]
["CPRSTIGE"]
["CRSBOUQ"]
["CRSILOT"]
["CRSSLEG"]
["CRSTIGE"]
["CSBOUQ"]
["CSILOT"]
["CSSLEG"]
["CSTIGE"]
["CTSPBA"]
["CTSPDA"]
["CTSPPA"]
["CTSPT"]
["CTSPBOUQ"]
["CTSPILOT"]
["CTSPSLEG"]
{"$rows_left_out":177}
{"sheet":"Log","index":4,"n_rows":11,"n_cols":4,"rows_kept":11,"cut":false,"hidden":true,"merged":[]}
["Utilisateur","Date","OS","Excel"]
["Pouliot, Simon (BMMB)","2022-04-27T10:38:26","Windows (64-bit) NT 10.00","16.0"]
["St-Pierre, Stéphane (BMMB)","2022-07-06T08:25:18","Windows (64-bit) NT 10.00","16.0"]
["St-Pierre, Stéphane (BMMB)","2022-07-08T10:47:52","Windows (64-bit) NT 10.00","16.0"]
["St-Pierre, Stéphane (BMMB)","2022-07-08T10:51:10","Windows (64-bit) NT 10.00","16.0"]
["St-Pierre, Stéphane (BMMB)","2022-10-04T10:06:55","Windows (64-bit) NT 10.00","16.0"]
["Gagné, Jean-Benoit (BMMB)","2023-03-22T14:43:06","Windows (64-bit) NT 10.00","16.0"]
["Gagné, Jean-Benoit (BMMB)","2023-04-19T15:10:50","Windows (64-bit) NT 10.00","16.0"]
["Gagné, Jean-Benoit (BMMB)","2023-06-13T11:47:46","Windows (64-bit) NT 10.00","16.0"]
["Gagné, Jean-Benoit (BMMB)","2023-07-05T13:37:50","Windows (64-bit) NT 10.00","16.0"]
["Gagné, Jean-Benoit (BMMB)","2023-07-05T15:04:12","Windows (64-bit) NT 10.00","16.0"]