{"text_format":"1","workbook":"xlsx","n_sheets":14,"sheets":["Comment remplir","Sommaire","BD","BGAD1","BGAD2","BGAD3","BGAD4","BGAD5","BGAD6","BGAD7","BGAD8","BGAD9","BGAD10","Liste"],"not_rendered":{"charts":0,"images":5,"macros":1,"external_links":0,"defined_names":23,"comments":0,"pivot_tables":1},"unopened":[],"bounds":{"document_bytes":16777216,"sheet_cells":100000,"rows_first":2000,"rows_last":500,"rows_between":2000,"halvings":0,"cell_chars":16384,"cell_head_chars":4096},"cells_cut":0,"cells_raw":0,"read":"whole","date_system":"1900"}

{"sheet":"Comment remplir","index":0,"n_rows":94,"n_cols":18,"rows_kept":94,"cut":false,"hidden":false,"merged":[[2,1,2,6],[8,1,8,10],[9,1,9,10],[10,1,10,10],[11,1,11,10],[3,1,3,10],[4,1,4,10],[5,1,5,10],[7,1,7,10]]}
[]
["Déclaration de vidange des secteurs récoltés par BGAd ou PRAU",null,null,null,null,null,null,null,"( un seul onglet par BGA)"]
[]
["1-","Choisir dans le menu déroulant"]
["2-","Choisir dans le menu déroulant"]
["3-","Inscrire manuellement"]
["4-","Nom du chantier enregistré à la PRANA inscrire manuellement ( obligatoire pour tous les chantiers ) "]
["5-","Choisir dans le menu déroulant ou manuelle*"]
["6-","Remplissage automatique à partir du no. Client Mesubois * manuelle si no client entré manuelle"]
["7-","Choisir dans le menu déroulant"]
["8-","Choisir dans le menu déroulant"]
["9-","Inscrire les volumes de tous les chantiers (si vidangés inscrire 0 m3)"]
["10-","Inscrire manuellement selon l'entente avec le MRNF coordonées gps ou le numéro séquentiel ( valider le format avec l'UG) "]
[]
[]
[]
[]
[]
[]
[]
{"$rows_left_out":75}
{"sheet":"Sommaire","index":1,"n_rows":13,"n_cols":16,"rows_kept":13,"cut":false,"hidden":false,"merged":[[0,0,0,6],[4,0,4,6],[8,4,8,5]]}
["Sommaire des déclarations de vidange des bois - Tous clients"]
[]
["Année de récolte :","2024-2025"]
["Unité d'aménagement :"]
["Je déclare avoir obtenu les déclarations de vidange signées par un ingénieur forestier pour tous les secteurs/chantiers récoltés de l’unité d’aménagement forestier, incluant les secteurs/chantiers avec des volumes résiduels et ceux completement vidangés."]
[null,null,null,null,null,null,null,null,null,null,null,null,null,null,null," MLNU SP seulement pour Client 999"]
["Nom du représentant des BGAs :"]
[]
["Signature :",null,null,"Date :"]
[]
["Somme de Volume estimé (m3)"]
["Numéro de secteur d'intervention \nou \nNom du chantier","No client mesubois","Nom du BGA/PRAU détenteur du droit","Code d'essence","Qualité (pour les droits SQ/QI)","Total"]
["Total général"]

{"sheet":"BD","index":2,"n_rows":1406,"n_cols":7,"rows_kept":1406,"cut":false,"hidden":true,"merged":[[1330,0,1330,6],[895,0,895,6],[1045,0,1045,6],[1195,0,1195,6]]}
["Numéro de secteur d'intervention \nou \nNom du chantier","No client mesubois","Nom du BGA/PRAU détenteur du droit","Code d'essence","Qualité (pour les droits SQ/QI)","Volume estimé (m3)","coordonéesGPS(WGS84)    no séquentiel shp"]
[null,null,{"$f":"IFERROR(VLOOKUP(B2,Liste!M:N,2,FALSE),\"\")","v":""}]
[null,null,{"$f":"IFERROR(VLOOKUP(B3,Liste!M:N,2,FALSE),\"\")","v":""}]
[null,null,{"$f":"IFERROR(VLOOKUP(B4,Liste!M:N,2,FALSE),\"\")","v":""}]
[null,null,{"$f":"IFERROR(VLOOKUP(B5,Liste!M:N,2,FALSE),\"\")","v":""}]
[null,null,{"$f":"IFERROR(VLOOKUP(B6,Liste!M:N,2,FALSE),\"\")","v":""}]
[null,null,{"$f":"IFERROR(VLOOKUP(B7,Liste!M:N,2,FALSE),\"\")","v":""}]
[null,null,{"$f":"IFERROR(VLOOKUP(B8,Liste!M:N,2,FALSE),\"\")","v":""}]
[null,null,{"$f":"IFERROR(VLOOKUP(B9,Liste!M:N,2,FALSE),\"\")","v":""}]
[null,null,{"$f":"IFERROR(VLOOKUP(B10,Liste!M:N,2,FALSE),\"\")","v":""}]
[null,null,{"$f":"IFERROR(VLOOKUP(B11,Liste!M:N,2,FALSE),\"\")","v":""}]
[null,null,{"$f":"IFERROR(VLOOKUP(B12,Liste!M:N,2,FALSE),\"\")","v":""}]
[null,null,{"$f":"IFERROR(VLOOKUP(B13,Liste!M:N,2,FALSE),\"\")","v":""}]
[null,null,{"$f":"IFERROR(VLOOKUP(B14,Liste!M:N,2,FALSE),\"\")","v":""}]
[null,null,{"$f":"IFERROR(VLOOKUP(B15,Liste!M:N,2,FALSE),\"\")","v":""}]
[null,null,{"$f":"IFERROR(VLOOKUP(B16,Liste!M:N,2,FALSE),\"\")","v":""}]
[null,null,{"$f":"IFERROR(VLOOKUP(B17,Liste!M:N,2,FALSE),\"\")","v":""}]
[null,null,{"$f":"IFERROR(VLOOKUP(B18,Liste!M:N,2,FALSE),\"\")","v":""}]
[null,null,{"$f":"IFERROR(VLOOKUP(B19,Liste!M:N,2,FALSE),\"\")","v":""}]
[null,null,{"$f":"IFERROR(VLOOKUP(B20,Liste!M:N,2,FALSE),\"\")","v":""}]
{"$rows_left_out":1387}
{"sheet":"BGAD1","index":3,"n_rows":72,"n_cols":7,"rows_kept":72,"cut":false,"hidden":false,"merged":[[67,0,67,6],[71,5,71,6],[0,0,0,5],[2,1,2,2],[3,1,3,2],[4,1,4,2],[5,0,5,4],[6,0,6,4]]}
["Déclaration de vidange des secteurs récoltés par BGAd ou PRAU"]
[]
["Année de récolte :"]
["Unité d'aménagement :"]
["Nom Du BGAd :"]
[]
["(insérer des lignes au besoin)"]
["Numéro de secteur d'intervention \nou \nNom du chantier","No client mesubois","Nom du BGA/PRAU détenteur du droit","Code d'essence","Qualité ","Volume estimé (m3)","coordonnéesGPS(WGS84)    no séquentiel shp"]
[null,null,{"$f":"IFERROR(VLOOKUP(B9,Liste!M:N,2,FALSE),\"\")","v":""}]
[null,null,{"$f":"IFERROR(VLOOKUP(B10,Liste!M:N,2,FALSE),\"\")","v":""}]
[null,null,{"$f":"IFERROR(VLOOKUP(B11,Liste!M:N,2,FALSE),\"\")","v":""}]
[null,null,{"$f":"IFERROR(VLOOKUP(B12,Liste!M:N,2,FALSE),\"\")","v":""}]
[null,null,{"$f":"IFERROR(VLOOKUP(B13,Liste!M:N,2,FALSE),\"\")","v":""}]
[null,null,{"$f":"IFERROR(VLOOKUP(B14,Liste!M:N,2,FALSE),\"\")","v":""}]
[null,null,{"$f":"IFERROR(VLOOKUP(B15,Liste!M:N,2,FALSE),\"\")","v":""}]
[null,null,{"$f":"IFERROR(VLOOKUP(B16,Liste!M:N,2,FALSE),\"\")","v":""}]
[null,null,{"$f":"IFERROR(VLOOKUP(B17,Liste!M:N,2,FALSE),\"\")","v":""}]
[null,null,{"$f":"IFERROR(VLOOKUP(B18,Liste!M:N,2,FALSE),\"\")","v":""}]
[null,null,{"$f":"IFERROR(VLOOKUP(B19,Liste!M:N,2,FALSE),\"\")","v":""}]
[null,null,{"$f":"IFERROR(VLOOKUP(B20,Liste!M:N,2,FALSE),\"\")","v":""}]
{"$rows_left_out":53}
{"sheet":"BGAD2","index":4,"n_rows":72,"n_cols":7,"rows_kept":72,"cut":false,"hidden":false,"merged":[[67,0,67,6],[71,5,71,6],[0,0,0,5],[2,1,2,2],[3,1,3,2],[4,1,4,2],[5,0,5,4],[6,0,6,4]]}
["Déclaration de vidange des secteurs récoltés par BGAd ou PRAU"]
[]
["Année de récolte :"]
["Unité d'aménagement :"]
["Nom Du BGAd :"]
[]
["(insérer des lignes au besoin)"]
["Numéro de secteur d'intervention \nou \nNom du chantier","No client mesubois","Nom du BGA/PRAU détenteur du droit","Code d'essence","Qualité ","Volume estimé (m3)","coordonnéesGPS(WGS84)    no séquentiel shp"]
[null,null,{"$f":"IFERROR(VLOOKUP(B9,Liste!M:N,2,FALSE),\"\")","v":""}]
[null,null,{"$f":"IFERROR(VLOOKUP(B10,Liste!M:N,2,FALSE),\"\")","v":""}]
[null,null,{"$f":"IFERROR(VLOOKUP(B11,Liste!M:N,2,FALSE),\"\")","v":""}]
[null,null,{"$f":"IFERROR(VLOOKUP(B12,Liste!M:N,2,FALSE),\"\")","v":""}]
[null,null,{"$f":"IFERROR(VLOOKUP(B13,Liste!M:N,2,FALSE),\"\")","v":""}]
[null,null,{"$f":"IFERROR(VLOOKUP(B14,Liste!M:N,2,FALSE),\"\")","v":""}]
[null,null,{"$f":"IFERROR(VLOOKUP(B15,Liste!M:N,2,FALSE),\"\")","v":""}]
[null,null,{"$f":"IFERROR(VLOOKUP(B16,Liste!M:N,2,FALSE),\"\")","v":""}]
[null,null,{"$f":"IFERROR(VLOOKUP(B17,Liste!M:N,2,FALSE),\"\")","v":""}]
[null,null,{"$f":"IFERROR(VLOOKUP(B18,Liste!M:N,2,FALSE),\"\")","v":""}]
[null,null,{"$f":"IFERROR(VLOOKUP(B19,Liste!M:N,2,FALSE),\"\")","v":""}]
[null,null,{"$f":"IFERROR(VLOOKUP(B20,Liste!M:N,2,FALSE),\"\")","v":""}]
{"$rows_left_out":53}
{"sheet":"BGAD3","index":5,"n_rows":72,"n_cols":7,"rows_kept":72,"cut":false,"hidden":false,"merged":[[67,0,67,6],[71,5,71,6],[0,0,0,5],[2,1,2,2],[3,1,3,2],[4,1,4,2],[5,0,5,4],[6,0,6,4]]}
["Déclaration de vidange des secteurs récoltés par BGAd ou PRAU"]
[]
["Année de récolte :"]
["Unité d'aménagement :"]
["Nom Du BGAd :"]
[]
["(insérer des lignes au besoin)"]
["Numéro de secteur d'intervention \nou \nNom du chantier","No client mesubois","Nom du BGA/PRAU détenteur du droit","Code d'essence","Qualité ","Volume estimé (m3)","coordonnéesGPS(WGS84)    no séquentiel shp"]
[null,null,{"$f":"IFERROR(VLOOKUP(B9,Liste!M:N,2,FALSE),\"\")","v":""}]
[null,null,{"$f":"IFERROR(VLOOKUP(B10,Liste!M:N,2,FALSE),\"\")","v":""}]
[null,null,{"$f":"IFERROR(VLOOKUP(B11,Liste!M:N,2,FALSE),\"\")","v":""}]
[null,null,{"$f":"IFERROR(VLOOKUP(B12,Liste!M:N,2,FALSE),\"\")","v":""}]
[null,null,{"$f":"IFERROR(VLOOKUP(B13,Liste!M:N,2,FALSE),\"\")","v":""}]
[null,null,{"$f":"IFERROR(VLOOKUP(B14,Liste!M:N,2,FALSE),\"\")","v":""}]
[null,null,{"$f":"IFERROR(VLOOKUP(B15,Liste!M:N,2,FALSE),\"\")","v":""}]
[null,null,{"$f":"IFERROR(VLOOKUP(B16,Liste!M:N,2,FALSE),\"\")","v":""}]
[null,null,{"$f":"IFERROR(VLOOKUP(B17,Liste!M:N,2,FALSE),\"\")","v":""}]
[null,null,{"$f":"IFERROR(VLOOKUP(B18,Liste!M:N,2,FALSE),\"\")","v":""}]
[null,null,{"$f":"IFERROR(VLOOKUP(B19,Liste!M:N,2,FALSE),\"\")","v":""}]
[null,null,{"$f":"IFERROR(VLOOKUP(B20,Liste!M:N,2,FALSE),\"\")","v":""}]
{"$rows_left_out":53}
{"sheet":"BGAD4","index":6,"n_rows":72,"n_cols":7,"rows_kept":72,"cut":false,"hidden":false,"merged":[[67,0,67,6],[71,5,71,6],[0,0,0,5],[2,1,2,2],[3,1,3,2],[4,1,4,2],[5,0,5,4],[6,0,6,4]]}
["Déclaration de vidange des secteurs récoltés par BGAd ou PRAU"]
[]
["Année de récolte :"]
["Unité d'aménagement :"]
["Nom Du BGAd :"]
[]
["(insérer des lignes au besoin)"]
["Numéro de secteur d'intervention \nou \nNom du chantier","No client mesubois","Nom du BGA/PRAU détenteur du droit","Code d'essence","Qualité ","Volume estimé (m3)","coordonnéesGPS(WGS84)    no séquentiel shp"]
[null,null,{"$f":"IFERROR(VLOOKUP(B9,Liste!M:N,2,FALSE),\"\")","v":""}]
[null,null,{"$f":"IFERROR(VLOOKUP(B10,Liste!M:N,2,FALSE),\"\")","v":""}]
[null,null,{"$f":"IFERROR(VLOOKUP(B11,Liste!M:N,2,FALSE),\"\")","v":""}]
[null,null,{"$f":"IFERROR(VLOOKUP(B12,Liste!M:N,2,FALSE),\"\")","v":""}]
[null,null,{"$f":"IFERROR(VLOOKUP(B13,Liste!M:N,2,FALSE),\"\")","v":""}]
[null,null,{"$f":"IFERROR(VLOOKUP(B14,Liste!M:N,2,FALSE),\"\")","v":""}]
[null,null,{"$f":"IFERROR(VLOOKUP(B15,Liste!M:N,2,FALSE),\"\")","v":""}]
[null,null,{"$f":"IFERROR(VLOOKUP(B16,Liste!M:N,2,FALSE),\"\")","v":""}]
[null,null,{"$f":"IFERROR(VLOOKUP(B17,Liste!M:N,2,FALSE),\"\")","v":""}]
[null,null,{"$f":"IFERROR(VLOOKUP(B18,Liste!M:N,2,FALSE),\"\")","v":""}]
[null,null,{"$f":"IFERROR(VLOOKUP(B19,Liste!M:N,2,FALSE),\"\")","v":""}]
[null,null,{"$f":"IFERROR(VLOOKUP(B20,Liste!M:N,2,FALSE),\"\")","v":""}]
{"$rows_left_out":53}
{"sheet":"BGAD5","index":7,"n_rows":72,"n_cols":7,"rows_kept":72,"cut":false,"hidden":false,"merged":[[67,0,67,6],[71,5,71,6],[0,0,0,5],[2,1,2,2],[3,1,3,2],[4,1,4,2],[5,0,5,4],[6,0,6,4]]}
["Déclaration de vidange des secteurs récoltés par BGAd ou PRAU"]
[]
["Année de récolte :"]
["Unité d'aménagement :"]
["Nom Du BGAd :"]
[]
["(insérer des lignes au besoin)"]
["Numéro de secteur d'intervention \nou \nNom du chantier","No client mesubois","Nom du BGA/PRAU détenteur du droit","Code d'essence","Qualité ","Volume estimé (m3)","coordonnéesGPS(WGS84)    no séquentiel shp"]
[null,null,{"$f":"IFERROR(VLOOKUP(B9,Liste!M:N,2,FALSE),\"\")","v":""}]
[null,null,{"$f":"IFERROR(VLOOKUP(B10,Liste!M:N,2,FALSE),\"\")","v":""}]
[null,null,{"$f":"IFERROR(VLOOKUP(B11,Liste!M:N,2,FALSE),\"\")","v":""}]
[null,null,{"$f":"IFERROR(VLOOKUP(B12,Liste!M:N,2,FALSE),\"\")","v":""}]
[null,null,{"$f":"IFERROR(VLOOKUP(B13,Liste!M:N,2,FALSE),\"\")","v":""}]
[null,null,{"$f":"IFERROR(VLOOKUP(B14,Liste!M:N,2,FALSE),\"\")","v":""}]
[null,null,{"$f":"IFERROR(VLOOKUP(B15,Liste!M:N,2,FALSE),\"\")","v":""}]
[null,null,{"$f":"IFERROR(VLOOKUP(B16,Liste!M:N,2,FALSE),\"\")","v":""}]
[null,null,{"$f":"IFERROR(VLOOKUP(B17,Liste!M:N,2,FALSE),\"\")","v":""}]
[null,null,{"$f":"IFERROR(VLOOKUP(B18,Liste!M:N,2,FALSE),\"\")","v":""}]
[null,null,{"$f":"IFERROR(VLOOKUP(B19,Liste!M:N,2,FALSE),\"\")","v":""}]
[null,null,{"$f":"IFERROR(VLOOKUP(B20,Liste!M:N,2,FALSE),\"\")","v":""}]
{"$rows_left_out":53}
{"sheet":"BGAD6","index":8,"n_rows":72,"n_cols":7,"rows_kept":72,"cut":false,"hidden":false,"merged":[[67,0,67,6],[71,5,71,6],[0,0,0,5],[2,1,2,2],[3,1,3,2],[4,1,4,2],[5,0,5,4],[6,0,6,4]]}
["Déclaration de vidange des secteurs récoltés par BGAd ou PRAU"]
[]
["Année de récolte :"]
["Unité d'aménagement :"]
["Nom Du BGAd :"]
[]
["(insérer des lignes au besoin)"]
["Numéro de secteur d'intervention \nou \nNom du chantier","No client mesubois","Nom du BGA/PRAU détenteur du droit","Code d'essence","Qualité ","Volume estimé (m3)","coordonnéesGPS(WGS84)    no séquentiel shp"]
[null,null,{"$f":"IFERROR(VLOOKUP(B9,Liste!M:N,2,FALSE),\"\")","v":""}]
[null,null,{"$f":"IFERROR(VLOOKUP(B10,Liste!M:N,2,FALSE),\"\")","v":""}]
[null,null,{"$f":"IFERROR(VLOOKUP(B11,Liste!M:N,2,FALSE),\"\")","v":""}]
[null,null,{"$f":"IFERROR(VLOOKUP(B12,Liste!M:N,2,FALSE),\"\")","v":""}]
[null,null,{"$f":"IFERROR(VLOOKUP(B13,Liste!M:N,2,FALSE),\"\")","v":""}]
[null,null,{"$f":"IFERROR(VLOOKUP(B14,Liste!M:N,2,FALSE),\"\")","v":""}]
[null,null,{"$f":"IFERROR(VLOOKUP(B15,Liste!M:N,2,FALSE),\"\")","v":""}]
[null,null,{"$f":"IFERROR(VLOOKUP(B16,Liste!M:N,2,FALSE),\"\")","v":""}]
[null,null,{"$f":"IFERROR(VLOOKUP(B17,Liste!M:N,2,FALSE),\"\")","v":""}]
[null,null,{"$f":"IFERROR(VLOOKUP(B18,Liste!M:N,2,FALSE),\"\")","v":""}]
[null,null,{"$f":"IFERROR(VLOOKUP(B19,Liste!M:N,2,FALSE),\"\")","v":""}]
[null,null,{"$f":"IFERROR(VLOOKUP(B20,Liste!M:N,2,FALSE),\"\")","v":""}]
{"$rows_left_out":53}
{"sheet":"BGAD7","index":9,"n_rows":72,"n_cols":7,"rows_kept":72,"cut":false,"hidden":false,"merged":[[67,0,67,6],[71,5,71,6],[0,0,0,5],[2,1,2,2],[3,1,3,2],[4,1,4,2],[5,0,5,4],[6,0,6,4]]}
["Déclaration de vidange des secteurs récoltés par BGAd ou PRAU"]
[]
["Année de récolte :"]
["Unité d'aménagement :"]
["Nom Du BGAd :"]
[]
["(insérer des lignes au besoin)"]
["Numéro de secteur d'intervention \nou \nNom du chantier","No client mesubois","Nom du BGA/PRAU détenteur du droit","Code d'essence","Qualité ","Volume estimé (m3)","coordonnéesGPS(WGS84)    no séquentiel shp"]
[null,null,{"$f":"IFERROR(VLOOKUP(B9,Liste!M:N,2,FALSE),\"\")","v":""}]
[null,null,{"$f":"IFERROR(VLOOKUP(B10,Liste!M:N,2,FALSE),\"\")","v":""}]
[null,null,{"$f":"IFERROR(VLOOKUP(B11,Liste!M:N,2,FALSE),\"\")","v":""}]
[null,null,{"$f":"IFERROR(VLOOKUP(B12,Liste!M:N,2,FALSE),\"\")","v":""}]
[null,null,{"$f":"IFERROR(VLOOKUP(B13,Liste!M:N,2,FALSE),\"\")","v":""}]
[null,null,{"$f":"IFERROR(VLOOKUP(B14,Liste!M:N,2,FALSE),\"\")","v":""}]
[null,null,{"$f":"IFERROR(VLOOKUP(B15,Liste!M:N,2,FALSE),\"\")","v":""}]
[null,null,{"$f":"IFERROR(VLOOKUP(B16,Liste!M:N,2,FALSE),\"\")","v":""}]
[null,null,{"$f":"IFERROR(VLOOKUP(B17,Liste!M:N,2,FALSE),\"\")","v":""}]
[null,null,{"$f":"IFERROR(VLOOKUP(B18,Liste!M:N,2,FALSE),\"\")","v":""}]
[null,null,{"$f":"IFERROR(VLOOKUP(B19,Liste!M:N,2,FALSE),\"\")","v":""}]
[null,null,{"$f":"IFERROR(VLOOKUP(B20,Liste!M:N,2,FALSE),\"\")","v":""}]
{"$rows_left_out":53}
{"sheet":"BGAD8","index":10,"n_rows":72,"n_cols":7,"rows_kept":72,"cut":false,"hidden":false,"merged":[[67,0,67,6],[71,5,71,6],[0,0,0,5],[2,1,2,2],[3,1,3,2],[4,1,4,2],[5,0,5,4],[6,0,6,4]]}
["Déclaration de vidange des secteurs récoltés par BGAd ou PRAU"]
[]
["Année de récolte :"]
["Unité d'aménagement :"]
["Nom Du BGAd :"]
[]
["(insérer des lignes au besoin)"]
["Numéro de secteur d'intervention \nou \nNom du chantier","No client mesubois","Nom du BGA/PRAU détenteur du droit","Code d'essence","Qualité ","Volume estimé (m3)","coordonnéesGPS(WGS84)    no séquentiel shp"]
[null,null,{"$f":"IFERROR(VLOOKUP(B9,Liste!M:N,2,FALSE),\"\")","v":""}]
[null,null,{"$f":"IFERROR(VLOOKUP(B10,Liste!M:N,2,FALSE),\"\")","v":""}]
[null,null,{"$f":"IFERROR(VLOOKUP(B11,Liste!M:N,2,FALSE),\"\")","v":""}]
[null,null,{"$f":"IFERROR(VLOOKUP(B12,Liste!M:N,2,FALSE),\"\")","v":""}]
[null,null,{"$f":"IFERROR(VLOOKUP(B13,Liste!M:N,2,FALSE),\"\")","v":""}]
[null,null,{"$f":"IFERROR(VLOOKUP(B14,Liste!M:N,2,FALSE),\"\")","v":""}]
[null,null,{"$f":"IFERROR(VLOOKUP(B15,Liste!M:N,2,FALSE),\"\")","v":""}]
[null,null,{"$f":"IFERROR(VLOOKUP(B16,Liste!M:N,2,FALSE),\"\")","v":""}]
[null,null,{"$f":"IFERROR(VLOOKUP(B17,Liste!M:N,2,FALSE),\"\")","v":""}]
[null,null,{"$f":"IFERROR(VLOOKUP(B18,Liste!M:N,2,FALSE),\"\")","v":""}]
[null,null,{"$f":"IFERROR(VLOOKUP(B19,Liste!M:N,2,FALSE),\"\")","v":""}]
[null,null,{"$f":"IFERROR(VLOOKUP(B20,Liste!M:N,2,FALSE),\"\")","v":""}]
{"$rows_left_out":53}
{"sheet":"BGAD9","index":11,"n_rows":72,"n_cols":7,"rows_kept":72,"cut":false,"hidden":false,"merged":[[67,0,67,6],[71,5,71,6],[0,0,0,5],[2,1,2,2],[3,1,3,2],[4,1,4,2],[5,0,5,4],[6,0,6,4]]}
["Déclaration de vidange des secteurs récoltés par BGAd ou PRAU"]
[]
["Année de récolte :"]
["Unité d'aménagement :"]
["Nom Du BGAd :"]
[]
["(insérer des lignes au besoin)"]
["Numéro de secteur d'intervention \nou \nNom du chantier","No client mesubois","Nom du BGA/PRAU détenteur du droit","Code d'essence","Qualité ","Volume estimé (m3)","coordonnéesGPS(WGS84)    no séquentiel shp"]
[null,null,{"$f":"IFERROR(VLOOKUP(B9,Liste!M:N,2,FALSE),\"\")","v":""}]
[null,null,{"$f":"IFERROR(VLOOKUP(B10,Liste!M:N,2,FALSE),\"\")","v":""}]
[null,null,{"$f":"IFERROR(VLOOKUP(B11,Liste!M:N,2,FALSE),\"\")","v":""}]
[null,null,{"$f":"IFERROR(VLOOKUP(B12,Liste!M:N,2,FALSE),\"\")","v":""}]
[null,null,{"$f":"IFERROR(VLOOKUP(B13,Liste!M:N,2,FALSE),\"\")","v":""}]
[null,null,{"$f":"IFERROR(VLOOKUP(B14,Liste!M:N,2,FALSE),\"\")","v":""}]
[null,null,{"$f":"IFERROR(VLOOKUP(B15,Liste!M:N,2,FALSE),\"\")","v":""}]
[null,null,{"$f":"IFERROR(VLOOKUP(B16,Liste!M:N,2,FALSE),\"\")","v":""}]
[null,null,{"$f":"IFERROR(VLOOKUP(B17,Liste!M:N,2,FALSE),\"\")","v":""}]
[null,null,{"$f":"IFERROR(VLOOKUP(B18,Liste!M:N,2,FALSE),\"\")","v":""}]
[null,null,{"$f":"IFERROR(VLOOKUP(B19,Liste!M:N,2,FALSE),\"\")","v":""}]
[null,null,{"$f":"IFERROR(VLOOKUP(B20,Liste!M:N,2,FALSE),\"\")","v":""}]
{"$rows_left_out":53}
{"sheet":"BGAD10","index":12,"n_rows":72,"n_cols":7,"rows_kept":72,"cut":false,"hidden":false,"merged":[[67,0,67,6],[71,5,71,6],[0,0,0,5],[2,1,2,2],[3,1,3,2],[4,1,4,2],[5,0,5,4],[6,0,6,4]]}
["Déclaration de vidange des secteurs récoltés par BGAd ou PRAU"]
[]
["Année de récolte :"]
["Unité d'aménagement :"]
["Nom Du BGAd :"]
[]
["(insérer des lignes au besoin)"]
["Numéro de secteur d'intervention \nou \nNom du chantier","No client mesubois","Nom du BGA/PRAU détenteur du droit","Code d'essence","Qualité ","Volume estimé (m3)","coordonnéesGPS(WGS84)    no séquentiel shp"]
[null,null,{"$f":"IFERROR(VLOOKUP(B9,Liste!M:N,2,FALSE),\"\")","v":""}]
[null,null,{"$f":"IFERROR(VLOOKUP(B10,Liste!M:N,2,FALSE),\"\")","v":""}]
[null,null,{"$f":"IFERROR(VLOOKUP(B11,Liste!M:N,2,FALSE),\"\")","v":""}]
[null,null,{"$f":"IFERROR(VLOOKUP(B12,Liste!M:N,2,FALSE),\"\")","v":""}]
[null,null,{"$f":"IFERROR(VLOOKUP(B13,Liste!M:N,2,FALSE),\"\")","v":""}]
[null,null,{"$f":"IFERROR(VLOOKUP(B14,Liste!M:N,2,FALSE),\"\")","v":""}]
[null,null,{"$f":"IFERROR(VLOOKUP(B15,Liste!M:N,2,FALSE),\"\")","v":""}]
[null,null,{"$f":"IFERROR(VLOOKUP(B16,Liste!M:N,2,FALSE),\"\")","v":""}]
[null,null,{"$f":"IFERROR(VLOOKUP(B17,Liste!M:N,2,FALSE),\"\")","v":""}]
[null,null,{"$f":"IFERROR(VLOOKUP(B18,Liste!M:N,2,FALSE),\"\")","v":""}]
[null,null,{"$f":"IFERROR(VLOOKUP(B19,Liste!M:N,2,FALSE),\"\")","v":""}]
[null,null,{"$f":"IFERROR(VLOOKUP(B20,Liste!M:N,2,FALSE),\"\")","v":""}]
{"$rows_left_out":53}
{"sheet":"Liste","index":13,"n_rows":347,"n_cols":14,"rows_kept":347,"cut":false,"hidden":true,"merged":[]}
["Année","Code d'essence","Nom essence","Essence","Unite d'amenagement","Qualité","NO CLIENT","TYPE CLIENT","DESCRIPTION USINE","DESCRIPTION CLIENT",null,null,"NO CLIENT","DESCRIPTION USINE"]
["2019-2020","010","Épinette (autre que Norvège)",{"$f":"IF(B2<>\"\",CONCATENATE(B2,\"_\",C2),\"\")","v":"010_Épinette (autre que Norvège)"},"01171","S/O",5,"CAAF","Groupe Lebel inc. (Saint-Hilarion)","Groupe Lebel inc.",null,null,5,"Groupe Lebel inc. (Saint-Hilarion)"]
["2020-2021","014","Épinette de Norvège",{"$f":"IF(B3<>\"\",CONCATENATE(B3,\"_\",C3),\"\")","v":"014_Épinette de Norvège"},"01272",null,6,"CAAF","Scierie Petit-Saguenay inc.","Scierie Petit-Saguenay inc.",null,null,6,"Scierie Petit-Saguenay inc."]
["2021-2022","030","Mélèze laricin","030_Mélèze laricin","02371",null,7,"CAAF","Boisaco inc.","Boisaco inc.",null,null,7,"Boisaco inc."]
["2022-2023","043","Pin gris et sylvestre","043_Pin gris et sylvestre","02471",null,10,"CAAF","Bois Daaquam inc.","Bois Daaquam inc.",null,null,10,"Bois Daaquam inc."]
["2023-2024","060","Sapin baumier","060_Sapin baumier","02571",null,11,"CAAF","Bois de sciage Lafontaine inc. (Sainte-Perpétue)","Bois de sciage Lafontaine inc.",null,null,11,"Bois de sciage Lafontaine inc. (Sainte-Perpétue)"]
["2024-2025","190","Peuplier (autre que Baumier)","190_Peuplier (autre que Baumier)","02651",null,14,"CAAF","Matériaux Blanchet inc. (Saint-Pamphile)","Materiaux Blanchet inc.",null,null,14,"Matériaux Blanchet inc. (Saint-Pamphile)"]
["2025-2026","191","Peuplier baumier","191_Peuplier baumier","02661",null,18,"CAAF","Bois Daaquam inc.(St-pamphile)","Bois Daaquam inc.(St-Pamphile)",null,null,18,"Bois Daaquam inc.(St-pamphile)"]
["2026-2027","105","Bouleau blanc ","105_Bouleau blanc ","02662",null,22,"CAAF","Stella-Jones inc. ( Hérouxville )","Stella-Jones inc.",null,null,22,"Stella-Jones inc. ( Hérouxville )"]
["2027-2028","104","Bouleau jaune","104_Bouleau jaune","02663",null,23,"CAAF","Stella-Jones inc. (Rivière-Rouge)","Stella-Jones inc. (Rivière-Rouge)",null,null,23,"Stella-Jones inc. (Rivière-Rouge)"]
["2028-2029","132","Érable à sucre","132_Érable à sucre","02664",null,25,"CAAF","Stella-Jones inc.(Masson-Angers-Poteaux)","Stella-Jones inc.(Masson-Angers-Poteaux)",null,null,25,"Stella-Jones inc.(Masson-Angers-Poteaux)"]
["2029-2030","133","Érable rouge","133_Érable rouge","02665","SQ",26,"CAAF","Poteaux Sélect inc.","Poteaux Select inc.",null,null,26,"Poteaux Sélect inc."]
[null,"135","Érables - Autres ","135_Érables - Autres ","02666","QI",32,"CAAF","Les Chantiers de Chibougamau ltée - Val d'Or","Les Chantiers de Chibougamau ltée",null,null,32,"Les Chantiers de Chibougamau ltée - Val d'Or"]
[null,"120","Chêne ","120_Chêne ","02751",null,33,"CAAF","Produits Forestiers Miniers \"Abitibi\" inc.","Produits Forestiers Miniers \"Abitibi\" inc.",null,null,33,"Produits Forestiers Miniers \"Abitibi\" inc."]
[null,"141","Frêne d’Amérique (blanc)","141_Frêne d’Amérique (blanc)","03153",null,34,"CAAF","PF Résolu Canada inc. ( Senneterre)","PF Résolu Canada inc.",null,null,34,"PF Résolu Canada inc. ( Senneterre)"]
[null,"142","Frêne noir","142_Frêne noir","03171",null,36,"CAAF","Chantiers Chibougamau (La Sarre)","Les Chantiers de Chibougamau ltée",null,null,36,"Chantiers Chibougamau (La Sarre)"]
[null,"150","Hêtre","150_Hêtre","03351",null,41,"CAAF","Les Chantiers Chibougamau ltée - Matagami","Les Chantiers de Chibougamau ltée",null,null,41,"Les Chantiers Chibougamau ltée - Matagami"]
[null,"160","Noyer","160_Noyer","03451",null,42,"CAAF","Scierie Landrienne (div. Ch. Chibougamau)","Scierie Landrienne (Division De Les Chantiers Chibougamau)",null,null,42,"Scierie Landrienne (div. Ch. Chibougamau)"]
[null,"165","Caryer","165_Caryer","03571",null,46,"CAAF","Matériaux Blanchet inc. (Amos)","Materiaux Blanchet inc.",null,null,46,"Matériaux Blanchet inc. (Amos)"]
[null,"170","Orme","170_Orme","04151",null,48,"CAAF","PF Résolu Canada inc. (Comtois)","PF Résolu Canada inc.",null,null,48,"PF Résolu Canada inc. (Comtois)"]
{"$rows_left_out":327}