{"text_format":"1","workbook":"xlsx","n_sheets":17,"sheets":["Procédure (DRH)","Options","Formulaire","Liste Interrogation","Liste Saisie","Liste Générale","Modifications","Mise à jour","DOSOAQ","BDD","BDD2","BDD3","DataChoix","Secteur","Secteur1","Secteur2","Liste courriel"],"not_rendered":{"charts":0,"images":30,"macros":1,"external_links":0,"defined_names":14,"comments":0,"pivot_tables":0},"unopened":[],"bounds":{"document_bytes":16777216,"sheet_cells":100000,"rows_first":2000,"rows_last":500,"rows_between":2000,"halvings":0,"cell_chars":16384,"cell_head_chars":4096},"cells_cut":0,"cells_raw":0,"read":"whole","date_system":"1900"}

{"sheet":"Procédure (DRH)","index":0,"n_rows":137,"n_cols":2,"rows_kept":137,"cut":false,"hidden":false,"merged":[[3,0,11,0],[3,1,11,1],[12,0,18,0],[19,0,21,0],[22,0,46,0],[131,0,142,0],[47,0,75,0],[76,0,90,0],[91,0,103,0],[104,0,122,0],[123,0,130,0]]}
["ÉTAPE","Actions à poser"]
[1,"Aller chercher la version la plus récente du formulaire de demande d’accès au SAGIP\nhttps://www.quebec.ca/gouv/travailler-gouvernement/services-employes-etat/remuneration/formulaires/ "]
[2,"Enregistrer le formulaire sur votre poste de travail"]
[3,"Si les avertissements de sécurité ci-dessous apparaissent, cliquer sur Activer le contenu et Oui"]
[]
[]
[]
[]
[]
[]
[]
[]
[4,"Cliquer sur l’onglet Options et saisir les informations concernant le nom de domaine de l'adresse courriel de votre organisation"]
[]
[]
[null," "]
[]
[]
[]
[5,"Aller dans l’onglet Formulaire"]
[null,"Faire une sauvegarde de votre formulaire (Crtl+S) pour que ces informations soient disponibles lorsque vous allez compléter d’autres formulaires"]
[null,"Une fois cette étape réalisée, vous pourrez commencer à l’étape 6 lorsque vous aurez à compléter de nouveaux formulaires"]
[6,"Partie I – RENSEIGNEMENTS PERSONNELS"]
[null,"Remplir tous les champs de cette section"]
[]
[]
[]
[]
[]
[]
[]
[]
[]
[]
[]
[]
[]
[]
[]
[]
[null,"1.     L’adresse courriel se complète automatiquement selon Nom, Prénom en plus du nom de domaine indiquer dans l’onglet Option. Attention de vérifier si l’adresse courriel est la bonne, sinon corriger au besoin"]
[null,"2.     Indiquer le numéro d’employé SAGIR de l’utilisateur"]
[null,"3.     Pour un employé contractuel ou occasionnel, indiquer la date de fin de son contrat"]
[null,"4.     Sélectionner le numéro du MO de l’utilisateur"]
[null,"5.     Indiquer le CR de l’utilisateur (4 chiffres)"]
[null,"6.     Sélectionner le secteur et le sous-secteur correspondant à l’utilisateur"]
[]
[7,"Partie II – PRIVILÈGES D’ACCÈS"]
[]
[]
[]
[]
[]
[]
[]
[]
[]
[]
[]
[]
[]
[]
[]
[]
[]
[]
[]
[null,"1.     Sélectionner s’il s’agit d’une activation, modification ou annulation"]
[null,"2.     Selon le ministère de l’utilisateur, le nom des ministères disponibles pour traitement seront disponible dans cette liste"]
[null,"3.     Vous devrez cochez les ministères que l’utilisateur devra traiter. La liste et les caches à cocher vont s’adapter selon le ministère de l’utilisateur"]
[null,"4.     Pour un type de demande autre qu’une activation, svp inscrire l’identifiant de l’utilisateur."]
[null,"5.     Inscrire au besoin les centres de responsabilité pour lesquels nous devons octroyer les accès"]
[null,"6.     Sélectionner les accès qui doivent être octroyés à l’employé "]
[null,"7.     Sélectionner les privilèges qui doivent être accordés à l’employé *Voir étape 7.7 au besoin"]
[null,"8.     Indiquer si l’utilisateur aura besoin d’un colis micro (remote)"]
[null,"9.     Indiquer au besoin un commentaire à cette section"]
["7.7","Choix des privilèges"]
[]
[]
[]
[]
[]
[]
[]
[]
[]
[]
[]
[]
[null,"Vous pouvez choisir le code des privilèges en sélectionnant le numéro dans la liste défilante ou en cliquant sur le lien inscrit en bleu à droite si vous ne connaissez pas le code à utiliser"]
[null,"Une fois que la liste sera visible à l'écran, double-cliquer sur le numéro du code que vous souhaitez sélectionner dans la colonne de gauche"]
[8,"Coordonnées de la personne qui remplit le formulaire (facultatives)"]
[null,"Indiquer votre numéro de téléphone, votre nom ainsi que la date de votre signature (aaaa-mm-jj)"]
[]
[]
[]
[]
[]
[]
[]
[null,"Presser la touche F12 afin d'enregistrer le formulaire avec la structure de nom de fichier suivante : "]
[null,"Nom, Prénom de l'employé - Type de demande (Activation / Modification / Annulation) - Numéro du MO"]
[null,"Exemple : Nom, Prénom - Activation - 010"]
[null,"*** Important de garder le format de fichier Excel .xlsm lors de l'enregistrement"]
[9,"Autorisation du gestionnaire (obligatoire)"]
[null,"Indiquer votre numéro de téléphone, votre nom ainsi que la date de votre signature (aaaa-mm-jj)"]
[]
[]
[]
[]
[]
[]
[]
[]
[]
[null,"Si formulaire déjà enregistré sous le format suivant : Nom, Prénom - Numéro du M/O :"]
[null,"Sauvegarder le fichier (CRTL+S)"]
[null,"Sinon, presser la touche F12 afin d'enregistrer le formulaire avec la structure de nom de fichier suivante : "]
[null,"Nom, Prénom de l'employé - Type de demande (Activation / Modification / Annulation) - Numéro du MO"]
[null,"Exemple : Nom, Prénom - Activation - 010"]
[null,"*** Important de garder le format de fichier Excel .xlsm lors de l'enregistrement"]
[null,"Envoyer le formulaire par courriel à la personne autorisé à votre DRH"]
[null,"Si le formulaire n'est pas envoyé par le gestionnaire, l'adresse courriel de ce dernier doit être ajouté en CC"]
[10,"Approbation de la personne autorisée à votre DRH (obligatoire)"]
[null,"Indiquer votre numéro de téléphone, votre nom et indiquer la date de votre signature (aaaa-mm-jj)"]
[]
[]
[]
[]
[]
[null,"Enregistrer le formulaire pour la préparation de l'envoi du courriel à l'équipe responsable de la sécurité"]
[11,"Envoi du formulaire par courriel à l'équipe responsable de la sécurité des identifiants SAGIP"]
[null,"Envoyer le formulaire signé par le gestionnaire et la personne autorisée à votre DRH à l'adresse courriel indiquée dans cette section"]
[null,"Le formulaire doit être envoyé par la personne autorisée à votre DRH. Le gestionnaire doit toujours être ajouté en CC."]
[null,"Si la personne autorisée part en vacances ou en congé prolongé, elle se doit de nommer un intérim avant son départ."]
[null,"Prendre note que vous devez l’ajouter en CC en plus du gestionnaire."]
[null,"*** Important d'envoyer le fichier en format Excel .xlsm"]

{"sheet":"Options","index":1,"n_rows":5,"n_cols":6,"rows_kept":5,"cut":false,"hidden":false,"merged":[]}
[]
[]
[]
[]
["Nom de domaine de l'adresse courriel :","mcn.gouv.qc.ca",null,null,null,"ex: mcn.gouv.qc.ca"]

{"sheet":"Formulaire","index":2,"n_rows":109,"n_cols":42,"rows_kept":109,"cut":false,"hidden":false,"merged":[[1,10,1,11],[15,3,15,11],[65,3,65,4],[65,5,65,6],[65,7,65,8],[65,9,65,10],[65,11,65,12],[64,3,64,4],[64,5,64,6],[64,7,64,8],[64,9,64,10],[64,11,64,12],[63,3,63,4],[63,5,63,6],[63,7,63,8],[63,9,63,10],[10,3,10,4],[61,11,61,12],[61,9,61,10],[61,7,61,8],[61,3,61,4],[60,11,60,12],[60,9,60,10],[60,7,60,8],[13,0,13,2],[39,3,39,11],[42,3,42,11],[11,3,11,4],[16,3,16,11],[28,3,28,4],[22,3,22,4],[22,6,22,7],[30,0,31,2],[20,0,20,2],[19,0,19,2],[18,0,18,2],[29,0,29,2],[29,3,29,11],[12,0,12,2],[17,0,17,2],[16,0,16,2],[15,0,15,2],[12,3,12,4],[36,3,36,11],[85,19,85,20],[4,0,4,12],[10,0,10,2],[81,0,81,1],[17,3,17,11],[58,0,58,2],[60,0,61,2],[67,0,67,2],[33,0,33,2],[9,3,9,10],[13,3,13,4],[24,3,24,11],[7,0,7,2],[80,2,80,9],[7,3,7,6],[8,0,8,2],[9,0,9,2],[8,3,8,6],[61,5,61,6],[62,7,62,8],[23,3,23,11],[60,5,60,6],[82,0,82,1],[80,0,80,1],[78,0,78,12],[18,3,18,4],[20,3,20,5],[28,0,28,2],[81,2,81,9],[62,9,62,10],[62,11,62,12],[71,5,71,8],[67,3,67,6],[63,11,63,12],[62,3,62,4],[62,5,62,6],[75,1,75,2],[75,3,76,11],[73,0,73,2],[71,0,71,2],[69,5,69,10],[69,0,69,2],[48,3,48,11],[51,3,51,11],[54,3,54,11],[33,3,33,11],[60,3,60,4],[45,3,45,11],[91,2,91,9],[90,2,90,9],[82,2,82,9],[92,2,92,9],[108,2,108,9],[107,2,107,9],[96,2,96,9],[97,2,97,9],[95,2,95,9]]}
[]
[null,null,null,null,null,null,null,null,null,null,"Version 2026.3",null,null,null,null,null,null,null,null,null,null,null,null,null,null,null,null,null,null,null,null,null,null,null,null,null,null,null,null,null,null,"DGSR-SR1-Direction"]
[null,null,null,null,null,null,null,null,null,null,"2026-02-04",null,null,null,null,null,null,null,null,null,null,null,null,null,null,null,null,null,null,null,null,null,null,null,null,null,null,null,null,null,null,"DGSR-SR1-A"]
[null,null,null,null,null,null,null,null,null,null,null,null,null,null,null,null,null,null,null,null,null,null,null,null,null,null,null,null,null,null,null,null,null,null,null,null,null,null,null,null,null,"DGSR-SR1-B"]
[null,null,null,null,null,null,null,null,null,null,null,null,null,null,null,null,null,null,null,null,null,null,null,null,null,null,null,null,null,null,null,null,null,null,null,null,null,null,null,null,null,"DGSR-SR1-C"]
[" Partie I – RENSEIGNEMENTS PERSONNELS    ",null,null,null,null,null,null,null,null,null,null,null,null,null,null,null,null,null,null,null,null,null,null,null,null,null,null,null,null,null,null,null,null,null,null,null,null,null,null,null,null,"DGSR-SR2-Direction"]
[null,null,null,null,null,null,null,null,null,null,null,null,null,null,null,null,null,null,null,null,null,null,null,null,null,null,null,null,null,null,null,null,null,null,null,null,null,null,null,null,null,"DGSR-SR2-A"]
["Nom :",null,null,null,null,null,null,null,null,null,null,null,null,null,null,null,null,null,null,null,null,null,null,null,null,null,null,null,null,null,null,null,null,null,null,null,null,null,null,null,null,"DGSR-SR2-B"]
["Prénom :",null,null,null,null,null,null,null,null,null,null,null,null,null,null,null,null,null,null,null,null,null,null,null,null,null,null,null,null,null,null,null,null,null,null,null,null,null,null,null,null,"DGSR-SR2-C"]
["Adresse Courriel :",null,null,null,null,null,null,null,null,null,null,null,null,null,null,null,null,null,null,null,null,null,null,null,null,null,null,null,null,null,null,null,null,null,null,null,null,null,null,null,null,"DGSR-SR3-Direction"]
["Numéro employé SAGIR:",null,null,null,null,null,null,null,null,null,null,null,null,null,null,null,null,null,null,null,null,null,null,null,null,null,null,null,null,null,null,null,null,null,null,null,null,null,null,null,null,"DGSR-SR3-A"]
[null,null,"Sexe :",null,null,null,null,null,null,null,null,null,null,null,null,null,null,null,null,null,null,null,null,null,null,null,null,null,null,null,null,null,null,null,null,null,null,null,null,null,null,"DGSR-SR3-B"]
["Statut d'emploi :",null,null,"Permanent",null,null,null,null,null,null,null,null,null,null,null,null,null,null,null,null,null,null,null,null,null,null,null,null,null,null,null,null,null,null,null,null,null,null,null,null,null,"DGSR-SR3-C"]
["Date de fin de contrat prévue :",null,null,"N/A",null,null,null,null,null,null,null,null,null,null,null,null,null,null,null,null,null,null,null,null,null,null,null,null,null,null,null,null,null,null,null,null,null,null,null,null,null,"DGSR-SR3-CABINET"]
[null,null,null,null,null,null,null,null,null,null,null,null,null,null,null,null,null,null,null,null,null,null,null,null,null,null,null,null,null,null,null,null,null,null,null,null,null,null,null,null,null,"DGSR-SR3-TES"]
["Service :",null,null,"DGSR-DOR",null,null,null,null,null,null,null,null,null,null,null,null,null,null,null,null,null,null,null,null,null,null,null,null,null,null,null,null,null,null,null,null,null,null,null,null,null,"DGSR-SR4-Direction"]
[null,null,null,null,null,null,null,null,null,null,null,null,null,null,null,null,null,null,null,null,null,null,null,null,null,null,null,null,null,null,null,null,null,null,null,null,null,null,null,null,null,"DGSR-SR4-A"]
["Ministère :",null,null,"010 Ministère de la Culture et des Communications",null,null,null,null,null,null,null,null,null,null,null,null,null,null,null,null,null,null,null,null,null,null,null,null,null,null,null,null,null,null,null,null,null,null,null,null,null,"DGSR-SR4-B"]
["Budget :",null,null,null,null,null,null,null,null,null,null,null,null,null,null,null,null,null,null,null,null,null,null,null,null,null,null,null,null,null,null,null,null,null,null,null,null,null,null,null,null,"DGSR-SR4-C"]
["Centre de responsabilité :",null,null,null,null,null,null,null,null,null,null,null,null,null,null,null,null,null,null,null,null,null,null,null,null,null,null,null,null,null,null,null,null,null,null,null,null,null,null,null,null,"DGSR-SR4-Accompagnement "]
[null,null,null,null,null,null,null,null,null,null,null,null,null,null,null,null,null,null,null,null,null,null,null,null,null,null,null,null,null,null,null,null,null,null,null,null,null,null,null,null,null,"DGSR-SACR"]
[null,null,null,null,null,null,null,null,null,null,null,null,null,null,null,null,null,null,null,null,null,null,null,null,null,null,null,null,null,null,null,null,null,null,null,null,null,null,null,null,null,"DGSR-DOSOAQ"]
[null,null,"Secteur :","DRH",null,null,null,null,null,null,null,null,null,null,null,null,null,null,null,null,null,null,null,null,null,null,null,null,null,null,null,null,null,null,null,null,null,null,null,null,null,"DGSR-DOR"]
[null,null,"Précisez secteur :"]
[null,null,"Sous-secteur :",null,null,null,null,null,null,null,null,null,null,null,null,null,null,null,null,null,null,null,null,null,null,null,null,null,null,null,null,null,null,null,null,null,null,null,null,null,null,"DGSR-DOSOAQ"]
[]
[" Partie II – PRIVILÈGES D’ACCÈS                                                                      "]
[]
["Type de demande :",null,null,"Activation"]
["MO disponible pour traitement :",null,null,"Liste des ministères disponible"]
["Traiter dans les MO :",null,null,{"$f":"IF(OR(Choix2=\"396\",Choix2=\"788\",Choix2=\"096\",Choix2=\"796\"),IF(Choix396=\"Aucun\",\"\",LEFT(OFFSET('BDD2'!$A$2,0,MATCH(Choix396,ListeA2,0)+1),3)),LEFT(OFFSET(BDD!$A$2,0,MATCH(choix,ListeA,0)+1),3))","v":"010"},{"$f":"IF(OR(Choix2=\"396\",Choix2=\"788\",Choix2=\"096\",Choix2=\"796\"),IF(Choix396=\"Aucun\",\"\",LEFT(OFFSET('BDD2'!$A$2,1,MATCH(Choix396,ListeA2,0)+1),3)),LEFT(OFFSET(BDD!$A$2,1,MATCH(choix,ListeA,0)+1),3))","v":""},{"$f":"IF(OR(Choix2=\"396\",Choix2=\"788\",Choix2=\"096\",Choix2=\"796\"),IF(Choix396=\"Aucun\",\"\",LEFT(OFFSET('BDD2'!$A$2,2,MATCH(Choix396,ListeA2,0)+1),3)),LEFT(OFFSET(BDD!$A$2,2,MATCH(choix,ListeA,0)+1),3))","v":""},{"$f":"IF(OR(Choix2=\"396\",Choix2=\"788\",Choix2=\"096\",Choix2=\"796\"),IF(Choix396=\"Aucun\",\"\",LEFT(OFFSET('BDD2'!$A$2,3,MATCH(Choix396,ListeA2,0)+1),3)),LEFT(OFFSET(BDD!$A$2,3,MATCH(choix,ListeA,0)+1),3))","v":""},{"$f":"IF(OR(Choix2=\"396\",Choix2=\"788\",Choix2=\"096\",Choix2=\"796\"),IF(Choix396=\"Aucun\",\"\",LEFT(OFFSET('BDD2'!$A$2,4,MATCH(Choix396,ListeA2,0)+1),3)),LEFT(OFFSET(BDD!$A$2,4,MATCH(choix,ListeA,0)+1),3))","v":""},{"$f":"IF(OR(Choix2=\"396\",Choix2=\"788\",Choix2=\"096\",Choix2=\"796\"),IF(Choix396=\"Aucun\",\"\",LEFT(OFFSET('BDD2'!$A$2,5,MATCH(Choix396,ListeA2,0)+1),3)),LEFT(OFFSET(BDD!$A$2,5,MATCH(choix,ListeA,0)+1),3))","v":""},{"$f":"IF(OR(Choix2=\"396\",Choix2=\"788\",Choix2=\"096\",Choix2=\"796\"),IF(Choix396=\"Aucun\",\"\",LEFT(OFFSET('BDD2'!$A$2,6,MATCH(Choix396,ListeA2,0)+1),3)),LEFT(OFFSET(BDD!$A$2,6,MATCH(choix,ListeA,0)+1),3))","v":""},{"$f":"IF(OR(Choix2=\"396\",Choix2=\"788\",Choix2=\"096\",Choix2=\"796\"),IF(Choix396=\"Aucun\",\"\",LEFT(OFFSET('BDD2'!$A$2,7,MATCH(Choix396,ListeA2,0)+1),3)),LEFT(OFFSET(BDD!$A$2,7,MATCH(choix,ListeA,0)+1),3))","v":""},{"$f":"IF(OR(Choix2=\"396\",Choix2=\"788\",Choix2=\"096\",Choix2=\"796\"),IF(Choix396=\"Aucun\",\"\",LEFT(OFFSET('BDD2'!$A$2,8,MATCH(Choix396,ListeA2,0)+1),3)),LEFT(OFFSET(BDD!$A$2,8,MATCH(choix,ListeA,0)+1),3))","v":""}]
[]
[]
["Traité par la DGSR :"]
[null,null,null,{"$f":"IF(LEFT($D34,3)=\"396\",396,IF(LEFT($D34,3)=\"096\",\"096\",IF(LEFT($D34,3)=\"788\",788,IF(LEFT($D34,3)=\"796\",796,IF(LEN($D34)>5,LEFT(OFFSET(BDD!$A$2,0,MATCH($D34,ListeA,0)+1),3),\"\")))))","v":""},{"$f":"IF(LEFT($D34,3)=\"396\",788,IF(LEFT($D34,3)=\"096\",796,IF(LEFT($D34,3)=\"788\",\"\",IF(LEFT($D34,3)=\"796\",\"\",IF(LEN($D34)>5,LEFT(OFFSET(BDD!$A$2,1,MATCH($D34,ListeA,0)+1),3),\"\")))))","v":""},{"$f":"IF(LEFT($D34,3)=\"396\",\"\",IF(LEFT($D34,3)=\"788\",\"\",IF(LEFT($D34,3)=\"096\",\"\",IF(LEFT($D34,3)=\"796\",\"\",IF(LEN($D34)>5,LEFT(OFFSET(BDD!$A$2,2,MATCH($D34,ListeA,0)+1),3),\"\")))))","v":""},{"$f":"IF(LEFT($D34,3)=\"396\",\"\",IF(LEFT($D34,3)=\"788\",\"\",IF(LEFT($D34,3)=\"096\",\"\",IF(LEFT($D34,3)=\"796\",\"\",IF(LEN($D34)>5,LEFT(OFFSET(BDD!$A$2,3,MATCH($D34,ListeA,0)+1),3),\"\")))))","v":""},{"$f":"IF(LEFT($D34,3)=\"396\",\"\",IF(LEFT($D34,3)=\"788\",\"\",IF(LEFT($D34,3)=\"096\",\"\",IF(LEFT($D34,3)=\"796\",\"\",IF(LEN($D34)>5,LEFT(OFFSET(BDD!$A$2,4,MATCH($D34,ListeA,0)+1),3),\"\")))))","v":""},{"$f":"IF(LEFT($D34,3)=\"396\",\"\",IF(LEFT($D34,3)=\"788\",\"\",IF(LEFT($D34,3)=\"096\",\"\",IF(LEFT($D34,3)=\"796\",\"\",IF(LEN($D34)>5,LEFT(OFFSET(BDD!$A$2,5,MATCH($D34,ListeA,0)+1),3),\"\")))))","v":""},{"$f":"IF(LEFT($D34,3)=\"396\",\"\",IF(LEFT($D34,3)=\"788\",\"\",IF(LEFT($D34,3)=\"096\",\"\",IF(LEFT($D34,3)=\"796\",\"\",IF(LEN($D34)>5,LEFT(OFFSET(BDD!$A$2,6,MATCH($D34,ListeA,0)+1),3),\"\")))))","v":""},{"$f":"IF(LEFT($D34,3)=\"396\",\"\",IF(LEFT($D34,3)=\"788\",\"\",IF(LEFT($D34,3)=\"096\",\"\",IF(LEFT($D34,3)=\"796\",\"\",IF(LEN($D34)>5,LEFT(OFFSET(BDD!$A$2,7,MATCH($D34,ListeA,0)+1),3),\"\")))))","v":""},{"$f":"IF(LEFT($D34,3)=\"396\",\"\",IF(LEFT($D34,3)=\"788\",\"\",IF(LEFT($D34,3)=\"096\",\"\",IF(LEFT($D34,3)=\"796\",\"\",IF(LEN($D34)>5,LEFT(OFFSET(BDD!$A$2,8,MATCH($D34,ListeA,0)+1),3),\"\")))))","v":""}]
[]
[]
[null,null,null,{"$f":"IF(LEFT($D37,3)=\"396\",396,IF(LEFT($D37,3)=\"096\",\"096\",IF(LEFT($D37,3)=\"788\",788,IF(LEFT($D37,3)=\"796\",796,IF(LEN($D37)>5,LEFT(OFFSET(BDD!$A$2,0,MATCH($D37,ListeA,0)+1),3),\"\")))))","v":""},{"$f":"IF(LEFT($D37,3)=\"396\",788,IF(LEFT($D37,3)=\"096\",796,IF(LEFT($D37,3)=\"788\",\"\",IF(LEFT($D37,3)=\"796\",\"\",IF(LEN($D37)>5,LEFT(OFFSET(BDD!$A$2,1,MATCH($D37,ListeA,0)+1),3),\"\")))))","v":""},{"$f":"IF(LEFT($D37,3)=\"396\",\"\",IF(LEFT($D37,3)=\"788\",\"\",IF(LEFT($D37,3)=\"096\",\"\",IF(LEFT($D37,3)=\"796\",\"\",IF(LEN($D37)>5,LEFT(OFFSET(BDD!$A$2,2,MATCH($D37,ListeA,0)+1),3),\"\")))))","v":""},{"$f":"IF(LEFT($D37,3)=\"396\",\"\",IF(LEFT($D37,3)=\"788\",\"\",IF(LEFT($D37,3)=\"096\",\"\",IF(LEFT($D37,3)=\"796\",\"\",IF(LEN($D37)>5,LEFT(OFFSET(BDD!$A$2,3,MATCH($D37,ListeA,0)+1),3),\"\")))))","v":""},{"$f":"IF(LEFT($D37,3)=\"396\",\"\",IF(LEFT($D37,3)=\"788\",\"\",IF(LEFT($D37,3)=\"096\",\"\",IF(LEFT($D37,3)=\"796\",\"\",IF(LEN($D37)>5,LEFT(OFFSET(BDD!$A$2,4,MATCH($D37,ListeA,0)+1),3),\"\")))))","v":""},{"$f":"IF(LEFT($D37,3)=\"396\",\"\",IF(LEFT($D37,3)=\"788\",\"\",IF(LEFT($D37,3)=\"096\",\"\",IF(LEFT($D37,3)=\"796\",\"\",IF(LEN($D37)>5,LEFT(OFFSET(BDD!$A$2,5,MATCH($D37,ListeA,0)+1),3),\"\")))))","v":""},{"$f":"IF(LEFT($D37,3)=\"396\",\"\",IF(LEFT($D37,3)=\"788\",\"\",IF(LEFT($D37,3)=\"096\",\"\",IF(LEFT($D37,3)=\"796\",\"\",IF(LEN($D37)>5,LEFT(OFFSET(BDD!$A$2,6,MATCH($D37,ListeA,0)+1),3),\"\")))))","v":""},{"$f":"IF(LEFT($D37,3)=\"396\",\"\",IF(LEFT($D37,3)=\"788\",\"\",IF(LEFT($D37,3)=\"096\",\"\",IF(LEFT($D37,3)=\"796\",\"\",IF(LEN($D37)>5,LEFT(OFFSET(BDD!$A$2,7,MATCH($D37,ListeA,0)+1),3),\"\")))))","v":""},{"$f":"IF(LEFT($D37,3)=\"396\",\"\",IF(LEFT($D37,3)=\"788\",\"\",IF(LEFT($D37,3)=\"096\",\"\",IF(LEFT($D37,3)=\"796\",\"\",IF(LEN($D37)>5,LEFT(OFFSET(BDD!$A$2,8,MATCH($D37,ListeA,0)+1),3),\"\")))))","v":""}]
[]
[]
[null,null,null,{"$f":"IF(LEFT($D40,3)=\"396\",396,IF(LEFT($D40,3)=\"096\",\"096\",IF(LEFT($D40,3)=\"788\",788,IF(LEFT($D40,3)=\"796\",796,IF(LEN($D40)>5,LEFT(OFFSET(BDD!$A$2,0,MATCH($D40,ListeA,0)+1),3),\"\")))))","v":""},{"$f":"IF(LEFT($D40,3)=\"396\",788,IF(LEFT($D40,3)=\"096\",796,IF(LEFT($D40,3)=\"788\",\"\",IF(LEFT($D40,3)=\"796\",\"\",IF(LEN($D40)>5,LEFT(OFFSET(BDD!$A$2,1,MATCH($D40,ListeA,0)+1),3),\"\")))))","v":""},{"$f":"IF(LEFT($D40,3)=\"396\",\"\",IF(LEFT($D40,3)=\"788\",\"\",IF(LEFT($D40,3)=\"096\",\"\",IF(LEFT($D40,3)=\"796\",\"\",IF(LEN($D40)>5,LEFT(OFFSET(BDD!$A$2,2,MATCH($D40,ListeA,0)+1),3),\"\")))))","v":""},{"$f":"IF(LEFT($D40,3)=\"396\",\"\",IF(LEFT($D40,3)=\"788\",\"\",IF(LEFT($D40,3)=\"096\",\"\",IF(LEFT($D40,3)=\"796\",\"\",IF(LEN($D40)>5,LEFT(OFFSET(BDD!$A$2,3,MATCH($D40,ListeA,0)+1),3),\"\")))))","v":""},{"$f":"IF(LEFT($D40,3)=\"396\",\"\",IF(LEFT($D40,3)=\"788\",\"\",IF(LEFT($D40,3)=\"096\",\"\",IF(LEFT($D40,3)=\"796\",\"\",IF(LEN($D40)>5,LEFT(OFFSET(BDD!$A$2,4,MATCH($D40,ListeA,0)+1),3),\"\")))))","v":""},{"$f":"IF(LEFT($D40,3)=\"396\",\"\",IF(LEFT($D40,3)=\"788\",\"\",IF(LEFT($D40,3)=\"096\",\"\",IF(LEFT($D40,3)=\"796\",\"\",IF(LEN($D40)>5,LEFT(OFFSET(BDD!$A$2,5,MATCH($D40,ListeA,0)+1),3),\"\")))))","v":""},{"$f":"IF(LEFT($D40,3)=\"396\",\"\",IF(LEFT($D40,3)=\"788\",\"\",IF(LEFT($D40,3)=\"096\",\"\",IF(LEFT($D40,3)=\"796\",\"\",IF(LEN($D40)>5,LEFT(OFFSET(BDD!$A$2,6,MATCH($D40,ListeA,0)+1),3),\"\")))))","v":""},{"$f":"IF(LEFT($D40,3)=\"396\",\"\",IF(LEFT($D40,3)=\"788\",\"\",IF(LEFT($D40,3)=\"096\",\"\",IF(LEFT($D40,3)=\"796\",\"\",IF(LEN($D40)>5,LEFT(OFFSET(BDD!$A$2,7,MATCH($D40,ListeA,0)+1),3),\"\")))))","v":""},{"$f":"IF(LEFT($D40,3)=\"396\",\"\",IF(LEFT($D40,3)=\"788\",\"\",IF(LEFT($D40,3)=\"096\",\"\",IF(LEFT($D40,3)=\"796\",\"\",IF(LEN($D40)>5,LEFT(OFFSET(BDD!$A$2,8,MATCH($D40,ListeA,0)+1),3),\"\")))))","v":""}]
[]
[]
[null,null,null,{"$f":"IF(LEFT($D43,3)=\"396\",396,IF(LEFT($D43,3)=\"096\",\"096\",IF(LEFT($D43,3)=\"788\",788,IF(LEFT($D43,3)=\"796\",796,IF(LEN($D43)>5,LEFT(OFFSET(BDD!$A$2,0,MATCH($D43,ListeA,0)+1),3),\"\")))))","v":""},{"$f":"IF(LEFT($D43,3)=\"396\",788,IF(LEFT($D43,3)=\"096\",796,IF(LEFT($D43,3)=\"788\",\"\",IF(LEFT($D43,3)=\"796\",\"\",IF(LEN($D43)>5,LEFT(OFFSET(BDD!$A$2,1,MATCH($D43,ListeA,0)+1),3),\"\")))))","v":""},{"$f":"IF(LEFT($D43,3)=\"396\",\"\",IF(LEFT($D43,3)=\"788\",\"\",IF(LEFT($D43,3)=\"096\",\"\",IF(LEFT($D43,3)=\"796\",\"\",IF(LEN($D43)>5,LEFT(OFFSET(BDD!$A$2,2,MATCH($D43,ListeA,0)+1),3),\"\")))))","v":""},{"$f":"IF(LEFT($D43,3)=\"396\",\"\",IF(LEFT($D43,3)=\"788\",\"\",IF(LEFT($D43,3)=\"096\",\"\",IF(LEFT($D43,3)=\"796\",\"\",IF(LEN($D43)>5,LEFT(OFFSET(BDD!$A$2,3,MATCH($D43,ListeA,0)+1),3),\"\")))))","v":""},{"$f":"IF(LEFT($D43,3)=\"396\",\"\",IF(LEFT($D43,3)=\"788\",\"\",IF(LEFT($D43,3)=\"096\",\"\",IF(LEFT($D43,3)=\"796\",\"\",IF(LEN($D43)>5,LEFT(OFFSET(BDD!$A$2,4,MATCH($D43,ListeA,0)+1),3),\"\")))))","v":""},{"$f":"IF(LEFT($D43,3)=\"396\",\"\",IF(LEFT($D43,3)=\"788\",\"\",IF(LEFT($D43,3)=\"096\",\"\",IF(LEFT($D43,3)=\"796\",\"\",IF(LEN($D43)>5,LEFT(OFFSET(BDD!$A$2,5,MATCH($D43,ListeA,0)+1),3),\"\")))))","v":""},{"$f":"IF(LEFT($D43,3)=\"396\",\"\",IF(LEFT($D43,3)=\"788\",\"\",IF(LEFT($D43,3)=\"096\",\"\",IF(LEFT($D43,3)=\"796\",\"\",IF(LEN($D43)>5,LEFT(OFFSET(BDD!$A$2,6,MATCH($D43,ListeA,0)+1),3),\"\")))))","v":""},{"$f":"IF(LEFT($D43,3)=\"396\",\"\",IF(LEFT($D43,3)=\"788\",\"\",IF(LEFT($D43,3)=\"096\",\"\",IF(LEFT($D43,3)=\"796\",\"\",IF(LEN($D43)>5,LEFT(OFFSET(BDD!$A$2,7,MATCH($D43,ListeA,0)+1),3),\"\")))))","v":""},{"$f":"IF(LEFT($D43,3)=\"396\",\"\",IF(LEFT($D43,3)=\"788\",\"\",IF(LEFT($D43,3)=\"096\",\"\",IF(LEFT($D43,3)=\"796\",\"\",IF(LEN($D43)>5,LEFT(OFFSET(BDD!$A$2,8,MATCH($D43,ListeA,0)+1),3),\"\")))))","v":""}]
[]
[]
[null,null,null,{"$f":"IF(LEFT($D46,3)=\"396\",396,IF(LEFT($D46,3)=\"096\",\"096\",IF(LEFT($D46,3)=\"788\",788,IF(LEFT($D46,3)=\"796\",796,IF(LEN($D46)>5,LEFT(OFFSET(BDD!$A$2,0,MATCH($D46,ListeA,0)+1),3),\"\")))))","v":""},{"$f":"IF(LEFT($D46,3)=\"396\",788,IF(LEFT($D46,3)=\"096\",796,IF(LEFT($D46,3)=\"788\",\"\",IF(LEFT($D46,3)=\"796\",\"\",IF(LEN($D46)>5,LEFT(OFFSET(BDD!$A$2,1,MATCH($D46,ListeA,0)+1),3),\"\")))))","v":""},{"$f":"IF(LEFT($D46,3)=\"396\",\"\",IF(LEFT($D46,3)=\"788\",\"\",IF(LEFT($D46,3)=\"096\",\"\",IF(LEFT($D46,3)=\"796\",\"\",IF(LEN($D46)>5,LEFT(OFFSET(BDD!$A$2,2,MATCH($D46,ListeA,0)+1),3),\"\")))))","v":""},{"$f":"IF(LEFT($D46,3)=\"396\",\"\",IF(LEFT($D46,3)=\"788\",\"\",IF(LEFT($D46,3)=\"096\",\"\",IF(LEFT($D46,3)=\"796\",\"\",IF(LEN($D46)>5,LEFT(OFFSET(BDD!$A$2,3,MATCH($D46,ListeA,0)+1),3),\"\")))))","v":""},{"$f":"IF(LEFT($D46,3)=\"396\",\"\",IF(LEFT($D46,3)=\"788\",\"\",IF(LEFT($D46,3)=\"096\",\"\",IF(LEFT($D46,3)=\"796\",\"\",IF(LEN($D46)>5,LEFT(OFFSET(BDD!$A$2,4,MATCH($D46,ListeA,0)+1),3),\"\")))))","v":""},{"$f":"IF(LEFT($D46,3)=\"396\",\"\",IF(LEFT($D46,3)=\"788\",\"\",IF(LEFT($D46,3)=\"096\",\"\",IF(LEFT($D46,3)=\"796\",\"\",IF(LEN($D46)>5,LEFT(OFFSET(BDD!$A$2,5,MATCH($D46,ListeA,0)+1),3),\"\")))))","v":""},{"$f":"IF(LEFT($D46,3)=\"396\",\"\",IF(LEFT($D46,3)=\"788\",\"\",IF(LEFT($D46,3)=\"096\",\"\",IF(LEFT($D46,3)=\"796\",\"\",IF(LEN($D46)>5,LEFT(OFFSET(BDD!$A$2,6,MATCH($D46,ListeA,0)+1),3),\"\")))))","v":""},{"$f":"IF(LEFT($D46,3)=\"396\",\"\",IF(LEFT($D46,3)=\"788\",\"\",IF(LEFT($D46,3)=\"096\",\"\",IF(LEFT($D46,3)=\"796\",\"\",IF(LEN($D46)>5,LEFT(OFFSET(BDD!$A$2,7,MATCH($D46,ListeA,0)+1),3),\"\")))))","v":""},{"$f":"IF(LEFT($D46,3)=\"396\",\"\",IF(LEFT($D46,3)=\"788\",\"\",IF(LEFT($D46,3)=\"096\",\"\",IF(LEFT($D46,3)=\"796\",\"\",IF(LEN($D46)>5,LEFT(OFFSET(BDD!$A$2,8,MATCH($D46,ListeA,0)+1),3),\"\")))))","v":""}]
[]
[]
[null,null,null,{"$f":"IF(LEFT($D49,3)=\"396\",396,IF(LEFT($D49,3)=\"096\",\"096\",IF(LEFT($D49,3)=\"788\",788,IF(LEFT($D49,3)=\"796\",796,IF(LEN($D49)>5,LEFT(OFFSET(BDD!$A$2,0,MATCH($D49,ListeA,0)+1),3),\"\")))))","v":""},{"$f":"IF(LEFT($D49,3)=\"396\",788,IF(LEFT($D49,3)=\"096\",796,IF(LEFT($D49,3)=\"788\",\"\",IF(LEFT($D49,3)=\"796\",\"\",IF(LEN($D49)>5,LEFT(OFFSET(BDD!$A$2,1,MATCH($D49,ListeA,0)+1),3),\"\")))))","v":""},{"$f":"IF(LEFT($D49,3)=\"396\",\"\",IF(LEFT($D49,3)=\"788\",\"\",IF(LEFT($D49,3)=\"096\",\"\",IF(LEFT($D49,3)=\"796\",\"\",IF(LEN($D49)>5,LEFT(OFFSET(BDD!$A$2,2,MATCH($D49,ListeA,0)+1),3),\"\")))))","v":""},{"$f":"IF(LEFT($D49,3)=\"396\",\"\",IF(LEFT($D49,3)=\"788\",\"\",IF(LEFT($D49,3)=\"096\",\"\",IF(LEFT($D49,3)=\"796\",\"\",IF(LEN($D49)>5,LEFT(OFFSET(BDD!$A$2,3,MATCH($D49,ListeA,0)+1),3),\"\")))))","v":""},{"$f":"IF(LEFT($D49,3)=\"396\",\"\",IF(LEFT($D49,3)=\"788\",\"\",IF(LEFT($D49,3)=\"096\",\"\",IF(LEFT($D49,3)=\"796\",\"\",IF(LEN($D49)>5,LEFT(OFFSET(BDD!$A$2,4,MATCH($D49,ListeA,0)+1),3),\"\")))))","v":""},{"$f":"IF(LEFT($D49,3)=\"396\",\"\",IF(LEFT($D49,3)=\"788\",\"\",IF(LEFT($D49,3)=\"096\",\"\",IF(LEFT($D49,3)=\"796\",\"\",IF(LEN($D49)>5,LEFT(OFFSET(BDD!$A$2,5,MATCH($D49,ListeA,0)+1),3),\"\")))))","v":""},{"$f":"IF(LEFT($D49,3)=\"396\",\"\",IF(LEFT($D49,3)=\"788\",\"\",IF(LEFT($D49,3)=\"096\",\"\",IF(LEFT($D49,3)=\"796\",\"\",IF(LEN($D49)>5,LEFT(OFFSET(BDD!$A$2,6,MATCH($D49,ListeA,0)+1),3),\"\")))))","v":""},{"$f":"IF(LEFT($D49,3)=\"396\",\"\",IF(LEFT($D49,3)=\"788\",\"\",IF(LEFT($D49,3)=\"096\",\"\",IF(LEFT($D49,3)=\"796\",\"\",IF(LEN($D49)>5,LEFT(OFFSET(BDD!$A$2,7,MATCH($D49,ListeA,0)+1),3),\"\")))))","v":""},{"$f":"IF(LEFT($D49,3)=\"396\",\"\",IF(LEFT($D49,3)=\"788\",\"\",IF(LEFT($D49,3)=\"096\",\"\",IF(LEFT($D49,3)=\"796\",\"\",IF(LEN($D49)>5,LEFT(OFFSET(BDD!$A$2,8,MATCH($D49,ListeA,0)+1),3),\"\")))))","v":""}]
[]
[]
[null,null,null,{"$f":"IF(LEFT($D52,3)=\"396\",396,IF(LEFT($D52,3)=\"096\",\"096\",IF(LEFT($D52,3)=\"788\",788,IF(LEFT($D52,3)=\"796\",796,IF(LEN($D52)>5,LEFT(OFFSET(BDD!$A$2,0,MATCH($D52,ListeA,0)+1),3),\"\")))))","v":""},{"$f":"IF(LEFT($D52,3)=\"396\",788,IF(LEFT($D52,3)=\"096\",796,IF(LEFT($D52,3)=\"788\",\"\",IF(LEFT($D52,3)=\"796\",\"\",IF(LEN($D52)>5,LEFT(OFFSET(BDD!$A$2,1,MATCH($D52,ListeA,0)+1),3),\"\")))))","v":""},{"$f":"IF(LEFT($D52,3)=\"396\",\"\",IF(LEFT($D52,3)=\"788\",\"\",IF(LEFT($D52,3)=\"096\",\"\",IF(LEFT($D52,3)=\"796\",\"\",IF(LEN($D52)>5,LEFT(OFFSET(BDD!$A$2,2,MATCH($D52,ListeA,0)+1),3),\"\")))))","v":""},{"$f":"IF(LEFT($D52,3)=\"396\",\"\",IF(LEFT($D52,3)=\"788\",\"\",IF(LEFT($D52,3)=\"096\",\"\",IF(LEFT($D52,3)=\"796\",\"\",IF(LEN($D52)>5,LEFT(OFFSET(BDD!$A$2,3,MATCH($D52,ListeA,0)+1),3),\"\")))))","v":""},{"$f":"IF(LEFT($D52,3)=\"396\",\"\",IF(LEFT($D52,3)=\"788\",\"\",IF(LEFT($D52,3)=\"096\",\"\",IF(LEFT($D52,3)=\"796\",\"\",IF(LEN($D52)>5,LEFT(OFFSET(BDD!$A$2,4,MATCH($D52,ListeA,0)+1),3),\"\")))))","v":""},{"$f":"IF(LEFT($D52,3)=\"396\",\"\",IF(LEFT($D52,3)=\"788\",\"\",IF(LEFT($D52,3)=\"096\",\"\",IF(LEFT($D52,3)=\"796\",\"\",IF(LEN($D52)>5,LEFT(OFFSET(BDD!$A$2,5,MATCH($D52,ListeA,0)+1),3),\"\")))))","v":""},{"$f":"IF(LEFT($D52,3)=\"396\",\"\",IF(LEFT($D52,3)=\"788\",\"\",IF(LEFT($D52,3)=\"096\",\"\",IF(LEFT($D52,3)=\"796\",\"\",IF(LEN($D52)>5,LEFT(OFFSET(BDD!$A$2,6,MATCH($D52,ListeA,0)+1),3),\"\")))))","v":""},{"$f":"IF(LEFT($D52,3)=\"396\",\"\",IF(LEFT($D52,3)=\"788\",\"\",IF(LEFT($D52,3)=\"096\",\"\",IF(LEFT($D52,3)=\"796\",\"\",IF(LEN($D52)>5,LEFT(OFFSET(BDD!$A$2,7,MATCH($D52,ListeA,0)+1),3),\"\")))))","v":""},{"$f":"IF(LEFT($D52,3)=\"396\",\"\",IF(LEFT($D52,3)=\"788\",\"\",IF(LEFT($D52,3)=\"096\",\"\",IF(LEFT($D52,3)=\"796\",\"\",IF(LEN($D52)>5,LEFT(OFFSET(BDD!$A$2,8,MATCH($D52,ListeA,0)+1),3),\"\")))))","v":""}]
[]
[]
[null,null,null,{"$f":"IF(LEFT($D55,3)=\"396\",396,IF(LEFT($D55,3)=\"096\",\"096\",IF(LEFT($D55,3)=\"788\",788,IF(LEFT($D55,3)=\"796\",796,IF(LEN($D55)>5,LEFT(OFFSET(BDD!$A$2,0,MATCH($D55,ListeA,0)+1),3),\"\")))))","v":""},{"$f":"IF(LEFT($D55,3)=\"396\",788,IF(LEFT($D55,3)=\"096\",796,IF(LEFT($D55,3)=\"788\",\"\",IF(LEFT($D55,3)=\"796\",\"\",IF(LEN($D55)>5,LEFT(OFFSET(BDD!$A$2,1,MATCH($D55,ListeA,0)+1),3),\"\")))))","v":""},{"$f":"IF(LEFT($D55,3)=\"396\",\"\",IF(LEFT($D55,3)=\"788\",\"\",IF(LEFT($D55,3)=\"096\",\"\",IF(LEFT($D55,3)=\"796\",\"\",IF(LEN($D55)>5,LEFT(OFFSET(BDD!$A$2,2,MATCH($D55,ListeA,0)+1),3),\"\")))))","v":""},{"$f":"IF(LEFT($D55,3)=\"396\",\"\",IF(LEFT($D55,3)=\"788\",\"\",IF(LEFT($D55,3)=\"096\",\"\",IF(LEFT($D55,3)=\"796\",\"\",IF(LEN($D55)>5,LEFT(OFFSET(BDD!$A$2,3,MATCH($D55,ListeA,0)+1),3),\"\")))))","v":""},{"$f":"IF(LEFT($D55,3)=\"396\",\"\",IF(LEFT($D55,3)=\"788\",\"\",IF(LEFT($D55,3)=\"096\",\"\",IF(LEFT($D55,3)=\"796\",\"\",IF(LEN($D55)>5,LEFT(OFFSET(BDD!$A$2,4,MATCH($D55,ListeA,0)+1),3),\"\")))))","v":""},{"$f":"IF(LEFT($D55,3)=\"396\",\"\",IF(LEFT($D55,3)=\"788\",\"\",IF(LEFT($D55,3)=\"096\",\"\",IF(LEFT($D55,3)=\"796\",\"\",IF(LEN($D55)>5,LEFT(OFFSET(BDD!$A$2,5,MATCH($D55,ListeA,0)+1),3),\"\")))))","v":""},{"$f":"IF(LEFT($D55,3)=\"396\",\"\",IF(LEFT($D55,3)=\"788\",\"\",IF(LEFT($D55,3)=\"096\",\"\",IF(LEFT($D55,3)=\"796\",\"\",IF(LEN($D55)>5,LEFT(OFFSET(BDD!$A$2,6,MATCH($D55,ListeA,0)+1),3),\"\")))))","v":""},{"$f":"IF(LEFT($D55,3)=\"396\",\"\",IF(LEFT($D55,3)=\"788\",\"\",IF(LEFT($D55,3)=\"096\",\"\",IF(LEFT($D55,3)=\"796\",\"\",IF(LEN($D55)>5,LEFT(OFFSET(BDD!$A$2,7,MATCH($D55,ListeA,0)+1),3),\"\")))))","v":""},{"$f":"IF(LEFT($D55,3)=\"396\",\"\",IF(LEFT($D55,3)=\"788\",\"\",IF(LEFT($D55,3)=\"096\",\"\",IF(LEFT($D55,3)=\"796\",\"\",IF(LEN($D55)>5,LEFT(OFFSET(BDD!$A$2,8,MATCH($D55,ListeA,0)+1),3),\"\")))))","v":""}]
[]
[]
["Identifiant(s) à :"]
[]
["Précisez pour quels centres de responsabilité (CR) :"]
[]
[]
[]
[]
[]
[]
["Type de droit :",null,null,"Interrogation et saisie"]
[]
["Choix des privilèges d'interrogation :",null,null,null,null,"Voir liste des privilèges d'interrogation"]
[]
["Choix des privilèges de saisie :",null,null,null,null,"Voir liste des privilèges saisie"]
[]
["Colis Micro :",null,null,"Non"]
[]
[null,"Commentaire : ",null,"\n"]
[]
[]
[{"$f":"\"Coordonnées de la personne qui remplit le formulaire \"&IF(D23=\"DGSR\",\"(obligatoires)\",\"(facultatives)\")","v":"Coordonnées de la personne qui remplit le formulaire (facultatives)"}]
[]
["Numéro de téléphone :"]
["Nom :"]
["Date de signature :"]
[]
["Autorisation du gestionnaire (obligatoire)"]
[]
["  Je m’engage à faire respecter  les règles suivantes pour le personnel sous ma responsabilité :"]
["        → Vérification et pointage des transactions par une autre personne que celle qui a fait la saisie;"]
["        → Identification de la date de saisie et de traitement des transactions enregistrées au SAGIP."]
[]
[null,"Numéro de téléphone :"]
[null,"Nom :"]
[null,"Date de signature :"]
[]
[{"$f":"\"Approbation de la personne autorisée à votre DRH \"&IF(OR(D23=\"DGSR\",D23=\"DGSOA\"),\"(facultative)\", \"(obligatoire)\")","v":"Approbation de la personne autorisée à votre DRH (obligatoire)"}]
[null,"Numéro de téléphone :"]
[null,"Nom :"]
[null,"Date de signature :"]
[]
["Envoi du formulaire par courriel à l'équipe responsable de la sécurité des identifiants SAGIP"]
[{"$f":"IF(D23=\"DGSR\",\"Le formulaire doit être envoyé par le gestionnaire.\",\"Le formulaire doit être envoyé par la personne autorisée à votre DRH. Le gestionnaire doit toujours être ajouté en CC.\")","v":"Le formulaire doit être envoyé par la personne autorisée à votre DRH. Le gestionnaire doit toujours être ajouté en CC."}]
[{"$f":"IF(D23=\"DGSR\",\"Si le formulaire ne peut être envoyé par le gestionnaire, vous devez l'ajouter en CC.\",\"Si la personne autorisée part en vacances ou en congé prolongé, elle se doit de nommer un intérim avant son départ.\")","v":"Si la personne autorisée part en vacances ou en congé prolongé, elle se doit de nommer un intérim avant son départ."}]
[{"$f":"IF(D23=\"DGSR\",\"\",\"Prendre note que vous devez l’ajouter en CC en plus du gestionnaire.\")","v":"Prendre note que vous devez l’ajouter en CC en plus du gestionnaire."}]
["Adresse courriel auquel le formulaire doit être envoyé :",null,null,null,null,null,{"$f":"DataChoix!B11","v":"identifiants.sagip.dgsr@mcn.gouv.qc.ca"}]
["Compte tenu des différentes étapes reliées au processus, le traitement d'une demande nécessite environs deux (2) semaines."]
["Signature du responsable de la sécurité des identifiants SAGIP à la DGSR"]
[]
[null,"Nom :"]
[null,"Date de signature :"]

{"sheet":"Liste Interrogation","index":3,"n_rows":32,"n_cols":2,"rows_kept":32,"cut":false,"hidden":false,"merged":[[0,0,1,0]]}
["Numéro Interrogation","Revenir au Formulaire"]
[null,"Double-cliquer sur le numéro d'interrogation pour le sélectionner (colonne A)"]
[1,"20B, 20C"]
[2,"Tous les modules d'interrogation"]
[3,"31, 32, 32A, 37, 51, 52, 54, 54A, 70, 72 et 76"]
[4,"Tous les modules d'interrogation sauf 40, 61, 71, 79, 80, 115, 116, 116A, 117, 118"]
[5,"31, 32, 32A"]
[6,"1,31, 32, 32A, 33, 37, 47, 48, 51, 51A, 52, 52A, 58, 70, 72, 76, 79, 80, 111, 112, 113, 116, 116A"]
[7,"52, 52A, 70"]
[8,"1, 29, 31, 32, 32A, 33, 35, 37, 47, 48, 49, 51, 52, 60, 70, 72, 76"]
[9,"31, 32, 32A, 47, 48, 49, 60, 72, 111"]
[10,"32, 32A, 60"]
[11,"47, 48, 49, 72"]
[12,"Tous les modules d'interrogation sauf 29, 40, 41, 42, 42A, 43, 44, 45, 46, 48, 49, 60, 61, 62, 72, 73, 74, 75, 80, 111, 112, 113, 114, 115, 116, 116A, 117, 118"]
[13,"Tous les modules d'interrogation sauf 40, 80"]
[14,"1, 3, 4, 15, 20, 20A, 21, 21A, 22, 22A, 23, 23A, 24A, 25A, 31, 32, 32A, 33, 37, 49, 51, 51A, 52, 52A, 53, 53A, 54, 54A, 55, 58, 62, 66, 67, 68, 69, 70, 72, 76, 79, 111, 112, 113, 114, 115, 118"]
[15,"33, 39, 46, 47, 48, 49, 56, 57, 72, 73, 74, 75, 111, 112, 113"]
[16,"47, 48, 49, 71, 72, 73, 75, 112, 113"]
[17,"32, 32A, 33, 37, 46, 47, 48, 49, 51, 51A, 52, 52A, 53, 53A, 55, 62, 65, 72, 79"]
[18,"31, 32, 32A, 51, 52, 70, 72, 76, 80"]
[19,"20, 20A, 20B, 20C, 21, 21A, 22, 22A, 23, 23A, 24A, 25A, 53, 53A"]
[20,"1, 15, 31, 32, 32A, 33, 35, 36, 37, 38, 39, 39A, 46, 47, 48, 49, 50, 51, 51A, 52, 52A, 55, 70, 72, 76, 111, 112, 113, 114"]
[21,"31, 51, 51A, 52, 52A, 70"]
[22,"31, 32, 32A, 72"]
[23,"31, 33, 49"]
[24,"1, 29, 31, 32, 32A, 33, 34, 35, 36, 37, 38, 42, 45, 47, 48, 49, 51, 51A, 52, 52A, 53, 53A, 54, 54A, 55, 56, 57, 60, 62, 65, 70, 72, 73, 76, 79, 112, 114"]
[25,"1, 3, 31, 32A, 33, 35, 36, 37, 38, 46, 53A, 55, 56, 57, 58, 59, 59A, 76, 79"]
[26,"31,45, 51, 51A, 52, 52A, 80"]
[27,"31, 32, 32A, 33, 37, 46, 47, 48, 49, 51, 51A, 52, 52A, 53, 53A, 55, 60, 62, 65, 72, 75, 79, 111, 112, 113"]
[28,80]
[29,"1, 31, 32, 32A, 33, 39, 39A, 46, 47, 48, 49, 51, 51A, 52, 52A, 56, 57, 60, 62, 70, 71, 72, 73, 74, 75, 111, 112, 113, 114"]
[99,"Aucun privilège d'interrogation"]

{"sheet":"Liste Saisie","index":4,"n_rows":42,"n_cols":2,"rows_kept":42,"cut":false,"hidden":false,"merged":[[0,0,1,0]]}
["Numéro Saisie","Revenir au Formulaire"]
[null,"Double-cliquer sur le numéro de saisie pour le sélectionner (colonne A)"]
[0,"Toutes les transactions SAGIP"]
[1,"H760 , H830, H910, H920"]
[2,"H800 , H830, H920"]
[3,"H830"]
[4,"Toutes les transactions SAGIP sauf: H020, H540"]
[5,"H760 , H920"]
[6,"H620 , H760, H800, H910, H920"]
[7,"H010 , H620, H760, H800, H830, H910, H920"]
[8,"H040 , H050, H830"]
[9,"H760 , H800, H910, H920"]
[10,"H050 , H760, H800, H830, H910, H920"]
[11,"H620 , H760, H800, H830, H910, H920"]
[12,"H760 , H800, H830, H910, H920"]
[13,"H010 , H040, H060, H620, H760, H800, H830, H910, H920"]
[14,"H040 , H060, H070"]
[15,"H010 , H050, H060, H070, H090, H120, H300, H320, H600, H660, H690, H750, H760, H800, H910, H920, H950"]
[16,"H580 , H660, H830"]
[17,"H050 , H060, H070, H830"]
[18,"H920"]
[19,"H580"]
[20,"H050 , H580, H750"]
[21,"H040 , H060, H830"]
[22,"H800 , H830, H910, H920"]
[23,"H010 , H050, H120, H200, H210, H580, H620, H750, H760, H800, H910, H920, H950"]
[24,"H010 , H050, H080, H090, H100, H120, H200, H210, H220, H620, H750, H760, H800, H910, H920"]
[25,"H040 , H060, H070, H760, H800, H830, H910, H920"]
[26,"H040 , H070, H080, H200, H210, H220, H580, H690, H810, H830, H910, H920"]
[27,"H040 , H830"]
[28,"H760 , H800, H910, H920, H950"]
[29,"H300 , H320, H760, H800, H910, H920, H950"]
[30,"H010 , H050, H060, H070, H080, H090, H100, H120, H200, H210, H220, H580, H620, H750, H760, H800, H830, H910, H920, H950"]
[31,"H300 , H620, H760, H800, H910, H920"]
[32,"H040 , H760, H800, H830, H910, H920"]
[33,"H040 , H050, H060, H070, H760, H800, H830, H910, H920"]
[34,"H010 , H050, H060, H070, H620, H750, H760, H800, H830, H910, H920, H950"]
[35,"H050 , H060, H300, H620, H760, H800, H830, H910, H920"]
[36,"H080 , H090, H100"]
[37,"H040 , H050, H830"]
[38,"H830 , H920"]
[99,"Aucune transaction SAGIP"]

{"sheet":"Liste Générale","index":5,"n_rows":7,"n_cols":6,"rows_kept":7,"cut":false,"hidden":true,"merged":[]}
["Statut utilisateur","Secteur","Type de secteur","Type de demande","Type de droit","Colis Micro"]
["Permanent","DGSR","Secteur des assurances                                                           ","Activation","Interrogation seulement","Oui"]
["Occasionnel","DRH","Secteur de la déclaration annuelle des régimes de retraite","Modification","Interrogation et saisie","Non"]
["Contractuel","DGSOA","Secteur de la retraite","Annulation"]
[null,"Autre (précisez)","Secteur de la rémunération"]
[null,null,"DOSOAQ"]
[null,null,"DOR "]

{"sheet":"Modifications","index":6,"n_rows":10,"n_cols":4,"rows_kept":10,"cut":false,"hidden":true,"merged":[]}
["Version","Date","Modif par:","Commentaire"]
["2024.1","2024-01-10","Antoine","- Modification du numéro de version\n- Modification du courriel pour le ministère 210"]
["2024.3","2024-08-09","Romain Jalbert","Enlevé le choix <Réactivation> \nde Type de demande"]
["2025.2","2025-04-22","Antoine Roger","- Ajout de 295 et supression de 517 et 549"]
["2025.3","2025-05-09","Antoine Roger","-Modification courriel MO 160"]
[]
[]
[]
[]
["Voir onglet « Mise à jour » …"]

{"sheet":"Mise à jour","index":7,"n_rows":8,"n_cols":4,"rows_kept":8,"cut":false,"hidden":false,"merged":[[1,0,2,0],[1,1,2,1],[1,2,2,2],[1,3,2,3]]}
["Version","Date","Modif par:","Commentaire"]
["3.38","2023-12-28","Antoine Roger","Transfert MFQ de la responsabilité de la gestion des accès SAGIP à la DOSOAQ.\nLes organisations ainsi visées sont celles-ci : \n\t210 - Ministère des Finances\n\t849 - Financement Québec \n\t874 - Fonds du financement regroupé"]
[]
["V2025.4","2025-08-04","Jasmin Audet","Ajout du ministère 418 Mobilité Infra Québec"]
["V2025.6","2025-09-08","Romain Jalbert","Permettre la date du jour pour la date de fin avec la validation de la date (voir code VBA)"]
["V2026.1","2025-12-19","Romain Jalbert","Changement de courriel pour CTQ-830 à rh@ctq.gouv.qc.ca "]
["V2026.2","2026-01-29","Romain Jalbert","Ajout MO # 416 (CBEDE)"]
["V2026.3","2026-02-04","Romain Jalbert","Ajout contenu DOR dans menu Service, s'affiche si c'est MCN le choix MO."]

{"sheet":"DOSOAQ","index":8,"n_rows":36,"n_cols":10,"rows_kept":36,"cut":false,"hidden":true,"merged":[[18,1,18,2],[18,3,18,4],[18,5,18,6],[18,7,18,8],[18,9,18,10],[19,1,19,2],[19,3,19,4],[19,5,19,6],[19,7,19,8],[19,9,19,10],[16,1,16,2],[16,3,16,4],[16,5,16,6],[16,7,16,8],[16,9,16,10],[17,1,17,2],[17,3,17,4],[17,5,17,6],[17,7,17,8],[17,9,17,10],[14,1,14,2],[14,3,14,4],[14,5,14,6],[14,7,14,8],[14,9,14,10],[15,1,15,2],[15,3,15,4],[15,5,15,6],[15,7,15,8],[15,9,15,10]]}
[]
["Numéro d'employé SAGIR:",{"$f":"IF(OR(Formulaire!D11=\"\",B4=\"549\"),\"\",Formulaire!D11)","v":""}]
["3 dernier numéro NAS (MO 549):",{"$f":"IF(OR(Formulaire!D11=\"\",B4<>\"549\"),\"\",Formulaire!D11)","v":""}]
["Ministère hors DGSR :",{"$f":"DataChoix!A6","v":""},{"$f":"DataChoix!B6","v":""},{"$f":"DataChoix!C6","v":""},{"$f":"DataChoix!D6","v":""},{"$f":"DataChoix!E6","v":""},{"$f":"DataChoix!F6","v":""},{"$f":"DataChoix!G6","v":""}]
[]
["Ministère géré par DGSR :",{"$f":"IF(Formulaire!D34=\"Tous\",\"Tous\",DataChoix!A20)","v":""},{"$f":"DataChoix!B20","v":""},{"$f":"DataChoix!C20","v":""},{"$f":"DataChoix!D20","v":""},{"$f":"DataChoix!E20","v":""},{"$f":"DataChoix!F20","v":""},{"$f":"DataChoix!G20","v":""}]
[null,{"$f":"DataChoix!A25","v":""},{"$f":"DataChoix!B25","v":""},{"$f":"DataChoix!C25","v":""},{"$f":"DataChoix!D25","v":""},{"$f":"DataChoix!E25","v":""},{"$f":"DataChoix!F25","v":""},{"$f":"DataChoix!G25","v":""}]
[null,{"$f":"DataChoix!A30","v":""},{"$f":"DataChoix!B30","v":""},{"$f":"DataChoix!C30","v":""},{"$f":"DataChoix!D30","v":""},{"$f":"DataChoix!E30","v":""},{"$f":"DataChoix!F30","v":""},{"$f":"DataChoix!G30","v":""}]
[null,{"$f":"DataChoix!A35","v":""},{"$f":"DataChoix!B35","v":""},{"$f":"DataChoix!C35","v":""},{"$f":"DataChoix!D35","v":""},{"$f":"DataChoix!E35","v":""},{"$f":"DataChoix!F35","v":""},{"$f":"DataChoix!G35","v":""}]
[null,{"$f":"DataChoix!A40","v":""},{"$f":"DataChoix!B40","v":""},{"$f":"DataChoix!C40","v":""},{"$f":"DataChoix!D40","v":""},{"$f":"DataChoix!E40","v":""},{"$f":"DataChoix!F40","v":""},{"$f":"DataChoix!G40","v":""}]
[null,{"$f":"DataChoix!A45","v":""},{"$f":"DataChoix!B45","v":""},{"$f":"DataChoix!C45","v":""},{"$f":"DataChoix!D45","v":""},{"$f":"DataChoix!E45","v":""},{"$f":"DataChoix!F45","v":""},{"$f":"DataChoix!G45","v":""}]
[null,{"$f":"DataChoix!A50","v":""},{"$f":"DataChoix!B50","v":""},{"$f":"DataChoix!C50","v":""},{"$f":"DataChoix!D50","v":""},{"$f":"DataChoix!E50","v":""},{"$f":"DataChoix!F50","v":""},{"$f":"DataChoix!G50","v":""}]
[null,{"$f":"DataChoix!A55","v":""},{"$f":"DataChoix!B55","v":""},{"$f":"DataChoix!C55","v":""},{"$f":"DataChoix!D55","v":""},{"$f":"DataChoix!E55","v":""},{"$f":"DataChoix!F55","v":""},{"$f":"DataChoix!G55","v":""}]
[]
["Pour centre opération:",{"$f":"IF(Formulaire!D61=\"\",\"\",Formulaire!D61)","v":""},null,{"$f":"IF(Formulaire!F61=\"\",\"\",Formulaire!F61)","v":""},null,{"$f":"IF(Formulaire!H61=\"\",\"\",Formulaire!H61)","v":""},null,{"$f":"IF(Formulaire!J61=\"\",\"\",Formulaire!J61)","v":""},null,{"$f":"IF(Formulaire!L61=\"\",\"\",Formulaire!L61)","v":""}]
["(CR qui doit avoir accès)",{"$f":"IF(Formulaire!D62=\"\",\"\",Formulaire!D62)","v":""},null,{"$f":"IF(Formulaire!F62=\"\",\"\",Formulaire!F62)","v":""},null,{"$f":"IF(Formulaire!H62=\"\",\"\",Formulaire!H62)","v":""},null,{"$f":"IF(Formulaire!J62=\"\",\"\",Formulaire!J62)","v":""},null,{"$f":"IF(Formulaire!L62=\"\",\"\",Formulaire!L62)","v":""}]
[null,{"$f":"IF(Formulaire!D63=\"\",\"\",Formulaire!D63)","v":""},null,{"$f":"IF(Formulaire!F63=\"\",\"\",Formulaire!F63)","v":""},null,{"$f":"IF(Formulaire!H63=\"\",\"\",Formulaire!H63)","v":""},null,{"$f":"IF(Formulaire!J63=\"\",\"\",Formulaire!J63)","v":""},null,{"$f":"IF(Formulaire!L63=\"\",\"\",Formulaire!L63)","v":""}]
[null,{"$f":"IF(Formulaire!D64=\"\",\"\",Formulaire!D64)","v":""},null,{"$f":"IF(Formulaire!F64=\"\",\"\",Formulaire!F64)","v":""},null,{"$f":"IF(Formulaire!H64=\"\",\"\",Formulaire!H64)","v":""},null,{"$f":"IF(Formulaire!J64=\"\",\"\",Formulaire!J64)","v":""},null,{"$f":"IF(Formulaire!L64=\"\",\"\",Formulaire!L64)","v":""}]
[null,{"$f":"IF(Formulaire!D65=\"\",\"\",Formulaire!D65)","v":""},null,{"$f":"IF(Formulaire!F65=\"\",\"\",Formulaire!F65)","v":""},null,{"$f":"IF(Formulaire!H65=\"\",\"\",Formulaire!H65)","v":""},null,{"$f":"IF(Formulaire!J65=\"\",\"\",Formulaire!J65)","v":""},null,{"$f":"IF(Formulaire!L65=\"\",\"\",Formulaire!L65)","v":""}]
[null,{"$f":"IF(Formulaire!D66=\"\",\"\",Formulaire!D66)","v":""},null,{"$f":"IF(Formulaire!F66=\"\",\"\",Formulaire!F66)","v":""},null,{"$f":"IF(Formulaire!H66=\"\",\"\",Formulaire!H66)","v":""},null,{"$f":"IF(Formulaire!J66=\"\",\"\",Formulaire!J66)","v":""},null,{"$f":"IF(Formulaire!L66=\"\",\"\",Formulaire!L66)","v":""}]
[]
["Identifiants :",{"$f":"IF(Formulaire!D59=\"\",\"\",Formulaire!D59)","v":""},{"$f":"IF(Formulaire!E59=\"\",\"\",Formulaire!E59)","v":""},{"$f":"IF(Formulaire!F59=\"\",\"\",Formulaire!F59)","v":""},{"$f":"IF(Formulaire!G59=\"\",\"\",Formulaire!G59)","v":""},{"$f":"IF(Formulaire!H59=\"\",\"\",Formulaire!H59)","v":""},{"$f":"IF(Formulaire!I59=\"\",\"\",Formulaire!I59)","v":""},{"$f":"IF(Formulaire!J59=\"\",\"\",Formulaire!J59)","v":""},{"$f":"IF(Formulaire!K59=\"\",\"\",Formulaire!K59)","v":""}]
[]
["CR utilisateur :",{"$f":"Formulaire!D20","v":0}]
["Nom :",{"$f":"Formulaire!D8","v":0}]
["Prénom :",{"$f":"Formulaire!D9","v":0}]
["Adresse courriel :",{"$f":"Formulaire!D10","v":0}]
["Statut :",{"$f":"Formulaire!D13","v":"Permanent"}]
["Date de fin de contrat prévue :",{"$f":"Formulaire!D14","v":"N/A"}]
["Direction :",{"$f":"Formulaire!D16","v":"DGSR-DOR"}]
["Secteur :",{"$f":"Formulaire!D23","v":"DRH"}]
["Code interrogation :",{"$f":"IF(Formulaire!D70=\"\",\"\",Formulaire!D70)","v":""}]
["Code saisie :",{"$f":"IF(Formulaire!D72=\"\",\"\",Formulaire!D72)","v":""}]
["Colis-micro :",{"$f":"Formulaire!D74","v":"Non"}]
["Gestionnaire :",{"$f":"Formulaire!C92","v":0}]
["Commentaire :",{"$f":"IF(Formulaire!D76=\"\",\"\",Formulaire!D76)","v":"\n"}]

{"sheet":"BDD","index":9,"n_rows":60,"n_cols":63,"rows_kept":60,"cut":false,"hidden":true,"merged":[]}
["Tous","Nb Items",{"$f":"INDIRECT(\"A\"&COLUMN()-1)","v":"010 Ministère de la Culture et des Communications"},{"$f":"INDIRECT(\"A\"&COLUMN()-1)","v":"030 Ministère des Relations internationales et de la Francophonie"},"055 Ministère de l'Immigration, de la Francisation et de l'Intégration","060 Ministère de la Santé et des Services sociaux","065 Ministère de la Famille","075 Ministère du Travail","080 Ministère de l'Agriculture, des Pêcheries et de l'Alimentation","095 Ministère de la Sécurité publique","096 Ministère de la Cybersécurité et du Numérique","140 Ministère du Conseil exécutif",{"$f":"INDIRECT(\"A\"&COLUMN()-1)","v":"188 Tribunal administratif des marchés financiers"},{"$f":"INDIRECT(\"A\"&COLUMN()-1)","v":"210 Ministère des Finances"},"246 Directeur des poursuites criminelles et pénales","247 Commissaire au lobbyisme du Québec","295 Protecteur du citoyen","320 Société de l'assurance automobile du Québec","321 Fonds d'aide aux actions collectives","323 Institut de la statistique du Québec","328 Commission de protection du territoire agricole du Québec","344 Office de la protection du consommateur","367 Régie du bâtiment du Québec","374 Vérificateur général du Québec","386 Régie des alcools, des courses et des jeux","391 Commissaire à la Langue Française","392 Régie des marchés agricoles et alimentaires du Québec","395 Autorité des marchés publics","397 Centre d'acquisition gouvernementales",{"$f":"INDIRECT(\"A\"&COLUMN()-1)","v":"400 Ministère de la Justice"},"408 Commission d'accès à l'information du Québec","416 Commissaire au bien-être et aux droits des enfants","418 Mobilité Infra Québec","430 Commission de la fonction publique du Québec","450 Tribunal administratif du Québec","491 Ministère de la Langue française","505 Conseil de gestion de l'assurance parentale","538 Office des personnes handicapées du Québec","600 Ministère de l'Énergie et des Ressources naturelles","602 Institut nationale des mines","630 Directeur général des élections","660 Conseil du statut de la femme","700 Ministère du Travail, de l'Emploi et de la Solidarité sociale","703 Commission des normes, de l'équité, de la santé et de la sécurité du travail","710 Office québécois de la langue française","771 Fonds Accès Justice","773 Fonds des ressources informationnelles du secteur de la sss","787 Fonds de prévention et de recherche en matière de cannabis","796 Fonds de la Cybersécurité et du Numérique","801 Fonds d'aide à l'action communautaire autonome","813 Fonds Québécois d'initiatives sociales","815 Fonds de développement du marché du travail","816 Fonds de dév. et de reconnaissance des compétences de la m-o","817 Fonds d'information sur le territoire","826 Fonds des ressources naturelles","827 Fonds des technologies de l'information - MESS","849 Financement Québec","872 Fonds du BAVAC","874 Fonds du financement regroupé","878 Fonds des registres du ministère de la Justice","884 Programme relevant des ministres - Conseil exécutif",0,0]
["010 Ministère de la Culture et des Communications",{"$f":"COUNTA(OFFSET(C:C,,ROW()-2))-1","v":1},"010 Ministère de la Culture et des Communications","030 Ministère des Relations internationales et de la Francophonie","055 Ministère de l'Immigration, de la Francisation et de l'Intégration","060 Ministère de la Santé et des Services sociaux","065 Ministère de la Famille","075 Ministère du Travail","080 Ministère de l'Agriculture, des Pêcheries et de l'Alimentation","095 Ministère de la Sécurité publique","096 Ministère de la Cybersécurité et du Numérique","140 Ministère du Conseil exécutif","188 Tribunal administratif des marchés financiers","210 Ministère des Finances","246 Directeur des poursuites criminelles et pénales","247 Commissaire au lobbyisme du Québec","295 Protecteur du citoyen","320 Société de l'assurance automobile du Québec","321 Fonds d'aide aux actions collectives","323 Institut de la statistique du Québec","328 Commission de protection du territoire agricole du Québec","344 Office de la protection du consommateur","367 Régie du bâtiment du Québec","374 Vérificateur général du Québec","386 Régie des alcools, des courses et des jeux","391 Commissaire à la Langue Française","392 Régie des marchés agricoles et alimentaires du Québec","395 Autorité des marchés publics","397 Centre d'acquisition gouvernementales","400 Ministère de la Justice","408 Commission d'accès à l'information du Québec","416 Commissaire au bien-être et aux droits des enfants","418 Mobilité Infra Québec","430 Commission de la fonction publique du Québec","450 Tribunal administratif du Québec","491 Ministère de la Langue française","505 Conseil de gestion de l'assurance parentale","538 Office des personnes handicapées du Québec","600 Ministère de l'Énergie et des Ressources naturelles","602 Institut nationale des mines","630 Directeur général des élections",null,"700 Ministère du Travail, de l'Emploi et de la Solidarité sociale","703 Commission des normes, de l'équité, de la santé et de la sécurité du travail","710 Office québécois de la langue française","771 Fonds Accès Justice","773 Fonds des ressources informationnelles du secteur de la sss","787 Fonds de prévention et de recherche en matière de cannabis","Aucun","801 Fonds d'aide à l'action communautaire autonome","813 Fonds Québécois d'initiatives sociales","815 Fonds de développement du marché du travail","816 Fonds de dév. et de reconnaissance des compétences de la m-o","817 Fonds d'information sur le territoire","826 Fonds des ressources naturelles","827 Fonds des technologies de l'information - MESS","849 Financement Québec","872 Fonds du BAVAC","874 Fonds du financement regroupé","878 Fonds des registres du ministère de la Justice","884 Programme relevant des ministres - Conseil exécutif"]
["030 Ministère des Relations internationales et de la Francophonie",{"$f":"COUNTA(OFFSET(C:C,,ROW()-2))-1","v":1},null,null,null,"773 Fonds ress informationnelles secteur sss",null,null,"392 Régie des marchés agricoles et alimentaires du Québec","386 Régie des alcools, des courses et des jeux","050 Ministère des Affaires municipales et de l'Habitation","408 Commission d'accès à l'information du Québec",null,"849 Financement Québec",null,null,null,null,null,null,null,null,null,null,null,null,null,null,null,"246 Directeur des poursuites criminelles et pénales",null,null,null,null,null,null,null,"817 Fonds d'information sur le territoire",null,null,null,null,"075 Ministère du Travail",null,null,null,null,null,"050 Ministère des Affaires municipales et de l'Habitation"]
["055 Ministère de l'Immigration, de la Francisation et de l'Intégration",{"$f":"COUNTA(OFFSET(C:C,,ROW()-2))-1","v":1},null,null,null,"787 Fonds de prévention et de recherche en matière de cannabis",null,null,null,null,"064 Régie de l'assurance maladie du Québe","884 Programme relevant des ministres - Conseil exécutif",null,"874 Fonds du financement regroupé",null,null,null,null,null,null,null,null,null,null,null,null,null,null,null,"344 Office de la protection du consommateur",null,null,null,null,null,null,null,"826 Fonds des ressources naturelles",null,null,null,null,"491 Ministère de la Langue française",null,null,null,null,null,"064 Régie de l'assurance maladie du Québe"]
["060 Ministère de la Santé et des Services sociaux",{"$f":"COUNTA(OFFSET(C:C,,ROW()-2))-1","v":3},null,null,null,null,null,null,null,null,"067 Ministère de l’Enseignement supérieur",null,null,null,null,null,null,null,null,null,null,null,null,null,null,null,null,null,null,"771 Fonds Accès Justice",null,null,null,null,null,null,null,null,null,null,null,null,"505 Conseil de gestion de l'assurance parentale",null,null,null,null,null,"067 Ministère de l’Enseignement supérieur"]
["065 Ministère de la Famille",{"$f":"COUNTA(OFFSET(C:C,,ROW()-2))-1","v":1},null,null,null,null,null,null,null,null,"160 Secrétariat du Conseil du trésor",null,null,null,null,null,null,null,null,null,null,null,null,null,null,null,null,null,null,"872 Fonds du BAVAC",null,null,null,null,null,null,null,null,null,null,null,null,"801 Fonds d'aide à l'action communautaire autonome",null,null,null,null,null,"160 Secrétariat du Conseil du trésor"]
["075 Ministère du Travail",1,null,null,null,null,null,null,null,null,"240 Retraite Québec",null,null,null,null,null,null,null,null,null,null,null,null,null,null,null,null,null,null,"878 Fonds des registres du ministère de la Justice",null,null,null,null,null,null,null,null,null,null,null,null,"813 Fonds Québécois d'initiatives sociales",null,null,null,null,null,"240 Retraite Québec"]
["080 Ministère de l'Agriculture, des Pêcheries et de l'Alimentation",{"$f":"COUNTA(OFFSET(C:C,,ROW()-2))-1","v":2},null,null,null,null,null,null,null,null,"256 Bureau d'audiences publiques sur l'environnement",null,null,null,null,null,null,null,null,null,null,null,null,null,null,null,null,null,null,null,null,null,null,null,null,null,null,null,null,null,null,null,"815 Fonds de développement du marché du travail",null,null,null,null,null,"256 Bureau d'audiences publiques sur l'environnement"]
["095 Ministère de la Sécurité publique",2,null,null,null,null,null,null,null,null,"280 Ministère de l'Économie et de l'Innovation",null,null,null,null,null,null,null,null,null,null,null,null,null,null,null,null,null,null,null,null,null,null,null,null,null,null,null,null,null,null,null,"816 Fonds de dév. et de reconnaissance des compétences de la m-o",null,null,null,null,null,"280 Ministère de l'Économie et de l'Innovation"]
["096 Ministère de la Cybersécurité et du Numérique",20,null,null,null,null,null,null,null,null,"350 Ministère de l'Éducation",null,null,null,null,null,null,null,null,null,null,null,null,null,null,null,null,null,null,null,null,null,null,null,null,null,null,null,null,null,null,null,"827 Fonds des technologies de l'information - MESS",null,null,null,null,null,"350 Ministère de l'Éducation"]
["140 Ministère du Conseil exécutif",3,null,null,null,null,null,null,null,null,"360 Office des professions du Québec",null,null,null,null,null,null,null,null,null,null,null,null,null,null,null,null,null,null,null,null,null,null,null,null,null,null,null,null,null,null,null,null,null,null,null,null,null,"360 Office des professions du Québec"]
["188 Tribunal administratif des marchés financiers",1,null,null,null,null,null,null,null,null,"368 Commission municipale du Québec",null,null,null,null,null,null,null,null,null,null,null,null,null,null,null,null,null,null,null,null,null,null,null,null,null,null,null,null,null,null,null,null,null,null,null,null,null,"368 Commission municipale du Québec"]
["210 Ministère des Finances",3,null,null,null,null,null,null,null,null,"380 Ministère de l'Environnement et de la Lutte contre les changements clim.",null,null,null,null,null,null,null,null,null,null,null,null,null,null,null,null,null,null,null,null,null,null,null,null,null,null,null,null,null,null,null,null,null,null,null,null,null,"380 Ministère de l'Environnement et de la Lutte contre les changements clim."]
["246 Directeur des poursuites criminelles et pénales",1,null,null,null,null,null,null,null,null,"510 Tribunal administratif du logement",null,null,null,null,null,null,null,null,null,null,null,null,null,null,null,null,null,null,null,null,null,null,null,null,null,null,null,null,null,null,null,null,null,null,null,null,null,"510 Tribunal administratif du logement"]
["247 Commissaire au lobbyisme du Québec",1,null,null,null,null,null,null,null,null,"520 La Financière agricole du Québec",null,null,null,null,null,null,null,null,null,null,null,null,null,null,null,null,null,null,null,null,null,null,null,null,null,null,null,null,null,null,null,null,null,null,null,null,null,"520 La Financière agricole du Québec"]
["295 Protecteur du citoyen",1,null,null,null,null,null,null,null,null,"560 Curateur public",null,null,null,null,null,null,null,null,null,null,null,null,null,null,null,null,null,null,null,null,null,null,null,null,null,null,null,null,null,null,null,null,null,null,null,null,null,"560 Curateur public"]
["320 Société de l'assurance automobile du Québec",1,null,null,null,null,null,null,null,null,"730 Société d'habitation du Québec",null,null,null,null,null,null,null,null,null,null,null,null,null,null,null,null,null,null,null,null,null,null,null,null,null,null,null,null,null,null,null,null,null,null,null,null,null,"730 Société d'habitation du Québec"]
["321 Fonds d'aide aux actions collectives",1,null,null,null,null,null,null,null,null,"814 Fonds de partenariat touristique",null,null,null,null,null,null,null,null,null,null,null,null,null,null,null,null,null,null,null,null,null,null,null,null,null,null,null,null,null,null,null,null,null,null,null,null,null,"814 Fonds de partenariat touristique"]
["323 Institut de la statistique du Québec",1,null,null,null,null,null,null,null,null,"819 Fonds de développement régional",null,null,null,null,null,null,null,null,null,null,null,null,null,null,null,null,null,null,null,null,null,null,null,null,null,null,null,null,null,null,null,null,null,null,null,null,null,"819 Fonds de développement régional"]
["328 Commission de protection du territoire agricole du Québec",1,null,null,null,null,null,null,null,null,"830 Commission des transports du Québec",null,null,null,null,null,null,null,null,null,null,null,null,null,null,null,null,null,null,null,null,null,null,null,null,null,null,null,null,null,null,null,null,null,null,null,null,null,"830 Commission des transports du Québec"]
["344 Office de la protection du consommateur",1,null,null,null,null,null,null,null,null,"899 Capital financière agricole inc.",null,null,null,null,null,null,null,null,null,null,null,null,null,null,null,null,null,null,null,null,null,null,null,null,null,null,null,null,null,null,null,null,null,null,null,null,null,"899 Capital financière agricole inc."]
["367 Régie du bâtiment du Québec",1]
["374 Vérificateur général du Québec",1]
["386 Régie des alcools, des courses et des jeux",1]
["391 Commissaire à la Langue Française",1]
["392 Régie des marchés agricoles et alimentaires du Québec",1]
["395 Autorité des marchés publics",1]
["397 Centre d'acquisition gouvernementales",1]
["400 Ministère de la Justice",6]
["408 Commission d'accès à l'information du Québec",1]
["416 Commissaire au bien-être et aux droits des enfants",1]
["418 Mobilité Infra Québec",{"$f":"COUNTA(OFFSET(C:C,,ROW()-2))-1","v":1}]
["430 Commission de la fonction publique du Québec",{"$f":"COUNTA(OFFSET(C:C,,ROW()-2))-1","v":1}]
["450 Tribunal administratif du Québec",{"$f":"COUNTA(OFFSET(C:C,,ROW()-2))-1","v":1}]
["491 Ministère de la Langue française",1]
["505 Conseil de gestion de l'assurance parentale",{"$f":"COUNTA(OFFSET(C:C,,ROW()-2))-1","v":1}]
["538 Office des personnes handicapées du Québec",{"$f":"COUNTA(OFFSET(C:C,,ROW()-2))-1","v":3}]
["600 Ministère de l'Énergie et des Ressources naturelles",{"$f":"COUNTA(OFFSET(C:C,,ROW()-2))-1","v":1}]
["602 Institut nationale des mines",{"$f":"COUNTA(OFFSET(C:C,,ROW()-2))-1","v":1}]
["630 Directeur général des élections",{"$f":"COUNTA(OFFSET(C:C,,ROW()-2))-1","v":1}]
["660 Conseil du statut de la femme",1]
["700 Ministère du Travail, de l'Emploi et de la Solidarité sociale",{"$f":"COUNTA(OFFSET(C:C,,ROW()-2))-1","v":9}]
["703 Commission des normes, de l'équité, de la santé et de la sécurité du travail",1]
["710 Office québécois de la langue française",1]
["771 Fonds Accès Justice",1]
["773 Fonds des ressources informationnelles du secteur de la sss",1]
["787 Fonds de prévention et de recherche en matière de cannabis",1]
["796 Fonds de la Cybersécurité et du Numérique",20]
["801 Fonds d'aide à l'action communautaire autonome",1]
["813 Fonds Québécois d'initiatives sociales",1]
["815 Fonds de développement du marché du travail",1]
["816 Fonds de dév. et de reconnaissance des compétences de la m-o",1]
["817 Fonds d'information sur le territoire",1]
["826 Fonds des ressources naturelles",1]
["827 Fonds des technologies de l'information - MESS",1]
["849 Financement Québec",1]
["872 Fonds du BAVAC",1]
["874 Fonds du financement regroupé",1]
["878 Fonds des registres du ministère de la Justice",1]
["884 Programme relevant des ministres - Conseil exécutif",1]

{"sheet":"BDD2","index":10,"n_rows":26,"n_cols":28,"rows_kept":26,"cut":false,"hidden":true,"merged":[]}
["Liste principale","Nb Items",{"$f":"INDIRECT(\"A\"&COLUMN()-1)","v":"050 Ministère des Affaires municipales et de l'Habitation"},{"$f":"INDIRECT(\"A\"&COLUMN()-1)","v":"064 Régie de l'assurance maladie du Québe"},"067 Ministère de l’Enseignement supérieur","160 Secrétariat du Conseil du trésor","210 Ministère des Finances","240 Retraite Québec","256 Bureau d'audiences publiques sur l'environnement","280 Ministère de l'Économie et de l'Innovation","350 Ministère de l'Éducation","360 Office des professions du Québec","368 Commission municipale du Québec","380 Ministère de l'Environnement et de la Lutte contre les changements clim.","510 Tribunal administratif du logement","520 La Financière agricole du Québec","560 Curateur public","602 Institut national des mines","660 Conseil du statut de la femme","730 Société d'habitation du Québec","791 Fonds des ressources naturelles - Volet Gestion de l'énergie fossile","814 Fonds de partenariat touristique","819 Fonds de développement régional","830 Commission des transports du Québec","849 Financement Québec","874 Fonds du financement regroupé","899 Capital financière agricole inc.",0]
["050 Ministère des Affaires municipales et de l'Habitation",{"$f":"COUNTA(OFFSET(C:C,,ROW()-2))-1","v":5},"050 Ministère des Affaires municipales et de l'Habitation","064 Régie de l'assurance maladie du Québe","067 Ministère de l’Enseignement supérieur","160 Conseil du trésor","210 Ministère des Finances","240 Retraite Québec","256 Bureau d'audiences publiques sur l'environnement","280 Ministère de l'Économie et de l'Innovation","350 Ministère de l'Éducation","360 Office des professions du Québec","368 Commission municipale du Québec","380 Ministère de l'Environnement et de la Lutte contre les changements clim.","510 Tribunal administratif du logement","520 La Financière agricole du Québec","560 Curateur public","602 Institut national des mines","660 Conseil du statut de la femme","730 Société d'habitation du Québec",791,"814 Fonds de partenariat touristique","819 Fonds de développement régional","830 Commission des transports du Québec","849 Financement Québec","874 Fonds du financement regroupé","899 Capital financière agricole inc."]
["064 Régie de l'assurance maladie du Québe",1,"368 Commission municipale du Québec",null,null,null,"849 Financement Québec",null,null,"791 Fonds des ressources naturelles - Volet Gestion de l'énergie fossile",null,null,null,null,null,"899 Capital financière agricole inc."]
["067 Ministère de l’Enseignement supérieur",1,"510 Régie du logement",null,null,null,"874 Fonds du financement regroupé"]
["160 Secrétariat du Conseil du trésor",1,"730 Société d'habitation du Québec"]
["210 Ministère des Finances",3,"819 Fonds de développement régional"]
["240 Retraite Québec",1]
["256 Bureau d'audiences publiques sur l'environnement",1]
["280 Ministère de l'Économie et de l'Innovation",2]
["350 Ministère de l'Éducation",1]
["360 Office des professions du Québec",{"$f":"COUNTA(OFFSET(C:C,,ROW()-2))-1","v":1}]
["368 Commission municipale du Québec",1]
["380 Ministère de l'Environnement et de la Lutte contre les changements clim.",1]
["510 Tribunal administratif du logement",1]
["520 La Financière agricole du Québec",2]
["560 Curateur public",1]
["602 Institut national des mines",1]
["660 Conseil du statut de la femme",1]
["730 Société d'habitation du Québec",1]
["791 Fonds des ressources naturelles - Volet Gestion de l'énergie fossile",1]
["814 Fonds de partenariat touristique",1]
["819 Fonds de développement régional",1]
["830 Commission des transports du Québec",1]
["849 Financement Québec",1]
["874 Fonds du financement regroupé",1]
["899 Capital financière agricole inc.",1]

{"sheet":"BDD3","index":11,"n_rows":102,"n_cols":94,"rows_kept":102,"cut":false,"hidden":true,"merged":[]}
["Tous",null,{"$f":"INDIRECT(\"A\"&COLUMN()-1)","v":"010"},{"$f":"INDIRECT(\"A\"&COLUMN()-1)","v":"030"},{"$error":"#REF!"},"055","060","065","080","095","096","140","188","246","247","320","321","323","328","344","367","374","386","392","395","397","400","408","430","450","505",{"$error":"#REF!"},"538",{"$error":"#REF!"},"600","630",{"$error":"#REF!"},"700","703","710","771","773",{"$error":"#REF!"},{"$error":"#REF!"},"787","796","801","813","815","816","817","826","827","872","878","884","","","","","","","","","","","",{"$f":"INDIRECT(\"A\"&COLUMN()-1)","v":""},"","","","","","","","","","",{"$f":"INDIRECT(\"A\"&COLUMN()-2)","v":""},"","","","","","","","","","","","","","",""]
[{"$f":"LEFT(BDD!A2,3)","v":"010"},{"$f":"BDD!B2","v":1},{"$f":"LEFT(BDD!C2,3)","v":"010"},{"$f":"LEFT(BDD!D2,3)","v":"030"},{"$f":"LEFT(BDD!#REF!,3)","v":{"$error":"#REF!"}},{"$f":"LEFT(BDD!E2,3)","v":"055"},{"$f":"LEFT(BDD!F2,3)","v":"060"},{"$f":"LEFT(BDD!G2,3)","v":"065"},{"$f":"LEFT(BDD!I2,3)","v":"080"},{"$f":"LEFT(BDD!J2,3)","v":"095"},{"$f":"LEFT(BDD!K2,3)","v":"096"},{"$f":"LEFT(BDD!L2,3)","v":"140"},{"$f":"LEFT(BDD!M2,3)","v":"188"},{"$f":"LEFT(BDD!O2,3)","v":"246"},{"$f":"LEFT(BDD!P2,3)","v":"247"},{"$f":"LEFT(BDD!R2,3)","v":"320"},{"$f":"LEFT(BDD!S2,3)","v":"321"},{"$f":"LEFT(BDD!T2,3)","v":"323"},{"$f":"LEFT(BDD!U2,3)","v":"328"},{"$f":"LEFT(BDD!V2,3)","v":"344"},{"$f":"LEFT(BDD!W2,3)","v":"367"},{"$f":"LEFT(BDD!X2,3)","v":"374"},{"$f":"LEFT(BDD!Y2,3)","v":"386"},{"$f":"LEFT(BDD!AA2,3)","v":"392"},{"$f":"LEFT(BDD!AB2,3)","v":"395"},{"$f":"LEFT(BDD!AC2,3)","v":"397"},{"$f":"LEFT(BDD!AD2,3)","v":"400"},{"$f":"LEFT(BDD!AE2,3)","v":"408"},{"$f":"LEFT(BDD!AH2,3)","v":"430"},{"$f":"LEFT(BDD!AI2,3)","v":"450"},{"$f":"LEFT(BDD!AK2,3)","v":"505"},{"$f":"LEFT(BDD!#REF!,3)","v":{"$error":"#REF!"}},{"$f":"LEFT(BDD!AL2,3)","v":"538"},{"$f":"LEFT(BDD!#REF!,3)","v":{"$error":"#REF!"}},{"$f":"LEFT(BDD!AM2,3)","v":"600"},{"$f":"LEFT(BDD!AO2,3)","v":"630"},{"$f":"LEFT(BDD!#REF!,3)","v":{"$error":"#REF!"}},{"$f":"LEFT(BDD!AQ2,3)","v":"700"},{"$f":"LEFT(BDD!AR2,3)","v":"703"},{"$f":"LEFT(BDD!AS2,3)","v":"710"},{"$f":"LEFT(BDD!AT2,3)","v":"771"},{"$f":"LEFT(BDD!AU2,3)","v":"773"},{"$f":"LEFT(BDD!#REF!,3)","v":{"$error":"#REF!"}},{"$f":"LEFT(BDD!#REF!,3)","v":{"$error":"#REF!"}},{"$f":"LEFT(BDD!AV2,3)","v":"787"},{"$f":"LEFT(BDD!AW2,3)","v":"Auc"},{"$f":"LEFT(BDD!AX2,3)","v":"801"},{"$f":"LEFT(BDD!AY2,3)","v":"813"},{"$f":"LEFT(BDD!AZ2,3)","v":"815"},{"$f":"LEFT(BDD!BA2,3)","v":"816"},{"$f":"LEFT(BDD!BB2,3)","v":"817"},{"$f":"LEFT(BDD!BC2,3)","v":"826"},{"$f":"LEFT(BDD!BD2,3)","v":"827"},{"$f":"LEFT(BDD!BF2,3)","v":"872"},{"$f":"LEFT(BDD!BH2,3)","v":"878"},{"$f":"LEFT(BDD!BI2,3)","v":"884"},{"$f":"LEFT(BDD!#REF!,3)","v":{"$error":"#REF!"}},{"$f":"LEFT(BDD!#REF!,3)","v":{"$error":"#REF!"}},{"$f":"LEFT(BDD!#REF!,3)","v":{"$error":"#REF!"}},{"$f":"LEFT(BDD!BL2,3)","v":""},{"$f":"LEFT(BDD!BM2,3)","v":""},{"$f":"LEFT(BDD!BN2,3)","v":""},{"$f":"LEFT(BDD!BO2,3)","v":""},{"$f":"LEFT(BDD!BR2,3)","v":""},{"$f":"LEFT(BDD!BS2,3)","v":""},{"$f":"LEFT(BDD!BT2,3)","v":""},{"$f":"LEFT(BDD!BU2,3)","v":""},{"$f":"LEFT(BDD!BV2,3)","v":""},{"$f":"LEFT(BDD!BW2,3)","v":""},{"$f":"LEFT(BDD!BX2,3)","v":""},{"$f":"LEFT(BDD!BY2,3)","v":""},{"$f":"LEFT(BDD!BZ2,3)","v":""},{"$f":"LEFT(BDD!CA2,3)","v":""},{"$f":"LEFT(BDD!CB2,3)","v":""},{"$f":"LEFT(BDD!CC2,3)","v":""},{"$f":"LEFT(BDD!CD2,3)","v":""},{"$f":"LEFT(BDD!CE2,3)","v":""},{"$f":"LEFT(BDD!CF2,3)","v":""},{"$f":"LEFT(BDD!CG2,3)","v":""},{"$f":"LEFT(BDD!CH2,3)","v":""}]
[{"$f":"LEFT(BDD!A3,3)","v":"030"},2,{"$f":"LEFT(BDD!C3,3)","v":""},{"$f":"LEFT(BDD!D3,3)","v":""},{"$f":"LEFT(BDD!#REF!,3)","v":{"$error":"#REF!"}},{"$f":"LEFT(BDD!E3,3)","v":""},{"$f":"LEFT(BDD!F3,3)","v":"773"},{"$f":"LEFT(BDD!G3,3)","v":""},{"$f":"LEFT(BDD!I3,3)","v":"392"},{"$f":"LEFT(BDD!J3,3)","v":"386"},{"$f":"LEFT(BDD!K3,3)","v":"050"},{"$f":"LEFT(BDD!L3,3)","v":"408"},{"$f":"LEFT(BDD!M3,3)","v":""},{"$f":"LEFT(BDD!O3,3)","v":""},{"$f":"LEFT(BDD!P3,3)","v":""},{"$f":"LEFT(BDD!R3,3)","v":""},{"$f":"LEFT(BDD!S3,3)","v":""},{"$f":"LEFT(BDD!T3,3)","v":""},{"$f":"LEFT(BDD!U3,3)","v":""},{"$f":"LEFT(BDD!V3,3)","v":""},{"$f":"LEFT(BDD!W3,3)","v":""},{"$f":"LEFT(BDD!X3,3)","v":""},{"$f":"LEFT(BDD!Y3,3)","v":""},{"$f":"LEFT(BDD!AA3,3)","v":""},{"$f":"LEFT(BDD!AB3,3)","v":""},{"$f":"LEFT(BDD!AC3,3)","v":""},{"$f":"LEFT(BDD!AD3,3)","v":"246"},{"$f":"LEFT(BDD!AE3,3)","v":""},{"$f":"LEFT(BDD!AG3,3)","v":""},{"$f":"LEFT(BDD!AH3,3)","v":""},{"$f":"LEFT(BDD!AJ3,3)","v":""},null,{"$f":"LEFT(BDD!#REF!,3)","v":{"$error":"#REF!"}},{"$f":"LEFT(BDD!#REF!,3)","v":{"$error":"#REF!"}},{"$f":"LEFT(BDD!#REF!,3)","v":{"$error":"#REF!"}},{"$f":"LEFT(BDD!AN3,3)","v":""},{"$f":"LEFT(BDD!#REF!,3)","v":{"$error":"#REF!"}},{"$f":"LEFT(BDD!AQ5,3)","v":"505"},{"$f":"LEFT(BDD!AR3,3)","v":""},{"$f":"LEFT(BDD!AS3,3)","v":""},{"$f":"LEFT(BDD!AT3,3)","v":""},{"$f":"LEFT(BDD!AU3,3)","v":""},{"$f":"LEFT(BDD!#REF!,3)","v":{"$error":"#REF!"}},{"$f":"LEFT(BDD!#REF!,3)","v":{"$error":"#REF!"}},{"$f":"LEFT(BDD!AV3,3)","v":""},{"$f":"LEFT(BDD!AW3,3)","v":"050"},{"$f":"LEFT(BDD!AX3,3)","v":""},{"$f":"LEFT(BDD!AY3,3)","v":""},{"$f":"LEFT(BDD!AZ3,3)","v":""},{"$f":"LEFT(BDD!BA3,3)","v":""},{"$f":"LEFT(BDD!BB3,3)","v":""},{"$f":"LEFT(BDD!BC3,3)","v":""},{"$f":"LEFT(BDD!BD3,3)","v":""},{"$f":"LEFT(BDD!BE3,3)","v":""},{"$f":"LEFT(BDD!BF3,3)","v":""},{"$f":"LEFT(BDD!BG3,3)","v":""},{"$f":"LEFT(BDD!BL3,3)","v":""},{"$f":"LEFT(BDD!BM3,3)","v":""},{"$f":"LEFT(BDD!BN3,3)","v":""},{"$f":"LEFT(BDD!BO3,3)","v":""},{"$f":"LEFT(BDD!BR3,3)","v":""},{"$f":"LEFT(BDD!#REF!,3)","v":{"$error":"#REF!"}},{"$f":"LEFT(BDD!#REF!,3)","v":{"$error":"#REF!"}},{"$f":"LEFT(BDD!BS3,3)","v":""},{"$f":"LEFT(BDD!BT3,3)","v":""},{"$f":"LEFT(BDD!BU3,3)","v":""},{"$f":"LEFT(BDD!BV3,3)","v":""},{"$f":"LEFT(BDD!BW3,3)","v":""},{"$f":"LEFT(BDD!BX3,3)","v":""},{"$f":"LEFT(BDD!BY3,3)","v":""},{"$f":"LEFT(BDD!BZ3,3)","v":""},{"$f":"LEFT(BDD!CA3,3)","v":""},{"$f":"LEFT(BDD!CB3,3)","v":""},{"$f":"LEFT(BDD!CC3,3)","v":""},{"$f":"LEFT(BDD!CD3,3)","v":""},{"$f":"LEFT(BDD!CE3,3)","v":""},{"$f":"LEFT(BDD!CF3,3)","v":""},{"$f":"LEFT(BDD!CG3,3)","v":""},{"$f":"LEFT(BDD!CH3,3)","v":""}]
[{"$f":"LEFT(BDD!#REF!,3)","v":{"$error":"#REF!"}},{"$f":"BDD!#REF!","v":{"$error":"#REF!"}},{"$f":"LEFT(BDD!C4,3)","v":""},{"$f":"LEFT(BDD!D4,3)","v":""},{"$f":"LEFT(BDD!#REF!,3)","v":{"$error":"#REF!"}},{"$f":"LEFT(BDD!E4,3)","v":""},{"$f":"LEFT(BDD!F4,3)","v":"787"},{"$f":"LEFT(BDD!G4,3)","v":""},{"$f":"LEFT(BDD!I4,3)","v":""},{"$f":"LEFT(BDD!J4,3)","v":""},{"$f":"LEFT(BDD!K4,3)","v":"064"},{"$f":"LEFT(BDD!L4,3)","v":"884"},{"$f":"LEFT(BDD!M4,3)","v":""},{"$f":"LEFT(BDD!O4,3)","v":""},{"$f":"LEFT(BDD!P4,3)","v":""},{"$f":"LEFT(BDD!R4,3)","v":""},{"$f":"LEFT(BDD!S4,3)","v":""},{"$f":"LEFT(BDD!T4,3)","v":""},{"$f":"LEFT(BDD!U4,3)","v":""},{"$f":"LEFT(BDD!V4,3)","v":""},{"$f":"LEFT(BDD!W4,3)","v":""},{"$f":"LEFT(BDD!X4,3)","v":""},{"$f":"LEFT(BDD!Y4,3)","v":""},{"$f":"LEFT(BDD!AA4,3)","v":""},{"$f":"LEFT(BDD!AB4,3)","v":""},{"$f":"LEFT(BDD!AC4,3)","v":""},{"$f":"LEFT(BDD!AD4,3)","v":"344"},{"$f":"LEFT(BDD!AE4,3)","v":""},{"$f":"LEFT(BDD!AG4,3)","v":""},{"$f":"LEFT(BDD!AH4,3)","v":""},{"$f":"LEFT(BDD!AJ4,3)","v":""},null,{"$f":"LEFT(BDD!#REF!,3)","v":{"$error":"#REF!"}},{"$f":"LEFT(BDD!#REF!,3)","v":{"$error":"#REF!"}},{"$f":"LEFT(BDD!AL3,3)","v":"817"},{"$f":"LEFT(BDD!AN4,3)","v":""},{"$f":"LEFT(BDD!#REF!,3)","v":{"$error":"#REF!"}},{"$f":"LEFT(BDD!AQ6,3)","v":"801"},{"$f":"LEFT(BDD!AR4,3)","v":""},{"$f":"LEFT(BDD!AS4,3)","v":""},{"$f":"LEFT(BDD!AT4,3)","v":""},{"$f":"LEFT(BDD!AU4,3)","v":""},{"$f":"LEFT(BDD!#REF!,3)","v":{"$error":"#REF!"}},{"$f":"LEFT(BDD!#REF!,3)","v":{"$error":"#REF!"}},{"$f":"LEFT(BDD!AV4,3)","v":""},{"$f":"LEFT(BDD!AW4,3)","v":"064"},{"$f":"LEFT(BDD!AX4,3)","v":""},{"$f":"LEFT(BDD!AY4,3)","v":""},{"$f":"LEFT(BDD!AZ4,3)","v":""},{"$f":"LEFT(BDD!BA4,3)","v":""},{"$f":"LEFT(BDD!BB4,3)","v":""},{"$f":"LEFT(BDD!BC4,3)","v":""},{"$f":"LEFT(BDD!BD4,3)","v":""},{"$f":"LEFT(BDD!BE4,3)","v":""},{"$f":"LEFT(BDD!BF4,3)","v":""},{"$f":"LEFT(BDD!BG4,3)","v":""},{"$f":"LEFT(BDD!BL4,3)","v":""},{"$f":"LEFT(BDD!BM4,3)","v":""},{"$f":"LEFT(BDD!BN4,3)","v":""},{"$f":"LEFT(BDD!BO4,3)","v":""},{"$f":"LEFT(BDD!BR4,3)","v":""},{"$f":"LEFT(BDD!#REF!,3)","v":{"$error":"#REF!"}},{"$f":"LEFT(BDD!#REF!,3)","v":{"$error":"#REF!"}},{"$f":"LEFT(BDD!BS4,3)","v":""},{"$f":"LEFT(BDD!BT4,3)","v":""},{"$f":"LEFT(BDD!BU4,3)","v":""},{"$f":"LEFT(BDD!BV4,3)","v":""},{"$f":"LEFT(BDD!BW4,3)","v":""},{"$f":"LEFT(BDD!BX4,3)","v":""},{"$f":"LEFT(BDD!BY4,3)","v":""},{"$f":"LEFT(BDD!BZ4,3)","v":""},{"$f":"LEFT(BDD!CA4,3)","v":""},{"$f":"LEFT(BDD!CB4,3)","v":""},{"$f":"LEFT(BDD!CC4,3)","v":""},{"$f":"LEFT(BDD!CD4,3)","v":""},{"$f":"LEFT(BDD!CE4,3)","v":""},{"$f":"LEFT(BDD!CF4,3)","v":""},{"$f":"LEFT(BDD!CG4,3)","v":""},{"$f":"LEFT(BDD!CH4,3)","v":""}]
[{"$f":"LEFT(BDD!A4,3)","v":"055"},{"$f":"BDD!B4","v":1},{"$f":"LEFT(BDD!C5,3)","v":""},{"$f":"LEFT(BDD!D5,3)","v":""},{"$f":"LEFT(BDD!#REF!,3)","v":{"$error":"#REF!"}},{"$f":"LEFT(BDD!E5,3)","v":""},{"$f":"LEFT(BDD!F5,3)","v":""},{"$f":"LEFT(BDD!G5,3)","v":""},{"$f":"LEFT(BDD!I5,3)","v":""},{"$f":"LEFT(BDD!J5,3)","v":""},{"$f":"LEFT(BDD!K5,3)","v":"067"},{"$f":"LEFT(BDD!L5,3)","v":""},{"$f":"LEFT(BDD!M5,3)","v":""},{"$f":"LEFT(BDD!O5,3)","v":""},{"$f":"LEFT(BDD!P5,3)","v":""},{"$f":"LEFT(BDD!R5,3)","v":""},{"$f":"LEFT(BDD!S5,3)","v":""},{"$f":"LEFT(BDD!T5,3)","v":""},{"$f":"LEFT(BDD!U5,3)","v":""},{"$f":"LEFT(BDD!V5,3)","v":""},{"$f":"LEFT(BDD!W5,3)","v":""},{"$f":"LEFT(BDD!X5,3)","v":""},{"$f":"LEFT(BDD!Y5,3)","v":""},{"$f":"LEFT(BDD!AA5,3)","v":""},{"$f":"LEFT(BDD!AB5,3)","v":""},{"$f":"LEFT(BDD!AC5,3)","v":""},{"$f":"LEFT(BDD!#REF!,3)","v":{"$error":"#REF!"}},{"$f":"LEFT(BDD!AE5,3)","v":""},{"$f":"LEFT(BDD!AG5,3)","v":""},{"$f":"LEFT(BDD!AH5,3)","v":""},{"$f":"LEFT(BDD!AJ5,3)","v":""},null,{"$f":"LEFT(BDD!#REF!,3)","v":{"$error":"#REF!"}},{"$f":"LEFT(BDD!#REF!,3)","v":{"$error":"#REF!"}},{"$f":"LEFT(BDD!AL4,3)","v":"826"},{"$f":"LEFT(BDD!AN5,3)","v":""},{"$f":"LEFT(BDD!#REF!,3)","v":{"$error":"#REF!"}},{"$f":"LEFT(BDD!AQ7,3)","v":"813"},{"$f":"LEFT(BDD!AR5,3)","v":""},{"$f":"LEFT(BDD!AS5,3)","v":""},{"$f":"LEFT(BDD!AT5,3)","v":""},{"$f":"LEFT(BDD!AU5,3)","v":""},{"$f":"LEFT(BDD!#REF!,3)","v":{"$error":"#REF!"}},{"$f":"LEFT(BDD!#REF!,3)","v":{"$error":"#REF!"}},{"$f":"LEFT(BDD!AV5,3)","v":""},{"$f":"LEFT(BDD!AW5,3)","v":"067"},{"$f":"LEFT(BDD!AX5,3)","v":""},{"$f":"LEFT(BDD!AY5,3)","v":""},{"$f":"LEFT(BDD!AZ5,3)","v":""},{"$f":"LEFT(BDD!BA5,3)","v":""},{"$f":"LEFT(BDD!BB5,3)","v":""},{"$f":"LEFT(BDD!BC5,3)","v":""},{"$f":"LEFT(BDD!BD5,3)","v":""},{"$f":"LEFT(BDD!BE5,3)","v":""},{"$f":"LEFT(BDD!BF5,3)","v":""},{"$f":"LEFT(BDD!BG5,3)","v":""},{"$f":"LEFT(BDD!BL5,3)","v":""},{"$f":"LEFT(BDD!BM5,3)","v":""},{"$f":"LEFT(BDD!BN5,3)","v":""},{"$f":"LEFT(BDD!BO5,3)","v":""},{"$f":"LEFT(BDD!BR5,3)","v":""},{"$f":"LEFT(BDD!#REF!,3)","v":{"$error":"#REF!"}},{"$f":"LEFT(BDD!#REF!,3)","v":{"$error":"#REF!"}},{"$f":"LEFT(BDD!BS5,3)","v":""},{"$f":"LEFT(BDD!BT5,3)","v":""},{"$f":"LEFT(BDD!BU5,3)","v":""},{"$f":"LEFT(BDD!BV5,3)","v":""},{"$f":"LEFT(BDD!BW5,3)","v":""},{"$f":"LEFT(BDD!BX5,3)","v":""},{"$f":"LEFT(BDD!BY5,3)","v":""},{"$f":"LEFT(BDD!BZ5,3)","v":""},{"$f":"LEFT(BDD!CA5,3)","v":""},{"$f":"LEFT(BDD!CB5,3)","v":""},{"$f":"LEFT(BDD!CC5,3)","v":""},{"$f":"LEFT(BDD!CD5,3)","v":""},{"$f":"LEFT(BDD!CE5,3)","v":""},{"$f":"LEFT(BDD!CF5,3)","v":""},{"$f":"LEFT(BDD!CG5,3)","v":""},{"$f":"LEFT(BDD!CH5,3)","v":""}]
[{"$f":"LEFT(BDD!A5,3)","v":"060"},{"$f":"BDD!B5","v":3},{"$f":"LEFT(BDD!C6,3)","v":""},{"$f":"LEFT(BDD!D6,3)","v":""},{"$f":"LEFT(BDD!#REF!,3)","v":{"$error":"#REF!"}},{"$f":"LEFT(BDD!E6,3)","v":""},{"$f":"LEFT(BDD!F6,3)","v":""},{"$f":"LEFT(BDD!G6,3)","v":""},{"$f":"LEFT(BDD!I6,3)","v":""},{"$f":"LEFT(BDD!J6,3)","v":""},{"$f":"LEFT(BDD!K6,3)","v":"160"},{"$f":"LEFT(BDD!L6,3)","v":""},{"$f":"LEFT(BDD!M6,3)","v":""},{"$f":"LEFT(BDD!O6,3)","v":""},{"$f":"LEFT(BDD!P6,3)","v":""},{"$f":"LEFT(BDD!R6,3)","v":""},{"$f":"LEFT(BDD!S6,3)","v":""},{"$f":"LEFT(BDD!T6,3)","v":""},{"$f":"LEFT(BDD!U6,3)","v":""},{"$f":"LEFT(BDD!V6,3)","v":""},{"$f":"LEFT(BDD!W6,3)","v":""},{"$f":"LEFT(BDD!X6,3)","v":""},{"$f":"LEFT(BDD!Y6,3)","v":""},{"$f":"LEFT(BDD!AA6,3)","v":""},{"$f":"LEFT(BDD!AB6,3)","v":""},{"$f":"LEFT(BDD!AC6,3)","v":""},{"$f":"LEFT(BDD!AD5,3)","v":"771"},{"$f":"LEFT(BDD!AE6,3)","v":""},{"$f":"LEFT(BDD!AG6,3)","v":""},{"$f":"LEFT(BDD!AH6,3)","v":""},{"$f":"LEFT(BDD!AJ6,3)","v":""},null,{"$f":"LEFT(BDD!#REF!,3)","v":{"$error":"#REF!"}},{"$f":"LEFT(BDD!#REF!,3)","v":{"$error":"#REF!"}},{"$f":"LEFT(BDD!AL6,3)","v":""},{"$f":"LEFT(BDD!AN6,3)","v":""},{"$f":"LEFT(BDD!#REF!,3)","v":{"$error":"#REF!"}},{"$f":"LEFT(BDD!AQ8,3)","v":"815"},{"$f":"LEFT(BDD!AR6,3)","v":""},{"$f":"LEFT(BDD!AS6,3)","v":""},{"$f":"LEFT(BDD!AT6,3)","v":""},{"$f":"LEFT(BDD!AU6,3)","v":""},{"$f":"LEFT(BDD!#REF!,3)","v":{"$error":"#REF!"}},{"$f":"LEFT(BDD!#REF!,3)","v":{"$error":"#REF!"}},{"$f":"LEFT(BDD!AV6,3)","v":""},{"$f":"LEFT(BDD!AW6,3)","v":"160"},{"$f":"LEFT(BDD!AX6,3)","v":""},{"$f":"LEFT(BDD!AY6,3)","v":""},{"$f":"LEFT(BDD!AZ6,3)","v":""},{"$f":"LEFT(BDD!BA6,3)","v":""},{"$f":"LEFT(BDD!BB6,3)","v":""},{"$f":"LEFT(BDD!BC6,3)","v":""},{"$f":"LEFT(BDD!BD6,3)","v":""},{"$f":"LEFT(BDD!BE6,3)","v":""},{"$f":"LEFT(BDD!BF6,3)","v":""},{"$f":"LEFT(BDD!BG6,3)","v":""},{"$f":"LEFT(BDD!BL6,3)","v":""},{"$f":"LEFT(BDD!BM6,3)","v":""},{"$f":"LEFT(BDD!BN6,3)","v":""},{"$f":"LEFT(BDD!BO6,3)","v":""},{"$f":"LEFT(BDD!BR6,3)","v":""},{"$f":"LEFT(BDD!#REF!,3)","v":{"$error":"#REF!"}},{"$f":"LEFT(BDD!#REF!,3)","v":{"$error":"#REF!"}},{"$f":"LEFT(BDD!BS6,3)","v":""},{"$f":"LEFT(BDD!BT6,3)","v":""},{"$f":"LEFT(BDD!BU6,3)","v":""},{"$f":"LEFT(BDD!BV6,3)","v":""},{"$f":"LEFT(BDD!BW6,3)","v":""},{"$f":"LEFT(BDD!BX6,3)","v":""},{"$f":"LEFT(BDD!BY6,3)","v":""},{"$f":"LEFT(BDD!BZ6,3)","v":""},{"$f":"LEFT(BDD!CA6,3)","v":""},{"$f":"LEFT(BDD!CB6,3)","v":""},{"$f":"LEFT(BDD!CC6,3)","v":""},{"$f":"LEFT(BDD!CD6,3)","v":""},{"$f":"LEFT(BDD!CE6,3)","v":""},{"$f":"LEFT(BDD!CF6,3)","v":""},{"$f":"LEFT(BDD!CG6,3)","v":""},{"$f":"LEFT(BDD!CH6,3)","v":""}]
[{"$f":"LEFT(BDD!A6,3)","v":"065"},{"$f":"BDD!B6","v":1},{"$f":"LEFT(BDD!C7,3)","v":""},{"$f":"LEFT(BDD!D7,3)","v":""},{"$f":"LEFT(BDD!#REF!,3)","v":{"$error":"#REF!"}},{"$f":"LEFT(BDD!E7,3)","v":""},{"$f":"LEFT(BDD!F7,3)","v":""},{"$f":"LEFT(BDD!G7,3)","v":""},{"$f":"LEFT(BDD!I7,3)","v":""},{"$f":"LEFT(BDD!J7,3)","v":""},{"$f":"LEFT(BDD!#REF!,3)","v":{"$error":"#REF!"}},{"$f":"LEFT(BDD!L7,3)","v":""},{"$f":"LEFT(BDD!M7,3)","v":""},{"$f":"LEFT(BDD!O7,3)","v":""},{"$f":"LEFT(BDD!P7,3)","v":""},{"$f":"LEFT(BDD!R7,3)","v":""},{"$f":"LEFT(BDD!S7,3)","v":""},{"$f":"LEFT(BDD!T7,3)","v":""},{"$f":"LEFT(BDD!U7,3)","v":""},{"$f":"LEFT(BDD!V7,3)","v":""},{"$f":"LEFT(BDD!W7,3)","v":""},{"$f":"LEFT(BDD!X7,3)","v":""},{"$f":"LEFT(BDD!Y7,3)","v":""},{"$f":"LEFT(BDD!AA7,3)","v":""},{"$f":"LEFT(BDD!AB7,3)","v":""},{"$f":"LEFT(BDD!AC7,3)","v":""},{"$f":"LEFT(BDD!AD6,3)","v":"872"},{"$f":"LEFT(BDD!AE7,3)","v":""},{"$f":"LEFT(BDD!AG7,3)","v":""},{"$f":"LEFT(BDD!AH7,3)","v":""},{"$f":"LEFT(BDD!AJ7,3)","v":""},null,{"$f":"LEFT(BDD!#REF!,3)","v":{"$error":"#REF!"}},{"$f":"LEFT(BDD!#REF!,3)","v":{"$error":"#REF!"}},{"$f":"LEFT(BDD!AL7,3)","v":""},{"$f":"LEFT(BDD!AN7,3)","v":""},{"$f":"LEFT(BDD!#REF!,3)","v":{"$error":"#REF!"}},{"$f":"LEFT(BDD!AQ9,3)","v":"816"},{"$f":"LEFT(BDD!AR7,3)","v":""},{"$f":"LEFT(BDD!AS7,3)","v":""},{"$f":"LEFT(BDD!AT7,3)","v":""},{"$f":"LEFT(BDD!AU7,3)","v":""},{"$f":"LEFT(BDD!#REF!,3)","v":{"$error":"#REF!"}},{"$f":"LEFT(BDD!#REF!,3)","v":{"$error":"#REF!"}},{"$f":"LEFT(BDD!AV7,3)","v":""},{"$f":"LEFT(BDD!#REF!,3)","v":{"$error":"#REF!"}},{"$f":"LEFT(BDD!AX7,3)","v":""},{"$f":"LEFT(BDD!AY7,3)","v":""},{"$f":"LEFT(BDD!AZ7,3)","v":""},{"$f":"LEFT(BDD!BA7,3)","v":""},{"$f":"LEFT(BDD!BB7,3)","v":""},{"$f":"LEFT(BDD!BC7,3)","v":""},{"$f":"LEFT(BDD!BD7,3)","v":""},{"$f":"LEFT(BDD!BE7,3)","v":""},{"$f":"LEFT(BDD!BF7,3)","v":""},{"$f":"LEFT(BDD!BG7,3)","v":""},{"$f":"LEFT(BDD!BL7,3)","v":""},{"$f":"LEFT(BDD!BM7,3)","v":""},{"$f":"LEFT(BDD!BN7,3)","v":""},{"$f":"LEFT(BDD!BO7,3)","v":""},{"$f":"LEFT(BDD!BR7,3)","v":""},{"$f":"LEFT(BDD!#REF!,3)","v":{"$error":"#REF!"}},{"$f":"LEFT(BDD!#REF!,3)","v":{"$error":"#REF!"}},{"$f":"LEFT(BDD!BS7,3)","v":""},{"$f":"LEFT(BDD!BT7,3)","v":""},{"$f":"LEFT(BDD!BU7,3)","v":""},{"$f":"LEFT(BDD!BV7,3)","v":""},{"$f":"LEFT(BDD!BW7,3)","v":""},{"$f":"LEFT(BDD!BX7,3)","v":""},{"$f":"LEFT(BDD!BY7,3)","v":""},{"$f":"LEFT(BDD!BZ7,3)","v":""},{"$f":"LEFT(BDD!CA7,3)","v":""},{"$f":"LEFT(BDD!CB7,3)","v":""},{"$f":"LEFT(BDD!CC7,3)","v":""},{"$f":"LEFT(BDD!CD7,3)","v":""},{"$f":"LEFT(BDD!CE7,3)","v":""},{"$f":"LEFT(BDD!CF7,3)","v":""},{"$f":"LEFT(BDD!CG7,3)","v":""},{"$f":"LEFT(BDD!CH7,3)","v":""}]
[{"$f":"LEFT(BDD!A8,3)","v":"080"},{"$f":"BDD!B8","v":2},{"$f":"LEFT(BDD!C8,3)","v":""},{"$f":"LEFT(BDD!D8,3)","v":""},{"$f":"LEFT(BDD!#REF!,3)","v":{"$error":"#REF!"}},{"$f":"LEFT(BDD!E8,3)","v":""},{"$f":"LEFT(BDD!F8,3)","v":""},{"$f":"LEFT(BDD!G8,3)","v":""},{"$f":"LEFT(BDD!I8,3)","v":""},{"$f":"LEFT(BDD!J8,3)","v":""},{"$f":"LEFT(BDD!K7,3)","v":"240"},{"$f":"LEFT(BDD!L8,3)","v":""},{"$f":"LEFT(BDD!M8,3)","v":""},{"$f":"LEFT(BDD!O8,3)","v":""},{"$f":"LEFT(BDD!P8,3)","v":""},{"$f":"LEFT(BDD!R8,3)","v":""},{"$f":"LEFT(BDD!S8,3)","v":""},{"$f":"LEFT(BDD!T8,3)","v":""},{"$f":"LEFT(BDD!U8,3)","v":""},{"$f":"LEFT(BDD!V8,3)","v":""},{"$f":"LEFT(BDD!W8,3)","v":""},{"$f":"LEFT(BDD!X8,3)","v":""},{"$f":"LEFT(BDD!Y8,3)","v":""},{"$f":"LEFT(BDD!AA8,3)","v":""},{"$f":"LEFT(BDD!AB8,3)","v":""},{"$f":"LEFT(BDD!AC8,3)","v":""},{"$f":"LEFT(BDD!AD7,3)","v":"878"},{"$f":"LEFT(BDD!AE8,3)","v":""},{"$f":"LEFT(BDD!AG8,3)","v":""},{"$f":"LEFT(BDD!AH8,3)","v":""},{"$f":"LEFT(BDD!AJ8,3)","v":""},null,{"$f":"LEFT(BDD!#REF!,3)","v":{"$error":"#REF!"}},{"$f":"LEFT(BDD!#REF!,3)","v":{"$error":"#REF!"}},{"$f":"LEFT(BDD!AL8,3)","v":""},{"$f":"LEFT(BDD!AN8,3)","v":""},{"$f":"LEFT(BDD!#REF!,3)","v":{"$error":"#REF!"}},{"$f":"LEFT(BDD!AQ10,3)","v":"827"},{"$f":"LEFT(BDD!AR8,3)","v":""},{"$f":"LEFT(BDD!AS8,3)","v":""},{"$f":"LEFT(BDD!AT8,3)","v":""},{"$f":"LEFT(BDD!AU8,3)","v":""},{"$f":"LEFT(BDD!#REF!,3)","v":{"$error":"#REF!"}},{"$f":"LEFT(BDD!#REF!,3)","v":{"$error":"#REF!"}},{"$f":"LEFT(BDD!AV8,3)","v":""},{"$f":"LEFT(BDD!AW7,3)","v":"240"},{"$f":"LEFT(BDD!AX8,3)","v":""},{"$f":"LEFT(BDD!AY8,3)","v":""},{"$f":"LEFT(BDD!AZ8,3)","v":""},{"$f":"LEFT(BDD!BA8,3)","v":""},{"$f":"LEFT(BDD!BB8,3)","v":""},{"$f":"LEFT(BDD!BC8,3)","v":""},{"$f":"LEFT(BDD!BD8,3)","v":""},{"$f":"LEFT(BDD!BE8,3)","v":""},{"$f":"LEFT(BDD!BF8,3)","v":""},{"$f":"LEFT(BDD!BG8,3)","v":""},{"$f":"LEFT(BDD!BL8,3)","v":""},{"$f":"LEFT(BDD!BM8,3)","v":""},{"$f":"LEFT(BDD!BN8,3)","v":""},{"$f":"LEFT(BDD!BO8,3)","v":""},{"$f":"LEFT(BDD!BR8,3)","v":""},{"$f":"LEFT(BDD!#REF!,3)","v":{"$error":"#REF!"}},{"$f":"LEFT(BDD!#REF!,3)","v":{"$error":"#REF!"}},{"$f":"LEFT(BDD!BS9,3)","v":""},{"$f":"LEFT(BDD!BT9,3)","v":""},{"$f":"LEFT(BDD!BU9,3)","v":""},{"$f":"LEFT(BDD!BV9,3)","v":""},{"$f":"LEFT(BDD!BW9,3)","v":""},{"$f":"LEFT(BDD!BX9,3)","v":""},{"$f":"LEFT(BDD!BY9,3)","v":""},{"$f":"LEFT(BDD!BZ9,3)","v":""},{"$f":"LEFT(BDD!CA9,3)","v":""},{"$f":"LEFT(BDD!CB9,3)","v":""},{"$f":"LEFT(BDD!CC9,3)","v":""},{"$f":"LEFT(BDD!CD9,3)","v":""},{"$f":"LEFT(BDD!CE9,3)","v":""},{"$f":"LEFT(BDD!CF9,3)","v":""},{"$f":"LEFT(BDD!CG9,3)","v":""},{"$f":"LEFT(BDD!CH9,3)","v":""}]
[{"$f":"LEFT(BDD!A9,3)","v":"095"},{"$f":"BDD!B9","v":2},{"$f":"LEFT(BDD!C9,3)","v":""},{"$f":"LEFT(BDD!D9,3)","v":""},{"$f":"LEFT(BDD!#REF!,3)","v":{"$error":"#REF!"}},{"$f":"LEFT(BDD!E9,3)","v":""},{"$f":"LEFT(BDD!F9,3)","v":""},{"$f":"LEFT(BDD!G9,3)","v":""},{"$f":"LEFT(BDD!I9,3)","v":""},{"$f":"LEFT(BDD!J9,3)","v":""},{"$f":"LEFT(BDD!K8,3)","v":"256"},{"$f":"LEFT(BDD!L9,3)","v":""},{"$f":"LEFT(BDD!M9,3)","v":""},{"$f":"LEFT(BDD!O9,3)","v":""},{"$f":"LEFT(BDD!P9,3)","v":""},{"$f":"LEFT(BDD!R9,3)","v":""},{"$f":"LEFT(BDD!S9,3)","v":""},{"$f":"LEFT(BDD!T9,3)","v":""},{"$f":"LEFT(BDD!U9,3)","v":""},{"$f":"LEFT(BDD!V9,3)","v":""},{"$f":"LEFT(BDD!W9,3)","v":""},{"$f":"LEFT(BDD!X9,3)","v":""},{"$f":"LEFT(BDD!Y9,3)","v":""},{"$f":"LEFT(BDD!AA9,3)","v":""},{"$f":"LEFT(BDD!AB9,3)","v":""},{"$f":"LEFT(BDD!AC9,3)","v":""},{"$f":"LEFT(BDD!AD9,3)","v":""},{"$f":"LEFT(BDD!AE9,3)","v":""},{"$f":"LEFT(BDD!AG9,3)","v":""},{"$f":"LEFT(BDD!AH9,3)","v":""},{"$f":"LEFT(BDD!AJ9,3)","v":""},null,{"$f":"LEFT(BDD!#REF!,3)","v":{"$error":"#REF!"}},{"$f":"LEFT(BDD!#REF!,3)","v":{"$error":"#REF!"}},{"$f":"LEFT(BDD!AL9,3)","v":""},{"$f":"LEFT(BDD!AN9,3)","v":""},{"$f":"LEFT(BDD!#REF!,3)","v":{"$error":"#REF!"}},{"$f":"LEFT(BDD!#REF!,3)","v":{"$error":"#REF!"}},{"$f":"LEFT(BDD!AR9,3)","v":""},{"$f":"LEFT(BDD!AS9,3)","v":""},{"$f":"LEFT(BDD!AT9,3)","v":""},{"$f":"LEFT(BDD!AU9,3)","v":""},{"$f":"LEFT(BDD!#REF!,3)","v":{"$error":"#REF!"}},{"$f":"LEFT(BDD!#REF!,3)","v":{"$error":"#REF!"}},{"$f":"LEFT(BDD!AV9,3)","v":""},{"$f":"LEFT(BDD!AW8,3)","v":"256"},{"$f":"LEFT(BDD!AX9,3)","v":""},{"$f":"LEFT(BDD!AY9,3)","v":""},{"$f":"LEFT(BDD!AZ9,3)","v":""},{"$f":"LEFT(BDD!BA9,3)","v":""},{"$f":"LEFT(BDD!BB9,3)","v":""},{"$f":"LEFT(BDD!BC9,3)","v":""},{"$f":"LEFT(BDD!BD9,3)","v":""},{"$f":"LEFT(BDD!BE9,3)","v":""},{"$f":"LEFT(BDD!BF9,3)","v":""},{"$f":"LEFT(BDD!BG9,3)","v":""},{"$f":"LEFT(BDD!BL9,3)","v":""},{"$f":"LEFT(BDD!BM9,3)","v":""},{"$f":"LEFT(BDD!BN9,3)","v":""},{"$f":"LEFT(BDD!BO9,3)","v":""},{"$f":"LEFT(BDD!BR9,3)","v":""},{"$f":"LEFT(BDD!#REF!,3)","v":{"$error":"#REF!"}},{"$f":"LEFT(BDD!#REF!,3)","v":{"$error":"#REF!"}},{"$f":"LEFT(BDD!BS10,3)","v":""},{"$f":"LEFT(BDD!BT10,3)","v":""},{"$f":"LEFT(BDD!BU10,3)","v":""},{"$f":"LEFT(BDD!BV10,3)","v":""},{"$f":"LEFT(BDD!BW10,3)","v":""},{"$f":"LEFT(BDD!BX10,3)","v":""},{"$f":"LEFT(BDD!BY10,3)","v":""},{"$f":"LEFT(BDD!BZ10,3)","v":""},{"$f":"LEFT(BDD!CA10,3)","v":""},{"$f":"LEFT(BDD!CB10,3)","v":""},{"$f":"LEFT(BDD!CC10,3)","v":""},{"$f":"LEFT(BDD!CD10,3)","v":""},{"$f":"LEFT(BDD!CE10,3)","v":""},{"$f":"LEFT(BDD!CF10,3)","v":""},{"$f":"LEFT(BDD!CG10,3)","v":""},{"$f":"LEFT(BDD!CH10,3)","v":""}]
[{"$f":"LEFT(BDD!A10,3)","v":"096"},{"$f":"BDD!B10","v":20},{"$f":"LEFT(BDD!C10,3)","v":""},{"$f":"LEFT(BDD!D10,3)","v":""},{"$f":"LEFT(BDD!#REF!,3)","v":{"$error":"#REF!"}},{"$f":"LEFT(BDD!E10,3)","v":""},{"$f":"LEFT(BDD!F10,3)","v":""},{"$f":"LEFT(BDD!G10,3)","v":""},{"$f":"LEFT(BDD!I10,3)","v":""},{"$f":"LEFT(BDD!J10,3)","v":""},{"$f":"LEFT(BDD!K9,3)","v":"280"},{"$f":"LEFT(BDD!L10,3)","v":""},{"$f":"LEFT(BDD!M10,3)","v":""},{"$f":"LEFT(BDD!O10,3)","v":""},{"$f":"LEFT(BDD!P10,3)","v":""},{"$f":"LEFT(BDD!R10,3)","v":""},{"$f":"LEFT(BDD!S10,3)","v":""},{"$f":"LEFT(BDD!T10,3)","v":""},{"$f":"LEFT(BDD!U10,3)","v":""},{"$f":"LEFT(BDD!V10,3)","v":""},{"$f":"LEFT(BDD!W10,3)","v":""},{"$f":"LEFT(BDD!X10,3)","v":""},{"$f":"LEFT(BDD!Y10,3)","v":""},{"$f":"LEFT(BDD!AA10,3)","v":""},{"$f":"LEFT(BDD!AB10,3)","v":""},{"$f":"LEFT(BDD!AC10,3)","v":""},{"$f":"LEFT(BDD!AD10,3)","v":""},{"$f":"LEFT(BDD!AE10,3)","v":""},{"$f":"LEFT(BDD!AG10,3)","v":""},{"$f":"LEFT(BDD!AH10,3)","v":""},{"$f":"LEFT(BDD!AJ10,3)","v":""},null,{"$f":"LEFT(BDD!#REF!,3)","v":{"$error":"#REF!"}},{"$f":"LEFT(BDD!#REF!,3)","v":{"$error":"#REF!"}},{"$f":"LEFT(BDD!AL10,3)","v":""},{"$f":"LEFT(BDD!AN10,3)","v":""},{"$f":"LEFT(BDD!#REF!,3)","v":{"$error":"#REF!"}},{"$f":"LEFT(BDD!#REF!,3)","v":{"$error":"#REF!"}},{"$f":"LEFT(BDD!AR10,3)","v":""},{"$f":"LEFT(BDD!AS10,3)","v":""},{"$f":"LEFT(BDD!AT10,3)","v":""},{"$f":"LEFT(BDD!AU10,3)","v":""},{"$f":"LEFT(BDD!#REF!,3)","v":{"$error":"#REF!"}},{"$f":"LEFT(BDD!#REF!,3)","v":{"$error":"#REF!"}},{"$f":"LEFT(BDD!AV10,3)","v":""},{"$f":"LEFT(BDD!AW9,3)","v":"280"},{"$f":"LEFT(BDD!AX10,3)","v":""},{"$f":"LEFT(BDD!AY10,3)","v":""},{"$f":"LEFT(BDD!AZ10,3)","v":""},{"$f":"LEFT(BDD!BA10,3)","v":""},{"$f":"LEFT(BDD!BB10,3)","v":""},{"$f":"LEFT(BDD!BC10,3)","v":""},{"$f":"LEFT(BDD!BD10,3)","v":""},{"$f":"LEFT(BDD!BE10,3)","v":""},{"$f":"LEFT(BDD!BF10,3)","v":""},{"$f":"LEFT(BDD!BG10,3)","v":""},{"$f":"LEFT(BDD!BL10,3)","v":""},{"$f":"LEFT(BDD!BM10,3)","v":""},{"$f":"LEFT(BDD!BN10,3)","v":""},{"$f":"LEFT(BDD!BO10,3)","v":""},{"$f":"LEFT(BDD!BR10,3)","v":""},{"$f":"LEFT(BDD!#REF!,3)","v":{"$error":"#REF!"}},{"$f":"LEFT(BDD!#REF!,3)","v":{"$error":"#REF!"}},{"$f":"LEFT(BDD!BS11,3)","v":""},{"$f":"LEFT(BDD!BT11,3)","v":""},{"$f":"LEFT(BDD!BU11,3)","v":""},{"$f":"LEFT(BDD!BV11,3)","v":""},{"$f":"LEFT(BDD!BW11,3)","v":""},{"$f":"LEFT(BDD!BX11,3)","v":""},{"$f":"LEFT(BDD!BY11,3)","v":""},{"$f":"LEFT(BDD!BZ11,3)","v":""},{"$f":"LEFT(BDD!CA11,3)","v":""},{"$f":"LEFT(BDD!CB11,3)","v":""},{"$f":"LEFT(BDD!CC11,3)","v":""},{"$f":"LEFT(BDD!CD11,3)","v":""},{"$f":"LEFT(BDD!CE11,3)","v":""},{"$f":"LEFT(BDD!CF11,3)","v":""},{"$f":"LEFT(BDD!CG11,3)","v":""},{"$f":"LEFT(BDD!CH11,3)","v":""}]
[{"$f":"LEFT(BDD!A11,3)","v":"140"},{"$f":"BDD!B11","v":3},{"$f":"LEFT(BDD!C11,3)","v":""},{"$f":"LEFT(BDD!D11,3)","v":""},{"$f":"LEFT(BDD!#REF!,3)","v":{"$error":"#REF!"}},{"$f":"LEFT(BDD!E11,3)","v":""},{"$f":"LEFT(BDD!F11,3)","v":""},{"$f":"LEFT(BDD!G11,3)","v":""},{"$f":"LEFT(BDD!I11,3)","v":""},{"$f":"LEFT(BDD!J11,3)","v":""},{"$f":"LEFT(BDD!K10,3)","v":"350"},{"$f":"LEFT(BDD!L11,3)","v":""},{"$f":"LEFT(BDD!M11,3)","v":""},{"$f":"LEFT(BDD!O11,3)","v":""},{"$f":"LEFT(BDD!P11,3)","v":""},{"$f":"LEFT(BDD!R11,3)","v":""},{"$f":"LEFT(BDD!S11,3)","v":""},{"$f":"LEFT(BDD!T11,3)","v":""},{"$f":"LEFT(BDD!U11,3)","v":""},{"$f":"LEFT(BDD!V11,3)","v":""},{"$f":"LEFT(BDD!W11,3)","v":""},{"$f":"LEFT(BDD!X11,3)","v":""},{"$f":"LEFT(BDD!Y11,3)","v":""},{"$f":"LEFT(BDD!AA11,3)","v":""},{"$f":"LEFT(BDD!AB11,3)","v":""},{"$f":"LEFT(BDD!AC11,3)","v":""},{"$f":"LEFT(BDD!AD11,3)","v":""},{"$f":"LEFT(BDD!AE11,3)","v":""},{"$f":"LEFT(BDD!AG11,3)","v":""},{"$f":"LEFT(BDD!AH11,3)","v":""},{"$f":"LEFT(BDD!AJ11,3)","v":""},null,{"$f":"LEFT(BDD!#REF!,3)","v":{"$error":"#REF!"}},{"$f":"LEFT(BDD!#REF!,3)","v":{"$error":"#REF!"}},{"$f":"LEFT(BDD!AL11,3)","v":""},{"$f":"LEFT(BDD!AN11,3)","v":""},{"$f":"LEFT(BDD!#REF!,3)","v":{"$error":"#REF!"}},{"$f":"LEFT(BDD!AP11,3)","v":""},{"$f":"LEFT(BDD!AQ11,3)","v":""},{"$f":"LEFT(BDD!AR11,3)","v":""},{"$f":"LEFT(BDD!AS11,3)","v":""},{"$f":"LEFT(BDD!AT11,3)","v":""},{"$f":"LEFT(BDD!#REF!,3)","v":{"$error":"#REF!"}},{"$f":"LEFT(BDD!#REF!,3)","v":{"$error":"#REF!"}},{"$f":"LEFT(BDD!AU11,3)","v":""},{"$f":"LEFT(BDD!AW10,3)","v":"350"},{"$f":"LEFT(BDD!AX11,3)","v":""},{"$f":"LEFT(BDD!AY11,3)","v":""},{"$f":"LEFT(BDD!AZ11,3)","v":""},{"$f":"LEFT(BDD!BA11,3)","v":""},{"$f":"LEFT(BDD!BB11,3)","v":""},{"$f":"LEFT(BDD!BC11,3)","v":""},{"$f":"LEFT(BDD!BD11,3)","v":""},{"$f":"LEFT(BDD!BE11,3)","v":""},{"$f":"LEFT(BDD!BF11,3)","v":""},{"$f":"LEFT(BDD!BG11,3)","v":""},{"$f":"LEFT(BDD!BL11,3)","v":""},{"$f":"LEFT(BDD!BM11,3)","v":""},{"$f":"LEFT(BDD!BN11,3)","v":""},{"$f":"LEFT(BDD!BO11,3)","v":""},{"$f":"LEFT(BDD!BR11,3)","v":""},{"$f":"LEFT(BDD!#REF!,3)","v":{"$error":"#REF!"}},{"$f":"LEFT(BDD!#REF!,3)","v":{"$error":"#REF!"}},{"$f":"LEFT(BDD!BS12,3)","v":""},{"$f":"LEFT(BDD!BT12,3)","v":""},{"$f":"LEFT(BDD!BU12,3)","v":""},{"$f":"LEFT(BDD!BV12,3)","v":""},{"$f":"LEFT(BDD!BW12,3)","v":""},{"$f":"LEFT(BDD!BX12,3)","v":""},{"$f":"LEFT(BDD!BY12,3)","v":""},{"$f":"LEFT(BDD!BZ12,3)","v":""},{"$f":"LEFT(BDD!CA12,3)","v":""},{"$f":"LEFT(BDD!CB12,3)","v":""},{"$f":"LEFT(BDD!CC12,3)","v":""},{"$f":"LEFT(BDD!CD12,3)","v":""},{"$f":"LEFT(BDD!CE12,3)","v":""},{"$f":"LEFT(BDD!CF12,3)","v":""},{"$f":"LEFT(BDD!CG12,3)","v":""},{"$f":"LEFT(BDD!CH12,3)","v":""}]
[{"$f":"LEFT(BDD!A12,3)","v":"188"},{"$f":"BDD!B12","v":1},{"$f":"LEFT(BDD!C12,3)","v":""},{"$f":"LEFT(BDD!D12,3)","v":""},{"$f":"LEFT(BDD!#REF!,3)","v":{"$error":"#REF!"}},{"$f":"LEFT(BDD!E12,3)","v":""},{"$f":"LEFT(BDD!F12,3)","v":""},{"$f":"LEFT(BDD!G12,3)","v":""},{"$f":"LEFT(BDD!I12,3)","v":""},{"$f":"LEFT(BDD!J12,3)","v":""},{"$f":"LEFT(BDD!K11,3)","v":"360"},{"$f":"LEFT(BDD!L12,3)","v":""},{"$f":"LEFT(BDD!M12,3)","v":""},{"$f":"LEFT(BDD!O12,3)","v":""},{"$f":"LEFT(BDD!P12,3)","v":""},{"$f":"LEFT(BDD!R12,3)","v":""},{"$f":"LEFT(BDD!S12,3)","v":""},{"$f":"LEFT(BDD!T12,3)","v":""},{"$f":"LEFT(BDD!U12,3)","v":""},{"$f":"LEFT(BDD!V12,3)","v":""},{"$f":"LEFT(BDD!W12,3)","v":""},{"$f":"LEFT(BDD!X12,3)","v":""},{"$f":"LEFT(BDD!Y12,3)","v":""},{"$f":"LEFT(BDD!AA12,3)","v":""},{"$f":"LEFT(BDD!AB12,3)","v":""},{"$f":"LEFT(BDD!AC12,3)","v":""},{"$f":"LEFT(BDD!AD12,3)","v":""},{"$f":"LEFT(BDD!AE12,3)","v":""},{"$f":"LEFT(BDD!AG12,3)","v":""},{"$f":"LEFT(BDD!AH12,3)","v":""},{"$f":"LEFT(BDD!AJ12,3)","v":""},null,{"$f":"LEFT(BDD!#REF!,3)","v":{"$error":"#REF!"}},{"$f":"LEFT(BDD!#REF!,3)","v":{"$error":"#REF!"}},{"$f":"LEFT(BDD!AL12,3)","v":""},{"$f":"LEFT(BDD!AN12,3)","v":""},{"$f":"LEFT(BDD!#REF!,3)","v":{"$error":"#REF!"}},{"$f":"LEFT(BDD!AP12,3)","v":""},{"$f":"LEFT(BDD!AQ12,3)","v":""},{"$f":"LEFT(BDD!AR12,3)","v":""},{"$f":"LEFT(BDD!AS12,3)","v":""},{"$f":"LEFT(BDD!AT12,3)","v":""},{"$f":"LEFT(BDD!#REF!,3)","v":{"$error":"#REF!"}},{"$f":"LEFT(BDD!#REF!,3)","v":{"$error":"#REF!"}},{"$f":"LEFT(BDD!AU12,3)","v":""},{"$f":"LEFT(BDD!AW11,3)","v":"360"},{"$f":"LEFT(BDD!AX12,3)","v":""},{"$f":"LEFT(BDD!AY12,3)","v":""},{"$f":"LEFT(BDD!AZ12,3)","v":""},{"$f":"LEFT(BDD!BA12,3)","v":""},{"$f":"LEFT(BDD!BB12,3)","v":""},{"$f":"LEFT(BDD!BC12,3)","v":""},{"$f":"LEFT(BDD!BD12,3)","v":""},{"$f":"LEFT(BDD!BE12,3)","v":""},{"$f":"LEFT(BDD!BF12,3)","v":""},{"$f":"LEFT(BDD!BG12,3)","v":""},{"$f":"LEFT(BDD!BL12,3)","v":""},{"$f":"LEFT(BDD!BM12,3)","v":""},{"$f":"LEFT(BDD!BN12,3)","v":""},{"$f":"LEFT(BDD!BO12,3)","v":""},{"$f":"LEFT(BDD!BR12,3)","v":""},{"$f":"LEFT(BDD!#REF!,3)","v":{"$error":"#REF!"}},{"$f":"LEFT(BDD!#REF!,3)","v":{"$error":"#REF!"}},{"$f":"LEFT(BDD!BS13,3)","v":""},{"$f":"LEFT(BDD!BT13,3)","v":""},{"$f":"LEFT(BDD!BU13,3)","v":""},{"$f":"LEFT(BDD!BV13,3)","v":""},{"$f":"LEFT(BDD!BW13,3)","v":""},{"$f":"LEFT(BDD!BX13,3)","v":""},{"$f":"LEFT(BDD!BY13,3)","v":""},{"$f":"LEFT(BDD!BZ13,3)","v":""},{"$f":"LEFT(BDD!CA13,3)","v":""},{"$f":"LEFT(BDD!CB13,3)","v":""},{"$f":"LEFT(BDD!CC13,3)","v":""},{"$f":"LEFT(BDD!CD13,3)","v":""},{"$f":"LEFT(BDD!CE13,3)","v":""},{"$f":"LEFT(BDD!CF13,3)","v":""},{"$f":"LEFT(BDD!CG13,3)","v":""},{"$f":"LEFT(BDD!CH13,3)","v":""}]
[{"$f":"LEFT(BDD!A14,3)","v":"246"},{"$f":"BDD!B14","v":1},{"$f":"LEFT(BDD!C13,3)","v":""},{"$f":"LEFT(BDD!D13,3)","v":""},{"$f":"LEFT(BDD!#REF!,3)","v":{"$error":"#REF!"}},{"$f":"LEFT(BDD!E13,3)","v":""},{"$f":"LEFT(BDD!F13,3)","v":""},{"$f":"LEFT(BDD!G13,3)","v":""},{"$f":"LEFT(BDD!I13,3)","v":""},{"$f":"LEFT(BDD!J13,3)","v":""},{"$f":"LEFT(BDD!K12,3)","v":"368"},{"$f":"LEFT(BDD!L13,3)","v":""},{"$f":"LEFT(BDD!M13,3)","v":""},{"$f":"LEFT(BDD!O13,3)","v":""},{"$f":"LEFT(BDD!P13,3)","v":""},{"$f":"LEFT(BDD!R13,3)","v":""},{"$f":"LEFT(BDD!S13,3)","v":""},{"$f":"LEFT(BDD!T13,3)","v":""},{"$f":"LEFT(BDD!U13,3)","v":""},{"$f":"LEFT(BDD!V13,3)","v":""},{"$f":"LEFT(BDD!W13,3)","v":""},{"$f":"LEFT(BDD!X13,3)","v":""},{"$f":"LEFT(BDD!Y13,3)","v":""},{"$f":"LEFT(BDD!AA13,3)","v":""},{"$f":"LEFT(BDD!AB13,3)","v":""},{"$f":"LEFT(BDD!AC13,3)","v":""},{"$f":"LEFT(BDD!AD13,3)","v":""},{"$f":"LEFT(BDD!AE13,3)","v":""},{"$f":"LEFT(BDD!AG13,3)","v":""},{"$f":"LEFT(BDD!AH13,3)","v":""},{"$f":"LEFT(BDD!AJ13,3)","v":""},null,{"$f":"LEFT(BDD!#REF!,3)","v":{"$error":"#REF!"}},{"$f":"LEFT(BDD!#REF!,3)","v":{"$error":"#REF!"}},{"$f":"LEFT(BDD!AL13,3)","v":""},{"$f":"LEFT(BDD!AN13,3)","v":""},{"$f":"LEFT(BDD!#REF!,3)","v":{"$error":"#REF!"}},{"$f":"LEFT(BDD!AP13,3)","v":""},{"$f":"LEFT(BDD!AQ13,3)","v":""},{"$f":"LEFT(BDD!AR13,3)","v":""},{"$f":"LEFT(BDD!AS13,3)","v":""},{"$f":"LEFT(BDD!AT13,3)","v":""},{"$f":"LEFT(BDD!#REF!,3)","v":{"$error":"#REF!"}},{"$f":"LEFT(BDD!#REF!,3)","v":{"$error":"#REF!"}},{"$f":"LEFT(BDD!AU13,3)","v":""},{"$f":"LEFT(BDD!AW12,3)","v":"368"},{"$f":"LEFT(BDD!AX13,3)","v":""},{"$f":"LEFT(BDD!AY13,3)","v":""},{"$f":"LEFT(BDD!AZ13,3)","v":""},{"$f":"LEFT(BDD!BA13,3)","v":""},{"$f":"LEFT(BDD!BB13,3)","v":""},{"$f":"LEFT(BDD!BC13,3)","v":""},{"$f":"LEFT(BDD!BD13,3)","v":""},{"$f":"LEFT(BDD!BE13,3)","v":""},{"$f":"LEFT(BDD!BF13,3)","v":""},{"$f":"LEFT(BDD!BG13,3)","v":""},{"$f":"LEFT(BDD!BL13,3)","v":""},{"$f":"LEFT(BDD!BM13,3)","v":""},{"$f":"LEFT(BDD!BN13,3)","v":""},{"$f":"LEFT(BDD!BO13,3)","v":""},{"$f":"LEFT(BDD!BR13,3)","v":""},{"$f":"LEFT(BDD!#REF!,3)","v":{"$error":"#REF!"}},{"$f":"LEFT(BDD!#REF!,3)","v":{"$error":"#REF!"}},{"$f":"LEFT(BDD!BS14,3)","v":""},{"$f":"LEFT(BDD!BT14,3)","v":""},{"$f":"LEFT(BDD!BU14,3)","v":""},{"$f":"LEFT(BDD!BV14,3)","v":""},{"$f":"LEFT(BDD!BW14,3)","v":""},{"$f":"LEFT(BDD!BX14,3)","v":""},{"$f":"LEFT(BDD!BY14,3)","v":""},{"$f":"LEFT(BDD!BZ14,3)","v":""},{"$f":"LEFT(BDD!CA14,3)","v":""},{"$f":"LEFT(BDD!CB14,3)","v":""},{"$f":"LEFT(BDD!CC14,3)","v":""},{"$f":"LEFT(BDD!CD14,3)","v":""},{"$f":"LEFT(BDD!CE14,3)","v":""},{"$f":"LEFT(BDD!CF14,3)","v":""},{"$f":"LEFT(BDD!CG14,3)","v":""},{"$f":"LEFT(BDD!CH14,3)","v":""}]
[{"$f":"LEFT(BDD!A15,3)","v":"247"},{"$f":"BDD!B15","v":1},{"$f":"LEFT(BDD!C14,3)","v":""},{"$f":"LEFT(BDD!D14,3)","v":""},{"$f":"LEFT(BDD!#REF!,3)","v":{"$error":"#REF!"}},{"$f":"LEFT(BDD!E14,3)","v":""},{"$f":"LEFT(BDD!F14,3)","v":""},{"$f":"LEFT(BDD!G14,3)","v":""},{"$f":"LEFT(BDD!I14,3)","v":""},{"$f":"LEFT(BDD!J14,3)","v":""},{"$f":"LEFT(BDD!K13,3)","v":"380"},{"$f":"LEFT(BDD!L14,3)","v":""},{"$f":"LEFT(BDD!M14,3)","v":""},{"$f":"LEFT(BDD!O14,3)","v":""},{"$f":"LEFT(BDD!P14,3)","v":""},{"$f":"LEFT(BDD!R14,3)","v":""},{"$f":"LEFT(BDD!S14,3)","v":""},{"$f":"LEFT(BDD!T14,3)","v":""},{"$f":"LEFT(BDD!U14,3)","v":""},{"$f":"LEFT(BDD!V14,3)","v":""},{"$f":"LEFT(BDD!W14,3)","v":""},{"$f":"LEFT(BDD!X14,3)","v":""},{"$f":"LEFT(BDD!Y14,3)","v":""},{"$f":"LEFT(BDD!AA14,3)","v":""},{"$f":"LEFT(BDD!AB14,3)","v":""},{"$f":"LEFT(BDD!AC14,3)","v":""},{"$f":"LEFT(BDD!AD14,3)","v":""},{"$f":"LEFT(BDD!AE14,3)","v":""},{"$f":"LEFT(BDD!AG14,3)","v":""},{"$f":"LEFT(BDD!AH14,3)","v":""},{"$f":"LEFT(BDD!AJ14,3)","v":""},null,{"$f":"LEFT(BDD!#REF!,3)","v":{"$error":"#REF!"}},{"$f":"LEFT(BDD!#REF!,3)","v":{"$error":"#REF!"}},{"$f":"LEFT(BDD!AL14,3)","v":""},{"$f":"LEFT(BDD!AN14,3)","v":""},{"$f":"LEFT(BDD!#REF!,3)","v":{"$error":"#REF!"}},{"$f":"LEFT(BDD!AP14,3)","v":""},{"$f":"LEFT(BDD!AQ14,3)","v":""},{"$f":"LEFT(BDD!AR14,3)","v":""},{"$f":"LEFT(BDD!AS14,3)","v":""},{"$f":"LEFT(BDD!AT14,3)","v":""},{"$f":"LEFT(BDD!#REF!,3)","v":{"$error":"#REF!"}},{"$f":"LEFT(BDD!#REF!,3)","v":{"$error":"#REF!"}},{"$f":"LEFT(BDD!AU14,3)","v":""},{"$f":"LEFT(BDD!AW13,3)","v":"380"},{"$f":"LEFT(BDD!AX14,3)","v":""},{"$f":"LEFT(BDD!AY14,3)","v":""},{"$f":"LEFT(BDD!AZ14,3)","v":""},{"$f":"LEFT(BDD!BA14,3)","v":""},{"$f":"LEFT(BDD!BB14,3)","v":""},{"$f":"LEFT(BDD!BC14,3)","v":""},{"$f":"LEFT(BDD!BD14,3)","v":""},{"$f":"LEFT(BDD!BE14,3)","v":""},{"$f":"LEFT(BDD!BF14,3)","v":""},{"$f":"LEFT(BDD!BG14,3)","v":""},{"$f":"LEFT(BDD!BL14,3)","v":""},{"$f":"LEFT(BDD!BM14,3)","v":""},{"$f":"LEFT(BDD!BN14,3)","v":""},{"$f":"LEFT(BDD!BO14,3)","v":""},{"$f":"LEFT(BDD!BR14,3)","v":""},{"$f":"LEFT(BDD!#REF!,3)","v":{"$error":"#REF!"}},{"$f":"LEFT(BDD!#REF!,3)","v":{"$error":"#REF!"}},{"$f":"LEFT(BDD!BS15,3)","v":""},{"$f":"LEFT(BDD!BT15,3)","v":""},{"$f":"LEFT(BDD!BU15,3)","v":""},{"$f":"LEFT(BDD!BV15,3)","v":""},{"$f":"LEFT(BDD!BW15,3)","v":""},{"$f":"LEFT(BDD!BX15,3)","v":""},{"$f":"LEFT(BDD!BY15,3)","v":""},{"$f":"LEFT(BDD!BZ15,3)","v":""},{"$f":"LEFT(BDD!CA15,3)","v":""},{"$f":"LEFT(BDD!CB15,3)","v":""},{"$f":"LEFT(BDD!CC15,3)","v":""},{"$f":"LEFT(BDD!CD15,3)","v":""},{"$f":"LEFT(BDD!CE15,3)","v":""},{"$f":"LEFT(BDD!CF15,3)","v":""},{"$f":"LEFT(BDD!CG15,3)","v":""},{"$f":"LEFT(BDD!CH15,3)","v":""}]
[{"$f":"LEFT(BDD!A17,3)","v":"320"},{"$f":"BDD!B17","v":1},{"$f":"LEFT(BDD!C15,3)","v":""},{"$f":"LEFT(BDD!D15,3)","v":""},{"$f":"LEFT(BDD!#REF!,3)","v":{"$error":"#REF!"}},{"$f":"LEFT(BDD!E15,3)","v":""},{"$f":"LEFT(BDD!F15,3)","v":""},{"$f":"LEFT(BDD!G15,3)","v":""},{"$f":"LEFT(BDD!I15,3)","v":""},{"$f":"LEFT(BDD!J15,3)","v":""},{"$f":"LEFT(BDD!K14,3)","v":"510"},{"$f":"LEFT(BDD!L15,3)","v":""},{"$f":"LEFT(BDD!M15,3)","v":""},{"$f":"LEFT(BDD!O15,3)","v":""},{"$f":"LEFT(BDD!P15,3)","v":""},{"$f":"LEFT(BDD!R15,3)","v":""},{"$f":"LEFT(BDD!S15,3)","v":""},{"$f":"LEFT(BDD!T15,3)","v":""},{"$f":"LEFT(BDD!U15,3)","v":""},{"$f":"LEFT(BDD!V15,3)","v":""},{"$f":"LEFT(BDD!W15,3)","v":""},{"$f":"LEFT(BDD!X15,3)","v":""},{"$f":"LEFT(BDD!Y15,3)","v":""},{"$f":"LEFT(BDD!AA15,3)","v":""},{"$f":"LEFT(BDD!AB15,3)","v":""},{"$f":"LEFT(BDD!AC15,3)","v":""},{"$f":"LEFT(BDD!AD15,3)","v":""},{"$f":"LEFT(BDD!AE15,3)","v":""},{"$f":"LEFT(BDD!AG15,3)","v":""},{"$f":"LEFT(BDD!AH15,3)","v":""},{"$f":"LEFT(BDD!AJ15,3)","v":""},null,{"$f":"LEFT(BDD!#REF!,3)","v":{"$error":"#REF!"}},{"$f":"LEFT(BDD!#REF!,3)","v":{"$error":"#REF!"}},{"$f":"LEFT(BDD!AL15,3)","v":""},{"$f":"LEFT(BDD!AN15,3)","v":""},{"$f":"LEFT(BDD!#REF!,3)","v":{"$error":"#REF!"}},{"$f":"LEFT(BDD!AP15,3)","v":""},{"$f":"LEFT(BDD!AQ15,3)","v":""},{"$f":"LEFT(BDD!AR15,3)","v":""},{"$f":"LEFT(BDD!AS15,3)","v":""},{"$f":"LEFT(BDD!AT15,3)","v":""},{"$f":"LEFT(BDD!#REF!,3)","v":{"$error":"#REF!"}},{"$f":"LEFT(BDD!#REF!,3)","v":{"$error":"#REF!"}},{"$f":"LEFT(BDD!AU15,3)","v":""},{"$f":"LEFT(BDD!AW14,3)","v":"510"},{"$f":"LEFT(BDD!AX15,3)","v":""},{"$f":"LEFT(BDD!AY15,3)","v":""},{"$f":"LEFT(BDD!AZ15,3)","v":""},{"$f":"LEFT(BDD!BA15,3)","v":""},{"$f":"LEFT(BDD!BB15,3)","v":""},{"$f":"LEFT(BDD!BC15,3)","v":""},{"$f":"LEFT(BDD!BD15,3)","v":""},{"$f":"LEFT(BDD!BE15,3)","v":""},{"$f":"LEFT(BDD!BF15,3)","v":""},{"$f":"LEFT(BDD!BG15,3)","v":""},{"$f":"LEFT(BDD!BL15,3)","v":""},{"$f":"LEFT(BDD!BM15,3)","v":""},{"$f":"LEFT(BDD!BN15,3)","v":""},{"$f":"LEFT(BDD!BO15,3)","v":""},{"$f":"LEFT(BDD!BR15,3)","v":""},{"$f":"LEFT(BDD!#REF!,3)","v":{"$error":"#REF!"}},{"$f":"LEFT(BDD!#REF!,3)","v":{"$error":"#REF!"}},{"$f":"LEFT(BDD!BS16,3)","v":""},{"$f":"LEFT(BDD!BT16,3)","v":""},{"$f":"LEFT(BDD!BU16,3)","v":""},{"$f":"LEFT(BDD!BV16,3)","v":""},{"$f":"LEFT(BDD!BW16,3)","v":""},{"$f":"LEFT(BDD!BX16,3)","v":""},{"$f":"LEFT(BDD!BY16,3)","v":""},{"$f":"LEFT(BDD!BZ16,3)","v":""},{"$f":"LEFT(BDD!CA16,3)","v":""},{"$f":"LEFT(BDD!CB16,3)","v":""},{"$f":"LEFT(BDD!CC16,3)","v":""},{"$f":"LEFT(BDD!CD16,3)","v":""},{"$f":"LEFT(BDD!CE16,3)","v":""},{"$f":"LEFT(BDD!CF16,3)","v":""},{"$f":"LEFT(BDD!CG16,3)","v":""},{"$f":"LEFT(BDD!CH16,3)","v":""}]
[{"$f":"LEFT(BDD!A18,3)","v":"321"},{"$f":"BDD!B18","v":1},{"$f":"LEFT(BDD!C16,3)","v":""},{"$f":"LEFT(BDD!D16,3)","v":""},{"$f":"LEFT(BDD!#REF!,3)","v":{"$error":"#REF!"}},{"$f":"LEFT(BDD!E16,3)","v":""},{"$f":"LEFT(BDD!F16,3)","v":""},{"$f":"LEFT(BDD!G16,3)","v":""},{"$f":"LEFT(BDD!I16,3)","v":""},{"$f":"LEFT(BDD!J16,3)","v":""},{"$f":"LEFT(BDD!K15,3)","v":"520"},{"$f":"LEFT(BDD!L16,3)","v":""},{"$f":"LEFT(BDD!M16,3)","v":""},{"$f":"LEFT(BDD!O16,3)","v":""},{"$f":"LEFT(BDD!P16,3)","v":""},{"$f":"LEFT(BDD!R16,3)","v":""},{"$f":"LEFT(BDD!S16,3)","v":""},{"$f":"LEFT(BDD!T16,3)","v":""},{"$f":"LEFT(BDD!U16,3)","v":""},{"$f":"LEFT(BDD!V16,3)","v":""},{"$f":"LEFT(BDD!W16,3)","v":""},{"$f":"LEFT(BDD!X16,3)","v":""},{"$f":"LEFT(BDD!Y16,3)","v":""},{"$f":"LEFT(BDD!AA16,3)","v":""},{"$f":"LEFT(BDD!AB16,3)","v":""},{"$f":"LEFT(BDD!AC16,3)","v":""},{"$f":"LEFT(BDD!AD16,3)","v":""},{"$f":"LEFT(BDD!AE16,3)","v":""},{"$f":"LEFT(BDD!AG16,3)","v":""},{"$f":"LEFT(BDD!AH16,3)","v":""},{"$f":"LEFT(BDD!AJ16,3)","v":""},null,{"$f":"LEFT(BDD!#REF!,3)","v":{"$error":"#REF!"}},{"$f":"LEFT(BDD!#REF!,3)","v":{"$error":"#REF!"}},{"$f":"LEFT(BDD!AL16,3)","v":""},{"$f":"LEFT(BDD!AN16,3)","v":""},{"$f":"LEFT(BDD!#REF!,3)","v":{"$error":"#REF!"}},{"$f":"LEFT(BDD!AP16,3)","v":""},{"$f":"LEFT(BDD!AQ16,3)","v":""},{"$f":"LEFT(BDD!AR16,3)","v":""},{"$f":"LEFT(BDD!AS16,3)","v":""},{"$f":"LEFT(BDD!AT16,3)","v":""},{"$f":"LEFT(BDD!#REF!,3)","v":{"$error":"#REF!"}},{"$f":"LEFT(BDD!#REF!,3)","v":{"$error":"#REF!"}},{"$f":"LEFT(BDD!AU16,3)","v":""},{"$f":"LEFT(BDD!AW15,3)","v":"520"},{"$f":"LEFT(BDD!AX16,3)","v":""},{"$f":"LEFT(BDD!AY16,3)","v":""},{"$f":"LEFT(BDD!AZ16,3)","v":""},{"$f":"LEFT(BDD!BA16,3)","v":""},{"$f":"LEFT(BDD!BB16,3)","v":""},{"$f":"LEFT(BDD!BC16,3)","v":""},{"$f":"LEFT(BDD!BD16,3)","v":""},{"$f":"LEFT(BDD!BE16,3)","v":""},{"$f":"LEFT(BDD!BF16,3)","v":""},{"$f":"LEFT(BDD!BG16,3)","v":""},{"$f":"LEFT(BDD!BL16,3)","v":""},{"$f":"LEFT(BDD!BM16,3)","v":""},{"$f":"LEFT(BDD!BN16,3)","v":""},{"$f":"LEFT(BDD!BO16,3)","v":""},{"$f":"LEFT(BDD!BR16,3)","v":""},{"$f":"LEFT(BDD!#REF!,3)","v":{"$error":"#REF!"}},{"$f":"LEFT(BDD!#REF!,3)","v":{"$error":"#REF!"}},{"$f":"LEFT(BDD!BS17,3)","v":""},{"$f":"LEFT(BDD!BT17,3)","v":""},{"$f":"LEFT(BDD!BU17,3)","v":""},{"$f":"LEFT(BDD!BV17,3)","v":""},{"$f":"LEFT(BDD!BW17,3)","v":""},{"$f":"LEFT(BDD!BX17,3)","v":""},{"$f":"LEFT(BDD!BY17,3)","v":""},{"$f":"LEFT(BDD!BZ17,3)","v":""},{"$f":"LEFT(BDD!CA17,3)","v":""},{"$f":"LEFT(BDD!CB17,3)","v":""},{"$f":"LEFT(BDD!CC17,3)","v":""},{"$f":"LEFT(BDD!CD17,3)","v":""},{"$f":"LEFT(BDD!CE17,3)","v":""},{"$f":"LEFT(BDD!CF17,3)","v":""},{"$f":"LEFT(BDD!CG17,3)","v":""},{"$f":"LEFT(BDD!CH17,3)","v":""}]
[{"$f":"LEFT(BDD!A19,3)","v":"323"},{"$f":"BDD!B19","v":1},{"$f":"LEFT(BDD!C17,3)","v":""},{"$f":"LEFT(BDD!D17,3)","v":""},{"$f":"LEFT(BDD!#REF!,3)","v":{"$error":"#REF!"}},{"$f":"LEFT(BDD!E17,3)","v":""},{"$f":"LEFT(BDD!F17,3)","v":""},{"$f":"LEFT(BDD!G17,3)","v":""},{"$f":"LEFT(BDD!I17,3)","v":""},{"$f":"LEFT(BDD!J17,3)","v":""},{"$f":"LEFT(BDD!K16,3)","v":"560"},{"$f":"LEFT(BDD!L17,3)","v":""},{"$f":"LEFT(BDD!M17,3)","v":""},{"$f":"LEFT(BDD!O17,3)","v":""},{"$f":"LEFT(BDD!P17,3)","v":""},{"$f":"LEFT(BDD!R17,3)","v":""},{"$f":"LEFT(BDD!S17,3)","v":""},{"$f":"LEFT(BDD!T17,3)","v":""},{"$f":"LEFT(BDD!U17,3)","v":""},{"$f":"LEFT(BDD!V17,3)","v":""},{"$f":"LEFT(BDD!W17,3)","v":""},{"$f":"LEFT(BDD!X17,3)","v":""},{"$f":"LEFT(BDD!Y17,3)","v":""},{"$f":"LEFT(BDD!AA17,3)","v":""},{"$f":"LEFT(BDD!AB17,3)","v":""},{"$f":"LEFT(BDD!AC17,3)","v":""},{"$f":"LEFT(BDD!AD17,3)","v":""},{"$f":"LEFT(BDD!AE17,3)","v":""},{"$f":"LEFT(BDD!AG17,3)","v":""},{"$f":"LEFT(BDD!AH17,3)","v":""},{"$f":"LEFT(BDD!AJ17,3)","v":""},null,{"$f":"LEFT(BDD!#REF!,3)","v":{"$error":"#REF!"}},{"$f":"LEFT(BDD!#REF!,3)","v":{"$error":"#REF!"}},{"$f":"LEFT(BDD!AL17,3)","v":""},{"$f":"LEFT(BDD!AN17,3)","v":""},{"$f":"LEFT(BDD!#REF!,3)","v":{"$error":"#REF!"}},{"$f":"LEFT(BDD!AP17,3)","v":""},{"$f":"LEFT(BDD!AQ17,3)","v":""},{"$f":"LEFT(BDD!AR17,3)","v":""},{"$f":"LEFT(BDD!AS17,3)","v":""},{"$f":"LEFT(BDD!AT17,3)","v":""},{"$f":"LEFT(BDD!#REF!,3)","v":{"$error":"#REF!"}},{"$f":"LEFT(BDD!#REF!,3)","v":{"$error":"#REF!"}},{"$f":"LEFT(BDD!AU17,3)","v":""},{"$f":"LEFT(BDD!AW16,3)","v":"560"},{"$f":"LEFT(BDD!AX17,3)","v":""},{"$f":"LEFT(BDD!AY17,3)","v":""},{"$f":"LEFT(BDD!AZ17,3)","v":""},{"$f":"LEFT(BDD!BA17,3)","v":""},{"$f":"LEFT(BDD!BB17,3)","v":""},{"$f":"LEFT(BDD!BC17,3)","v":""},{"$f":"LEFT(BDD!BD17,3)","v":""},{"$f":"LEFT(BDD!BE17,3)","v":""},{"$f":"LEFT(BDD!BF17,3)","v":""},{"$f":"LEFT(BDD!BG17,3)","v":""},{"$f":"LEFT(BDD!BL17,3)","v":""},{"$f":"LEFT(BDD!BM17,3)","v":""},{"$f":"LEFT(BDD!BN17,3)","v":""},{"$f":"LEFT(BDD!BO17,3)","v":""},{"$f":"LEFT(BDD!BR17,3)","v":""},{"$f":"LEFT(BDD!#REF!,3)","v":{"$error":"#REF!"}},{"$f":"LEFT(BDD!#REF!,3)","v":{"$error":"#REF!"}},{"$f":"LEFT(BDD!BS18,3)","v":""},{"$f":"LEFT(BDD!BT18,3)","v":""},{"$f":"LEFT(BDD!BU18,3)","v":""},{"$f":"LEFT(BDD!BV18,3)","v":""},{"$f":"LEFT(BDD!BW18,3)","v":""},{"$f":"LEFT(BDD!BX18,3)","v":""},{"$f":"LEFT(BDD!BY18,3)","v":""},{"$f":"LEFT(BDD!BZ18,3)","v":""},{"$f":"LEFT(BDD!CA18,3)","v":""},{"$f":"LEFT(BDD!CB18,3)","v":""},{"$f":"LEFT(BDD!CC18,3)","v":""},{"$f":"LEFT(BDD!CD18,3)","v":""},{"$f":"LEFT(BDD!CE18,3)","v":""},{"$f":"LEFT(BDD!CF18,3)","v":""},{"$f":"LEFT(BDD!CG18,3)","v":""},{"$f":"LEFT(BDD!CH18,3)","v":""}]
[{"$f":"LEFT(BDD!A20,3)","v":"328"},{"$f":"BDD!B20","v":1},{"$f":"LEFT(BDD!C18,3)","v":""},{"$f":"LEFT(BDD!D18,3)","v":""},{"$f":"LEFT(BDD!#REF!,3)","v":{"$error":"#REF!"}},{"$f":"LEFT(BDD!E18,3)","v":""},{"$f":"LEFT(BDD!F18,3)","v":""},{"$f":"LEFT(BDD!G18,3)","v":""},{"$f":"LEFT(BDD!I18,3)","v":""},{"$f":"LEFT(BDD!J18,3)","v":""},{"$f":"LEFT(BDD!#REF!,3)","v":{"$error":"#REF!"}},{"$f":"LEFT(BDD!#REF!,3)","v":{"$error":"#REF!"}},{"$f":"LEFT(BDD!#REF!,3)","v":{"$error":"#REF!"}},{"$f":"LEFT(BDD!#REF!,3)","v":{"$error":"#REF!"}},{"$f":"LEFT(BDD!#REF!,3)","v":{"$error":"#REF!"}},{"$f":"LEFT(BDD!#REF!,3)","v":{"$error":"#REF!"}},{"$f":"LEFT(BDD!#REF!,3)","v":{"$error":"#REF!"}},{"$f":"LEFT(BDD!#REF!,3)","v":{"$error":"#REF!"}},{"$f":"LEFT(BDD!#REF!,3)","v":{"$error":"#REF!"}},{"$f":"LEFT(BDD!#REF!,3)","v":{"$error":"#REF!"}},{"$f":"LEFT(BDD!W18,3)","v":""},{"$f":"LEFT(BDD!X18,3)","v":""},{"$f":"LEFT(BDD!Y18,3)","v":""},{"$f":"LEFT(BDD!AA18,3)","v":""},{"$f":"LEFT(BDD!AB18,3)","v":""},{"$f":"LEFT(BDD!AC18,3)","v":""},{"$f":"LEFT(BDD!AD18,3)","v":""},{"$f":"LEFT(BDD!AE18,3)","v":""},{"$f":"LEFT(BDD!AG18,3)","v":""},{"$f":"LEFT(BDD!AH18,3)","v":""},{"$f":"LEFT(BDD!AJ18,3)","v":""},null,{"$f":"LEFT(BDD!#REF!,3)","v":{"$error":"#REF!"}},{"$f":"LEFT(BDD!#REF!,3)","v":{"$error":"#REF!"}},{"$f":"LEFT(BDD!AL18,3)","v":""},{"$f":"LEFT(BDD!AN18,3)","v":""},{"$f":"LEFT(BDD!#REF!,3)","v":{"$error":"#REF!"}},{"$f":"LEFT(BDD!AP18,3)","v":""},{"$f":"LEFT(BDD!AQ18,3)","v":""},{"$f":"LEFT(BDD!AR18,3)","v":""},{"$f":"LEFT(BDD!AS18,3)","v":""},{"$f":"LEFT(BDD!AT18,3)","v":""},{"$f":"LEFT(BDD!#REF!,3)","v":{"$error":"#REF!"}},{"$f":"LEFT(BDD!#REF!,3)","v":{"$error":"#REF!"}},{"$f":"LEFT(BDD!AU18,3)","v":""},{"$f":"LEFT(BDD!#REF!,3)","v":{"$error":"#REF!"}},{"$f":"LEFT(BDD!#REF!,3)","v":{"$error":"#REF!"}},{"$f":"LEFT(BDD!#REF!,3)","v":{"$error":"#REF!"}},{"$f":"LEFT(BDD!#REF!,3)","v":{"$error":"#REF!"}},{"$f":"LEFT(BDD!#REF!,3)","v":{"$error":"#REF!"}},{"$f":"LEFT(BDD!#REF!,3)","v":{"$error":"#REF!"}},{"$f":"LEFT(BDD!#REF!,3)","v":{"$error":"#REF!"}},{"$f":"LEFT(BDD!#REF!,3)","v":{"$error":"#REF!"}},{"$f":"LEFT(BDD!#REF!,3)","v":{"$error":"#REF!"}},{"$f":"LEFT(BDD!BF18,3)","v":""},{"$f":"LEFT(BDD!BG18,3)","v":""},{"$f":"LEFT(BDD!BL18,3)","v":""},{"$f":"LEFT(BDD!BM18,3)","v":""},{"$f":"LEFT(BDD!BN18,3)","v":""},{"$f":"LEFT(BDD!BO18,3)","v":""},{"$f":"LEFT(BDD!BR18,3)","v":""},{"$f":"LEFT(BDD!#REF!,3)","v":{"$error":"#REF!"}},{"$f":"LEFT(BDD!#REF!,3)","v":{"$error":"#REF!"}},{"$f":"LEFT(BDD!BS19,3)","v":""},{"$f":"LEFT(BDD!BT19,3)","v":""},{"$f":"LEFT(BDD!BU19,3)","v":""},{"$f":"LEFT(BDD!BV19,3)","v":""},{"$f":"LEFT(BDD!BW19,3)","v":""},{"$f":"LEFT(BDD!BX19,3)","v":""},{"$f":"LEFT(BDD!BY19,3)","v":""},{"$f":"LEFT(BDD!BZ19,3)","v":""},{"$f":"LEFT(BDD!CA19,3)","v":""},{"$f":"LEFT(BDD!CB19,3)","v":""},{"$f":"LEFT(BDD!CC19,3)","v":""},{"$f":"LEFT(BDD!CD19,3)","v":""},{"$f":"LEFT(BDD!CE19,3)","v":""},{"$f":"LEFT(BDD!CF19,3)","v":""},{"$f":"LEFT(BDD!CG19,3)","v":""},{"$f":"LEFT(BDD!CH19,3)","v":""}]
[{"$f":"LEFT(BDD!A21,3)","v":"344"},{"$f":"BDD!B21","v":1},{"$f":"LEFT(BDD!C19,3)","v":""},{"$f":"LEFT(BDD!D19,3)","v":""},{"$f":"LEFT(BDD!#REF!,3)","v":{"$error":"#REF!"}},{"$f":"LEFT(BDD!E19,3)","v":""},{"$f":"LEFT(BDD!F19,3)","v":""},{"$f":"LEFT(BDD!G19,3)","v":""},{"$f":"LEFT(BDD!I19,3)","v":""},{"$f":"LEFT(BDD!J19,3)","v":""},{"$f":"LEFT(BDD!#REF!,3)","v":{"$error":"#REF!"}},{"$f":"LEFT(BDD!#REF!,3)","v":{"$error":"#REF!"}},{"$f":"LEFT(BDD!#REF!,3)","v":{"$error":"#REF!"}},{"$f":"LEFT(BDD!#REF!,3)","v":{"$error":"#REF!"}},{"$f":"LEFT(BDD!#REF!,3)","v":{"$error":"#REF!"}},{"$f":"LEFT(BDD!#REF!,3)","v":{"$error":"#REF!"}},{"$f":"LEFT(BDD!S18,3)","v":""},{"$f":"LEFT(BDD!T18,3)","v":""},{"$f":"LEFT(BDD!U18,3)","v":""},{"$f":"LEFT(BDD!V18,3)","v":""},{"$f":"LEFT(BDD!W19,3)","v":""},{"$f":"LEFT(BDD!X19,3)","v":""},{"$f":"LEFT(BDD!Y19,3)","v":""},{"$f":"LEFT(BDD!AA19,3)","v":""},{"$f":"LEFT(BDD!AB19,3)","v":""},{"$f":"LEFT(BDD!AC19,3)","v":""},{"$f":"LEFT(BDD!AD19,3)","v":""},{"$f":"LEFT(BDD!AE19,3)","v":""},{"$f":"LEFT(BDD!AG19,3)","v":""},{"$f":"LEFT(BDD!AH19,3)","v":""},{"$f":"LEFT(BDD!AJ19,3)","v":""},null,{"$f":"LEFT(BDD!#REF!,3)","v":{"$error":"#REF!"}},{"$f":"LEFT(BDD!#REF!,3)","v":{"$error":"#REF!"}},{"$f":"LEFT(BDD!AL19,3)","v":""},{"$f":"LEFT(BDD!AN19,3)","v":""},{"$f":"LEFT(BDD!#REF!,3)","v":{"$error":"#REF!"}},{"$f":"LEFT(BDD!AP19,3)","v":""},{"$f":"LEFT(BDD!AQ19,3)","v":""},{"$f":"LEFT(BDD!AR19,3)","v":""},{"$f":"LEFT(BDD!AS19,3)","v":""},{"$f":"LEFT(BDD!AT19,3)","v":""},{"$f":"LEFT(BDD!#REF!,3)","v":{"$error":"#REF!"}},{"$f":"LEFT(BDD!#REF!,3)","v":{"$error":"#REF!"}},{"$f":"LEFT(BDD!AU19,3)","v":""},{"$f":"LEFT(BDD!#REF!,3)","v":{"$error":"#REF!"}},{"$f":"LEFT(BDD!AX18,3)","v":""},{"$f":"LEFT(BDD!AY18,3)","v":""},{"$f":"LEFT(BDD!AZ18,3)","v":""},{"$f":"LEFT(BDD!BA18,3)","v":""},{"$f":"LEFT(BDD!BB18,3)","v":""},{"$f":"LEFT(BDD!BC18,3)","v":""},{"$f":"LEFT(BDD!BD18,3)","v":""},{"$f":"LEFT(BDD!BE18,3)","v":""},{"$f":"LEFT(BDD!BF19,3)","v":""},{"$f":"LEFT(BDD!BG19,3)","v":""},{"$f":"LEFT(BDD!BL19,3)","v":""},{"$f":"LEFT(BDD!BM19,3)","v":""},{"$f":"LEFT(BDD!BN19,3)","v":""},{"$f":"LEFT(BDD!BO19,3)","v":""},{"$f":"LEFT(BDD!BR19,3)","v":""},{"$f":"LEFT(BDD!#REF!,3)","v":{"$error":"#REF!"}},{"$f":"LEFT(BDD!#REF!,3)","v":{"$error":"#REF!"}},{"$f":"LEFT(BDD!BS20,3)","v":""},{"$f":"LEFT(BDD!BT20,3)","v":""},{"$f":"LEFT(BDD!BU20,3)","v":""},{"$f":"LEFT(BDD!BV20,3)","v":""},{"$f":"LEFT(BDD!BW20,3)","v":""},{"$f":"LEFT(BDD!BX20,3)","v":""},{"$f":"LEFT(BDD!BY20,3)","v":""},{"$f":"LEFT(BDD!BZ20,3)","v":""},{"$f":"LEFT(BDD!CA20,3)","v":""},{"$f":"LEFT(BDD!CB20,3)","v":""},{"$f":"LEFT(BDD!CC20,3)","v":""},{"$f":"LEFT(BDD!CD20,3)","v":""},{"$f":"LEFT(BDD!CE20,3)","v":""},{"$f":"LEFT(BDD!CF20,3)","v":""},{"$f":"LEFT(BDD!CG20,3)","v":""},{"$f":"LEFT(BDD!CH20,3)","v":""}]
[{"$f":"LEFT(BDD!A22,3)","v":"367"},{"$f":"BDD!B22","v":1},{"$f":"LEFT(BDD!C20,3)","v":""},{"$f":"LEFT(BDD!D20,3)","v":""},{"$f":"LEFT(BDD!#REF!,3)","v":{"$error":"#REF!"}},{"$f":"LEFT(BDD!E20,3)","v":""},{"$f":"LEFT(BDD!F20,3)","v":""},{"$f":"LEFT(BDD!G20,3)","v":""},{"$f":"LEFT(BDD!I20,3)","v":""},{"$f":"LEFT(BDD!J20,3)","v":""},{"$f":"LEFT(BDD!K17,3)","v":"730"},{"$f":"LEFT(BDD!L18,3)","v":""},{"$f":"LEFT(BDD!M18,3)","v":""},{"$f":"LEFT(BDD!O18,3)","v":""},{"$f":"LEFT(BDD!P18,3)","v":""},{"$f":"LEFT(BDD!R18,3)","v":""},{"$f":"LEFT(BDD!S19,3)","v":""},{"$f":"LEFT(BDD!T19,3)","v":""},{"$f":"LEFT(BDD!U19,3)","v":""},{"$f":"LEFT(BDD!V19,3)","v":""},{"$f":"LEFT(BDD!W20,3)","v":""},{"$f":"LEFT(BDD!X20,3)","v":""},{"$f":"LEFT(BDD!Y20,3)","v":""},{"$f":"LEFT(BDD!AA20,3)","v":""},{"$f":"LEFT(BDD!AB20,3)","v":""},{"$f":"LEFT(BDD!AC20,3)","v":""},{"$f":"LEFT(BDD!AD20,3)","v":""},{"$f":"LEFT(BDD!AE20,3)","v":""},{"$f":"LEFT(BDD!AG20,3)","v":""},{"$f":"LEFT(BDD!AH20,3)","v":""},{"$f":"LEFT(BDD!AJ20,3)","v":""},null,{"$f":"LEFT(BDD!#REF!,3)","v":{"$error":"#REF!"}},{"$f":"LEFT(BDD!#REF!,3)","v":{"$error":"#REF!"}},{"$f":"LEFT(BDD!AL20,3)","v":""},{"$f":"LEFT(BDD!AN20,3)","v":""},{"$f":"LEFT(BDD!#REF!,3)","v":{"$error":"#REF!"}},{"$f":"LEFT(BDD!AP20,3)","v":""},{"$f":"LEFT(BDD!AQ20,3)","v":""},{"$f":"LEFT(BDD!AR20,3)","v":""},{"$f":"LEFT(BDD!AS20,3)","v":""},{"$f":"LEFT(BDD!AT20,3)","v":""},{"$f":"LEFT(BDD!#REF!,3)","v":{"$error":"#REF!"}},{"$f":"LEFT(BDD!#REF!,3)","v":{"$error":"#REF!"}},{"$f":"LEFT(BDD!AU20,3)","v":""},{"$f":"LEFT(BDD!AW17,3)","v":"730"},{"$f":"LEFT(BDD!AX19,3)","v":""},{"$f":"LEFT(BDD!AY19,3)","v":""},{"$f":"LEFT(BDD!AZ19,3)","v":""},{"$f":"LEFT(BDD!BA19,3)","v":""},{"$f":"LEFT(BDD!BB19,3)","v":""},{"$f":"LEFT(BDD!BC19,3)","v":""},{"$f":"LEFT(BDD!BD19,3)","v":""},{"$f":"LEFT(BDD!BE19,3)","v":""},{"$f":"LEFT(BDD!BF20,3)","v":""},{"$f":"LEFT(BDD!BG20,3)","v":""},{"$f":"LEFT(BDD!BL20,3)","v":""},{"$f":"LEFT(BDD!BM20,3)","v":""},{"$f":"LEFT(BDD!BN20,3)","v":""},{"$f":"LEFT(BDD!BO20,3)","v":""},{"$f":"LEFT(BDD!BR20,3)","v":""},{"$f":"LEFT(BDD!#REF!,3)","v":{"$error":"#REF!"}},{"$f":"LEFT(BDD!#REF!,3)","v":{"$error":"#REF!"}},{"$f":"LEFT(BDD!BS21,3)","v":""},{"$f":"LEFT(BDD!BT21,3)","v":""},{"$f":"LEFT(BDD!BU21,3)","v":""},{"$f":"LEFT(BDD!BV21,3)","v":""},{"$f":"LEFT(BDD!BW21,3)","v":""},{"$f":"LEFT(BDD!BX21,3)","v":""},{"$f":"LEFT(BDD!BY21,3)","v":""},{"$f":"LEFT(BDD!BZ21,3)","v":""},{"$f":"LEFT(BDD!CA21,3)","v":""},{"$f":"LEFT(BDD!CB21,3)","v":""},{"$f":"LEFT(BDD!CC21,3)","v":""},{"$f":"LEFT(BDD!CD21,3)","v":""},{"$f":"LEFT(BDD!CE21,3)","v":""},{"$f":"LEFT(BDD!CF21,3)","v":""},{"$f":"LEFT(BDD!CG21,3)","v":""},{"$f":"LEFT(BDD!CH21,3)","v":""}]
[{"$f":"LEFT(BDD!A23,3)","v":"374"},{"$f":"BDD!B23","v":1},{"$f":"LEFT(BDD!C21,3)","v":""},{"$f":"LEFT(BDD!D21,3)","v":""},{"$f":"LEFT(BDD!#REF!,3)","v":{"$error":"#REF!"}},{"$f":"LEFT(BDD!E21,3)","v":""},{"$f":"LEFT(BDD!F21,3)","v":""},{"$f":"LEFT(BDD!G21,3)","v":""},{"$f":"LEFT(BDD!I21,3)","v":""},{"$f":"LEFT(BDD!J21,3)","v":""},{"$f":"LEFT(BDD!K18,3)","v":"814"},{"$f":"LEFT(BDD!L19,3)","v":""},{"$f":"LEFT(BDD!M19,3)","v":""},{"$f":"LEFT(BDD!O19,3)","v":""},{"$f":"LEFT(BDD!P19,3)","v":""},{"$f":"LEFT(BDD!R19,3)","v":""},{"$f":"LEFT(BDD!S20,3)","v":""},{"$f":"LEFT(BDD!T20,3)","v":""},{"$f":"LEFT(BDD!U20,3)","v":""},{"$f":"LEFT(BDD!V20,3)","v":""},{"$f":"LEFT(BDD!W21,3)","v":""},{"$f":"LEFT(BDD!X21,3)","v":""},{"$f":"LEFT(BDD!Y21,3)","v":""},{"$f":"LEFT(BDD!AA21,3)","v":""},{"$f":"LEFT(BDD!AB21,3)","v":""},{"$f":"LEFT(BDD!AC21,3)","v":""},{"$f":"LEFT(BDD!AD21,3)","v":""},{"$f":"LEFT(BDD!AE21,3)","v":""},{"$f":"LEFT(BDD!AG21,3)","v":""},{"$f":"LEFT(BDD!AH21,3)","v":""},{"$f":"LEFT(BDD!AJ21,3)","v":""},null,{"$f":"LEFT(BDD!#REF!,3)","v":{"$error":"#REF!"}},{"$f":"LEFT(BDD!#REF!,3)","v":{"$error":"#REF!"}},{"$f":"LEFT(BDD!AL21,3)","v":""},{"$f":"LEFT(BDD!AN21,3)","v":""},{"$f":"LEFT(BDD!#REF!,3)","v":{"$error":"#REF!"}},{"$f":"LEFT(BDD!AP21,3)","v":""},{"$f":"LEFT(BDD!AQ21,3)","v":""},{"$f":"LEFT(BDD!AR21,3)","v":""},{"$f":"LEFT(BDD!AS21,3)","v":""},{"$f":"LEFT(BDD!AT21,3)","v":""},{"$f":"LEFT(BDD!#REF!,3)","v":{"$error":"#REF!"}},{"$f":"LEFT(BDD!#REF!,3)","v":{"$error":"#REF!"}},{"$f":"LEFT(BDD!AU21,3)","v":""},{"$f":"LEFT(BDD!AW18,3)","v":"814"},{"$f":"LEFT(BDD!AX20,3)","v":""},{"$f":"LEFT(BDD!AY20,3)","v":""},{"$f":"LEFT(BDD!AZ20,3)","v":""},{"$f":"LEFT(BDD!BA20,3)","v":""},{"$f":"LEFT(BDD!BB20,3)","v":""},{"$f":"LEFT(BDD!BC20,3)","v":""},{"$f":"LEFT(BDD!BD20,3)","v":""},{"$f":"LEFT(BDD!BE20,3)","v":""},{"$f":"LEFT(BDD!BF21,3)","v":""},{"$f":"LEFT(BDD!BG21,3)","v":""},{"$f":"LEFT(BDD!BL21,3)","v":""},{"$f":"LEFT(BDD!BM21,3)","v":""},{"$f":"LEFT(BDD!BN21,3)","v":""},{"$f":"LEFT(BDD!BO21,3)","v":""},{"$f":"LEFT(BDD!BR21,3)","v":""},{"$f":"LEFT(BDD!#REF!,3)","v":{"$error":"#REF!"}},{"$f":"LEFT(BDD!#REF!,3)","v":{"$error":"#REF!"}},{"$f":"LEFT(BDD!BR22,3)","v":""},{"$f":"LEFT(BDD!BS22,3)","v":""},{"$f":"LEFT(BDD!BT22,3)","v":""},{"$f":"LEFT(BDD!BU22,3)","v":""},{"$f":"LEFT(BDD!BV22,3)","v":""},{"$f":"LEFT(BDD!BW22,3)","v":""},{"$f":"LEFT(BDD!BX22,3)","v":""},{"$f":"LEFT(BDD!BY22,3)","v":""},{"$f":"LEFT(BDD!BZ22,3)","v":""},{"$f":"LEFT(BDD!CA22,3)","v":""},{"$f":"LEFT(BDD!CB22,3)","v":""},{"$f":"LEFT(BDD!CC22,3)","v":""},{"$f":"LEFT(BDD!CD22,3)","v":""},{"$f":"LEFT(BDD!CE22,3)","v":""},{"$f":"LEFT(BDD!CF22,3)","v":""},{"$f":"LEFT(BDD!CG22,3)","v":""}]
[{"$f":"LEFT(BDD!A24,3)","v":"386"},{"$f":"BDD!B24","v":1},{"$f":"LEFT(BDD!C22,3)","v":""},{"$f":"LEFT(BDD!D22,3)","v":""},{"$f":"LEFT(BDD!#REF!,3)","v":{"$error":"#REF!"}},{"$f":"LEFT(BDD!E22,3)","v":""},{"$f":"LEFT(BDD!F22,3)","v":""},{"$f":"LEFT(BDD!G22,3)","v":""},{"$f":"LEFT(BDD!I22,3)","v":""},{"$f":"LEFT(BDD!J22,3)","v":""},{"$f":"LEFT(BDD!K19,3)","v":"819"},{"$f":"LEFT(BDD!L20,3)","v":""},{"$f":"LEFT(BDD!M20,3)","v":""},{"$f":"LEFT(BDD!O20,3)","v":""},{"$f":"LEFT(BDD!P20,3)","v":""},{"$f":"LEFT(BDD!R20,3)","v":""},{"$f":"LEFT(BDD!S21,3)","v":""},{"$f":"LEFT(BDD!T21,3)","v":""},{"$f":"LEFT(BDD!U21,3)","v":""},{"$f":"LEFT(BDD!V21,3)","v":""},{"$f":"LEFT(BDD!W22,3)","v":""},{"$f":"LEFT(BDD!X22,3)","v":""},{"$f":"LEFT(BDD!Y22,3)","v":""},{"$f":"LEFT(BDD!AA22,3)","v":""},{"$f":"LEFT(BDD!AB22,3)","v":""},{"$f":"LEFT(BDD!AC22,3)","v":""},{"$f":"LEFT(BDD!AD22,3)","v":""},{"$f":"LEFT(BDD!AE22,3)","v":""},{"$f":"LEFT(BDD!AG22,3)","v":""},{"$f":"LEFT(BDD!AH22,3)","v":""},{"$f":"LEFT(BDD!AJ22,3)","v":""},null,{"$f":"LEFT(BDD!#REF!,3)","v":{"$error":"#REF!"}},{"$f":"LEFT(BDD!#REF!,3)","v":{"$error":"#REF!"}},{"$f":"LEFT(BDD!AL22,3)","v":""},{"$f":"LEFT(BDD!AN22,3)","v":""},{"$f":"LEFT(BDD!#REF!,3)","v":{"$error":"#REF!"}},{"$f":"LEFT(BDD!AP22,3)","v":""},{"$f":"LEFT(BDD!AQ22,3)","v":""},{"$f":"LEFT(BDD!AR22,3)","v":""},{"$f":"LEFT(BDD!AS22,3)","v":""},{"$f":"LEFT(BDD!AT22,3)","v":""},{"$f":"LEFT(BDD!#REF!,3)","v":{"$error":"#REF!"}},{"$f":"LEFT(BDD!#REF!,3)","v":{"$error":"#REF!"}},{"$f":"LEFT(BDD!AU22,3)","v":""},{"$f":"LEFT(BDD!AW19,3)","v":"819"},{"$f":"LEFT(BDD!AX21,3)","v":""},{"$f":"LEFT(BDD!AY21,3)","v":""},{"$f":"LEFT(BDD!AZ21,3)","v":""},{"$f":"LEFT(BDD!BA21,3)","v":""},{"$f":"LEFT(BDD!BB21,3)","v":""},{"$f":"LEFT(BDD!BC21,3)","v":""},{"$f":"LEFT(BDD!BD21,3)","v":""},{"$f":"LEFT(BDD!BE21,3)","v":""},{"$f":"LEFT(BDD!BE22,3)","v":""},{"$f":"LEFT(BDD!BF22,3)","v":""},{"$f":"LEFT(BDD!BK22,3)","v":""},{"$f":"LEFT(BDD!BL22,3)","v":""},{"$f":"LEFT(BDD!BM22,3)","v":""},{"$f":"LEFT(BDD!BN22,3)","v":""},{"$f":"LEFT(BDD!BQ22,3)","v":""},{"$f":"LEFT(BDD!#REF!,3)","v":{"$error":"#REF!"}},{"$f":"LEFT(BDD!#REF!,3)","v":{"$error":"#REF!"}},{"$f":"LEFT(BDD!BR23,3)","v":""},{"$f":"LEFT(BDD!BS23,3)","v":""},{"$f":"LEFT(BDD!BT23,3)","v":""},{"$f":"LEFT(BDD!BU23,3)","v":""},{"$f":"LEFT(BDD!BV23,3)","v":""},{"$f":"LEFT(BDD!BW23,3)","v":""},{"$f":"LEFT(BDD!BX23,3)","v":""},{"$f":"LEFT(BDD!BY23,3)","v":""},{"$f":"LEFT(BDD!BZ23,3)","v":""},{"$f":"LEFT(BDD!CA23,3)","v":""},{"$f":"LEFT(BDD!CB23,3)","v":""},{"$f":"LEFT(BDD!CC23,3)","v":""},{"$f":"LEFT(BDD!CD23,3)","v":""},{"$f":"LEFT(BDD!CE23,3)","v":""},{"$f":"LEFT(BDD!CF23,3)","v":""},{"$f":"LEFT(BDD!CG23,3)","v":""}]
[{"$f":"LEFT(BDD!A26,3)","v":"392"},{"$f":"BDD!B26","v":1},{"$f":"LEFT(BDD!C23,3)","v":""},{"$f":"LEFT(BDD!D23,3)","v":""},{"$f":"LEFT(BDD!#REF!,3)","v":{"$error":"#REF!"}},{"$f":"LEFT(BDD!E23,3)","v":""},{"$f":"LEFT(BDD!F23,3)","v":""},{"$f":"LEFT(BDD!G23,3)","v":""},{"$f":"LEFT(BDD!I23,3)","v":""},{"$f":"LEFT(BDD!J23,3)","v":""},{"$f":"LEFT(BDD!K20,3)","v":"830"},{"$f":"LEFT(BDD!L21,3)","v":""},{"$f":"LEFT(BDD!M21,3)","v":""},{"$f":"LEFT(BDD!O21,3)","v":""},{"$f":"LEFT(BDD!P21,3)","v":""},{"$f":"LEFT(BDD!R21,3)","v":""},{"$f":"LEFT(BDD!S22,3)","v":""},{"$f":"LEFT(BDD!T22,3)","v":""},{"$f":"LEFT(BDD!U22,3)","v":""},{"$f":"LEFT(BDD!V22,3)","v":""},{"$f":"LEFT(BDD!W23,3)","v":""},{"$f":"LEFT(BDD!X23,3)","v":""},{"$f":"LEFT(BDD!Y23,3)","v":""},{"$f":"LEFT(BDD!AA23,3)","v":""},{"$f":"LEFT(BDD!AB23,3)","v":""},{"$f":"LEFT(BDD!AC23,3)","v":""},{"$f":"LEFT(BDD!AD23,3)","v":""},{"$f":"LEFT(BDD!AE23,3)","v":""},{"$f":"LEFT(BDD!AG23,3)","v":""},{"$f":"LEFT(BDD!AH23,3)","v":""},{"$f":"LEFT(BDD!AJ23,3)","v":""},null,{"$f":"LEFT(BDD!AL23,3)","v":""},{"$f":"LEFT(BDD!AM23,3)","v":""},{"$f":"LEFT(BDD!AN23,3)","v":""},{"$f":"LEFT(BDD!AP23,3)","v":""},{"$f":"LEFT(BDD!#REF!,3)","v":{"$error":"#REF!"}},{"$f":"LEFT(BDD!AR23,3)","v":""},{"$f":"LEFT(BDD!AS23,3)","v":""},{"$f":"LEFT(BDD!AT23,3)","v":""},{"$f":"LEFT(BDD!AU23,3)","v":""},{"$f":"LEFT(BDD!AV23,3)","v":""},{"$f":"LEFT(BDD!#REF!,3)","v":{"$error":"#REF!"}},{"$f":"LEFT(BDD!#REF!,3)","v":{"$error":"#REF!"}},{"$f":"LEFT(BDD!AW23,3)","v":""},{"$f":"LEFT(BDD!AW20,3)","v":"830"},{"$f":"LEFT(BDD!AW22,3)","v":""},{"$f":"LEFT(BDD!AX22,3)","v":""},{"$f":"LEFT(BDD!AY22,3)","v":""},{"$f":"LEFT(BDD!AZ22,3)","v":""},{"$f":"LEFT(BDD!BA22,3)","v":""},{"$f":"LEFT(BDD!BB22,3)","v":""},{"$f":"LEFT(BDD!BC22,3)","v":""},{"$f":"LEFT(BDD!BD22,3)","v":""},{"$f":"LEFT(BDD!BG23,3)","v":""},{"$f":"LEFT(BDD!BH23,3)","v":""},{"$f":"LEFT(BDD!BM23,3)","v":""},{"$f":"LEFT(BDD!BN23,3)","v":""},{"$f":"LEFT(BDD!BO23,3)","v":""},{"$f":"LEFT(BDD!BP23,3)","v":""},{"$f":"LEFT(BDD!BQ23,3)","v":""},{"$f":"LEFT(BDD!#REF!,3)","v":{"$error":"#REF!"}},{"$f":"LEFT(BDD!#REF!,3)","v":{"$error":"#REF!"}},{"$f":"LEFT(BDD!BR25,3)","v":""},{"$f":"LEFT(BDD!BS25,3)","v":""},{"$f":"LEFT(BDD!BT25,3)","v":""},{"$f":"LEFT(BDD!BU25,3)","v":""},{"$f":"LEFT(BDD!BV25,3)","v":""},{"$f":"LEFT(BDD!BW25,3)","v":""},{"$f":"LEFT(BDD!BX25,3)","v":""},{"$f":"LEFT(BDD!BY25,3)","v":""},{"$f":"LEFT(BDD!BZ25,3)","v":""},{"$f":"LEFT(BDD!CA25,3)","v":""},{"$f":"LEFT(BDD!CB25,3)","v":""},{"$f":"LEFT(BDD!CC25,3)","v":""},{"$f":"LEFT(BDD!CD25,3)","v":""},{"$f":"LEFT(BDD!CE25,3)","v":""},{"$f":"LEFT(BDD!CF25,3)","v":""},{"$f":"LEFT(BDD!CG25,3)","v":""}]
[{"$f":"LEFT(BDD!A27,3)","v":"395"},{"$f":"BDD!B27","v":1},{"$f":"LEFT(BDD!C25,3)","v":""},{"$f":"LEFT(BDD!D25,3)","v":""},{"$f":"LEFT(BDD!E25,3)","v":""},{"$f":"LEFT(BDD!F25,3)","v":""},{"$f":"LEFT(BDD!G25,3)","v":""},{"$f":"LEFT(BDD!H25,3)","v":""},{"$f":"LEFT(BDD!J25,3)","v":""},{"$f":"LEFT(BDD!K25,3)","v":""},{"$f":"LEFT(BDD!K21,3)","v":"899"},{"$f":"LEFT(BDD!L23,3)","v":""},{"$f":"LEFT(BDD!M23,3)","v":""},{"$f":"LEFT(BDD!O23,3)","v":""},{"$f":"LEFT(BDD!P23,3)","v":""},{"$f":"LEFT(BDD!R23,3)","v":""},{"$f":"LEFT(BDD!S24,3)","v":""},{"$f":"LEFT(BDD!T24,3)","v":""},{"$f":"LEFT(BDD!U24,3)","v":""},{"$f":"LEFT(BDD!V24,3)","v":""},{"$f":"LEFT(BDD!X25,3)","v":""},{"$f":"LEFT(BDD!Y25,3)","v":""},{"$f":"LEFT(BDD!Z25,3)","v":""},{"$f":"LEFT(BDD!AB25,3)","v":""},{"$f":"LEFT(BDD!AC25,3)","v":""},{"$f":"LEFT(BDD!AD25,3)","v":""},{"$f":"LEFT(BDD!AE25,3)","v":""},{"$f":"LEFT(BDD!AG25,3)","v":""},{"$f":"LEFT(BDD!AH25,3)","v":""},{"$f":"LEFT(BDD!AI25,3)","v":""},{"$f":"LEFT(BDD!AK25,3)","v":""},null,{"$f":"LEFT(BDD!AM25,3)","v":""},{"$f":"LEFT(BDD!AN25,3)","v":""},{"$f":"LEFT(BDD!AO25,3)","v":""},{"$f":"LEFT(BDD!AQ25,3)","v":""},{"$f":"LEFT(BDD!AS25,3)","v":""},{"$f":"LEFT(BDD!AT25,3)","v":""},{"$f":"LEFT(BDD!AU25,3)","v":""},{"$f":"LEFT(BDD!AV25,3)","v":""},{"$f":"LEFT(BDD!AW25,3)","v":""},{"$f":"LEFT(BDD!AX25,3)","v":""},{"$f":"LEFT(BDD!AY25,3)","v":""},{"$f":"LEFT(BDD!AZ25,3)","v":""},{"$f":"LEFT(BDD!BA25,3)","v":""},{"$f":"LEFT(BDD!AW21,3)","v":"899"},{"$f":"LEFT(BDD!AY24,3)","v":""},{"$f":"LEFT(BDD!AZ24,3)","v":""},{"$f":"LEFT(BDD!BA24,3)","v":""},{"$f":"LEFT(BDD!BB24,3)","v":""},{"$f":"LEFT(BDD!BC24,3)","v":""},{"$f":"LEFT(BDD!BD24,3)","v":""},{"$f":"LEFT(BDD!BE24,3)","v":""},{"$f":"LEFT(BDD!BF24,3)","v":""},{"$f":"LEFT(BDD!BK25,3)","v":""},{"$f":"LEFT(BDD!BL25,3)","v":""},{"$f":"LEFT(BDD!BM25,3)","v":""},{"$f":"LEFT(BDD!BN25,3)","v":""},{"$f":"LEFT(BDD!BO25,3)","v":""},{"$f":"LEFT(BDD!BP25,3)","v":""},{"$f":"LEFT(BDD!BQ25,3)","v":""},{"$f":"LEFT(BDD!#REF!,3)","v":{"$error":"#REF!"}},{"$f":"LEFT(BDD!#REF!,3)","v":{"$error":"#REF!"}},{"$f":"LEFT(BDD!BR26,3)","v":""},{"$f":"LEFT(BDD!BS26,3)","v":""},{"$f":"LEFT(BDD!BT26,3)","v":""},{"$f":"LEFT(BDD!BU26,3)","v":""},{"$f":"LEFT(BDD!BV26,3)","v":""},{"$f":"LEFT(BDD!BW26,3)","v":""},{"$f":"LEFT(BDD!BX26,3)","v":""},{"$f":"LEFT(BDD!BY26,3)","v":""},{"$f":"LEFT(BDD!BZ26,3)","v":""},{"$f":"LEFT(BDD!CA26,3)","v":""},{"$f":"LEFT(BDD!CB26,3)","v":""},{"$f":"LEFT(BDD!CC26,3)","v":""},{"$f":"LEFT(BDD!CD26,3)","v":""},{"$f":"LEFT(BDD!CE26,3)","v":""},{"$f":"LEFT(BDD!CF26,3)","v":""},{"$f":"LEFT(BDD!CG26,3)","v":""}]
[{"$f":"LEFT(BDD!A28,3)","v":"397"},{"$f":"BDD!B28","v":1},{"$f":"LEFT(BDD!C26,3)","v":""},{"$f":"LEFT(BDD!D26,3)","v":""},{"$f":"LEFT(BDD!E26,3)","v":""},{"$f":"LEFT(BDD!F26,3)","v":""},{"$f":"LEFT(BDD!G26,3)","v":""},{"$f":"LEFT(BDD!H26,3)","v":""},{"$f":"LEFT(BDD!J26,3)","v":""},{"$f":"LEFT(BDD!K26,3)","v":""},{"$f":"LEFT(BDD!K23,3)","v":""},{"$f":"LEFT(BDD!L24,3)","v":""},{"$f":"LEFT(BDD!M24,3)","v":""},{"$f":"LEFT(BDD!O24,3)","v":""},{"$f":"LEFT(BDD!P24,3)","v":""},{"$f":"LEFT(BDD!R24,3)","v":""},{"$f":"LEFT(BDD!T26,3)","v":""},{"$f":"LEFT(BDD!U26,3)","v":""},{"$f":"LEFT(BDD!V26,3)","v":""},{"$f":"LEFT(BDD!W26,3)","v":""},{"$f":"LEFT(BDD!X26,3)","v":""},{"$f":"LEFT(BDD!Y26,3)","v":""},{"$f":"LEFT(BDD!Z26,3)","v":""},{"$f":"LEFT(BDD!AB26,3)","v":""},{"$f":"LEFT(BDD!AC26,3)","v":""},{"$f":"LEFT(BDD!AD26,3)","v":""},{"$f":"LEFT(BDD!AE26,3)","v":""},{"$f":"LEFT(BDD!AG26,3)","v":""},{"$f":"LEFT(BDD!AH26,3)","v":""},{"$f":"LEFT(BDD!AI26,3)","v":""},{"$f":"LEFT(BDD!AK26,3)","v":""},null,{"$f":"LEFT(BDD!AM26,3)","v":""},{"$f":"LEFT(BDD!AN26,3)","v":""},{"$f":"LEFT(BDD!AO26,3)","v":""},{"$f":"LEFT(BDD!AQ26,3)","v":""},{"$f":"LEFT(BDD!AS26,3)","v":""},{"$f":"LEFT(BDD!AT26,3)","v":""},{"$f":"LEFT(BDD!AU26,3)","v":""},{"$f":"LEFT(BDD!AV26,3)","v":""},{"$f":"LEFT(BDD!AW26,3)","v":""},{"$f":"LEFT(BDD!AX26,3)","v":""},{"$f":"LEFT(BDD!AY26,3)","v":""},{"$f":"LEFT(BDD!AZ26,3)","v":""},{"$f":"LEFT(BDD!BA26,3)","v":""},{"$f":"LEFT(BDD!AX23,3)","v":""},{"$f":"LEFT(BDD!BC26,3)","v":""},{"$f":"LEFT(BDD!BD26,3)","v":""},{"$f":"LEFT(BDD!BE26,3)","v":""},{"$f":"LEFT(BDD!BF26,3)","v":""},{"$f":"LEFT(BDD!BG26,3)","v":""},{"$f":"LEFT(BDD!BH26,3)","v":""},{"$f":"LEFT(BDD!BI26,3)","v":""},{"$f":"LEFT(BDD!BJ26,3)","v":""},{"$f":"LEFT(BDD!BK26,3)","v":""},{"$f":"LEFT(BDD!BL26,3)","v":""},{"$f":"LEFT(BDD!BN26,3)","v":""},{"$f":"LEFT(BDD!BO26,3)","v":""},{"$f":"LEFT(BDD!BP26,3)","v":""},{"$f":"LEFT(BDD!BQ26,3)","v":""},{"$f":"LEFT(BDD!#REF!,3)","v":{"$error":"#REF!"}},{"$f":"LEFT(BDD!#REF!,3)","v":{"$error":"#REF!"}},{"$f":"LEFT(BDD!BQ27,3)","v":""},{"$f":"LEFT(BDD!BR27,3)","v":""},{"$f":"LEFT(BDD!BS27,3)","v":""},{"$f":"LEFT(BDD!BT27,3)","v":""},{"$f":"LEFT(BDD!BU27,3)","v":""},{"$f":"LEFT(BDD!BV27,3)","v":""},{"$f":"LEFT(BDD!BW27,3)","v":""},{"$f":"LEFT(BDD!BX27,3)","v":""},{"$f":"LEFT(BDD!BY27,3)","v":""},{"$f":"LEFT(BDD!BZ27,3)","v":""},{"$f":"LEFT(BDD!CA27,3)","v":""},{"$f":"LEFT(BDD!CB27,3)","v":""},{"$f":"LEFT(BDD!CC27,3)","v":""},{"$f":"LEFT(BDD!CD27,3)","v":""},{"$f":"LEFT(BDD!CE27,3)","v":""},{"$f":"LEFT(BDD!CF27,3)","v":""}]
[{"$f":"LEFT(BDD!A29,3)","v":"400"},{"$f":"BDD!B29","v":6},{"$f":"LEFT(BDD!C27,3)","v":""},{"$f":"LEFT(BDD!D27,3)","v":""},{"$f":"LEFT(BDD!E27,3)","v":""},{"$f":"LEFT(BDD!F27,3)","v":""},{"$f":"LEFT(BDD!G27,3)","v":""},{"$f":"LEFT(BDD!H27,3)","v":""},{"$f":"LEFT(BDD!J27,3)","v":""},{"$f":"LEFT(BDD!K27,3)","v":""},{"$f":"LEFT(BDD!K24,3)","v":""},{"$f":"LEFT(BDD!M27,3)","v":""},{"$f":"LEFT(BDD!O27,3)","v":""},{"$f":"LEFT(BDD!P27,3)","v":""},{"$f":"LEFT(BDD!R27,3)","v":""},{"$f":"LEFT(BDD!S27,3)","v":""},{"$f":"LEFT(BDD!T27,3)","v":""},{"$f":"LEFT(BDD!U27,3)","v":""},{"$f":"LEFT(BDD!V27,3)","v":""},{"$f":"LEFT(BDD!W27,3)","v":""},{"$f":"LEFT(BDD!X27,3)","v":""},{"$f":"LEFT(BDD!Y27,3)","v":""},{"$f":"LEFT(BDD!Z27,3)","v":""},{"$f":"LEFT(BDD!AB27,3)","v":""},{"$f":"LEFT(BDD!AC27,3)","v":""},{"$f":"LEFT(BDD!AD27,3)","v":""},{"$f":"LEFT(BDD!AE27,3)","v":""},{"$f":"LEFT(BDD!AF27,3)","v":""},{"$f":"LEFT(BDD!AG27,3)","v":""},{"$f":"LEFT(BDD!AH27,3)","v":""},{"$f":"LEFT(BDD!AJ27,3)","v":""},null,{"$f":"LEFT(BDD!AL27,3)","v":""},{"$f":"LEFT(BDD!AM27,3)","v":""},{"$f":"LEFT(BDD!AN27,3)","v":""},{"$f":"LEFT(BDD!AP27,3)","v":""},{"$f":"LEFT(BDD!AR27,3)","v":""},{"$f":"LEFT(BDD!AS27,3)","v":""},{"$f":"LEFT(BDD!AT27,3)","v":""},{"$f":"LEFT(BDD!AU27,3)","v":""},{"$f":"LEFT(BDD!AV27,3)","v":""},{"$f":"LEFT(BDD!AW27,3)","v":""},{"$f":"LEFT(BDD!AX27,3)","v":""},{"$f":"LEFT(BDD!AY27,3)","v":""},{"$f":"LEFT(BDD!AZ27,3)","v":""},{"$f":"LEFT(BDD!AX24,3)","v":""},{"$f":"LEFT(BDD!BB27,3)","v":""},{"$f":"LEFT(BDD!BC27,3)","v":""},{"$f":"LEFT(BDD!BD27,3)","v":""},{"$f":"LEFT(BDD!BE27,3)","v":""},{"$f":"LEFT(BDD!BF27,3)","v":""},{"$f":"LEFT(BDD!BG27,3)","v":""},{"$f":"LEFT(BDD!BH27,3)","v":""},{"$f":"LEFT(BDD!BI27,3)","v":""},{"$f":"LEFT(BDD!BJ27,3)","v":""},{"$f":"LEFT(BDD!BK27,3)","v":""},{"$f":"LEFT(BDD!BL27,3)","v":""},{"$f":"LEFT(BDD!BM27,3)","v":""},{"$f":"LEFT(BDD!BN27,3)","v":""},{"$f":"LEFT(BDD!BO27,3)","v":""},{"$f":"LEFT(BDD!BP27,3)","v":""},{"$f":"LEFT(BDD!#REF!,3)","v":{"$error":"#REF!"}},{"$f":"LEFT(BDD!#REF!,3)","v":{"$error":"#REF!"}},{"$f":"LEFT(BDD!BQ28,3)","v":""},{"$f":"LEFT(BDD!BR28,3)","v":""},{"$f":"LEFT(BDD!BS28,3)","v":""},{"$f":"LEFT(BDD!BT28,3)","v":""},{"$f":"LEFT(BDD!BU28,3)","v":""},{"$f":"LEFT(BDD!BV28,3)","v":""},{"$f":"LEFT(BDD!BW28,3)","v":""},{"$f":"LEFT(BDD!BX28,3)","v":""},{"$f":"LEFT(BDD!BY28,3)","v":""},{"$f":"LEFT(BDD!BZ28,3)","v":""},{"$f":"LEFT(BDD!CA28,3)","v":""},{"$f":"LEFT(BDD!CB28,3)","v":""},{"$f":"LEFT(BDD!CC28,3)","v":""},{"$f":"LEFT(BDD!CD28,3)","v":""},{"$f":"LEFT(BDD!CE28,3)","v":""}]
[{"$f":"LEFT(BDD!A30,3)","v":"408"},{"$f":"BDD!B30","v":1},{"$f":"LEFT(BDD!C28,3)","v":""},{"$f":"LEFT(BDD!D28,3)","v":""},{"$f":"LEFT(BDD!E28,3)","v":""},{"$f":"LEFT(BDD!F28,3)","v":""},{"$f":"LEFT(BDD!G28,3)","v":""},{"$f":"LEFT(BDD!H28,3)","v":""},{"$f":"LEFT(BDD!J28,3)","v":""},{"$f":"LEFT(BDD!K28,3)","v":""},null,{"$f":"LEFT(BDD!M28,3)","v":""},{"$f":"LEFT(BDD!O28,3)","v":""},{"$f":"LEFT(BDD!P28,3)","v":""},{"$f":"LEFT(BDD!R28,3)","v":""},{"$f":"LEFT(BDD!S28,3)","v":""},{"$f":"LEFT(BDD!T28,3)","v":""},{"$f":"LEFT(BDD!U28,3)","v":""},{"$f":"LEFT(BDD!V28,3)","v":""},{"$f":"LEFT(BDD!W28,3)","v":""},null,{"$f":"LEFT(BDD!Y28,3)","v":""},{"$f":"LEFT(BDD!Z28,3)","v":""},{"$f":"LEFT(BDD!AA28,3)","v":""},{"$f":"LEFT(BDD!AB28,3)","v":""},{"$f":"LEFT(BDD!AC28,3)","v":""},{"$f":"LEFT(BDD!AD28,3)","v":""},{"$f":"LEFT(BDD!AE28,3)","v":""},{"$f":"LEFT(BDD!AF28,3)","v":""},{"$f":"LEFT(BDD!AG28,3)","v":""},{"$f":"LEFT(BDD!AI28,3)","v":""},null,{"$f":"LEFT(BDD!AK28,3)","v":""},{"$f":"LEFT(BDD!AL28,3)","v":""},{"$f":"LEFT(BDD!AM28,3)","v":""},{"$f":"LEFT(BDD!AN28,3)","v":""},{"$f":"LEFT(BDD!AP28,3)","v":""},{"$f":"LEFT(BDD!AQ28,3)","v":""},{"$f":"LEFT(BDD!AR28,3)","v":""},{"$f":"LEFT(BDD!AS28,3)","v":""},{"$f":"LEFT(BDD!AT28,3)","v":""},{"$f":"LEFT(BDD!AU28,3)","v":""},{"$f":"LEFT(BDD!AV28,3)","v":""},{"$f":"LEFT(BDD!AW28,3)","v":""},{"$f":"LEFT(BDD!AX28,3)","v":""},{"$f":"LEFT(BDD!AY28,3)","v":""},{"$f":"LEFT(BDD!AZ28,3)","v":""},{"$f":"LEFT(BDD!BB28,3)","v":""},{"$f":"LEFT(BDD!BC28,3)","v":""},{"$f":"LEFT(BDD!BD28,3)","v":""},{"$f":"LEFT(BDD!BE28,3)","v":""},{"$f":"LEFT(BDD!BF28,3)","v":""},{"$f":"LEFT(BDD!BG28,3)","v":""},{"$f":"LEFT(BDD!BH28,3)","v":""},{"$f":"LEFT(BDD!BI28,3)","v":""},{"$f":"LEFT(BDD!BJ28,3)","v":""},{"$f":"LEFT(BDD!BK28,3)","v":""},{"$f":"LEFT(BDD!BL28,3)","v":""},{"$f":"LEFT(BDD!BM28,3)","v":""},{"$f":"LEFT(BDD!BN28,3)","v":""},{"$f":"LEFT(BDD!BO28,3)","v":""},{"$f":"LEFT(BDD!BP28,3)","v":""},{"$f":"LEFT(BDD!BQ29,3)","v":""},{"$f":"LEFT(BDD!BR29,3)","v":""},{"$f":"LEFT(BDD!BS29,3)","v":""},{"$f":"LEFT(BDD!BT29,3)","v":""},{"$f":"LEFT(BDD!BU29,3)","v":""},{"$f":"LEFT(BDD!BV29,3)","v":""},{"$f":"LEFT(BDD!BW29,3)","v":""},{"$f":"LEFT(BDD!BX29,3)","v":""},{"$f":"LEFT(BDD!BY29,3)","v":""},{"$f":"LEFT(BDD!BZ29,3)","v":""},{"$f":"LEFT(BDD!CA29,3)","v":""},{"$f":"LEFT(BDD!CB29,3)","v":""},{"$f":"LEFT(BDD!CC29,3)","v":""},{"$f":"LEFT(BDD!CD29,3)","v":""},{"$f":"LEFT(BDD!CE29,3)","v":""},{"$f":"LEFT(BDD!CF29,3)","v":""},{"$f":"LEFT(BDD!CG29,3)","v":""}]
[{"$f":"LEFT(BDD!A33,3)","v":"430"},{"$f":"BDD!B33","v":1},{"$f":"LEFT(BDD!C29,3)","v":""},{"$f":"LEFT(BDD!D29,3)","v":""},{"$f":"LEFT(BDD!E29,3)","v":""},{"$f":"LEFT(BDD!F29,3)","v":""},{"$f":"LEFT(BDD!G29,3)","v":""},{"$f":"LEFT(BDD!H29,3)","v":""},{"$f":"LEFT(BDD!J29,3)","v":""},{"$f":"LEFT(BDD!K29,3)","v":""},null,{"$f":"LEFT(BDD!M29,3)","v":""},{"$f":"LEFT(BDD!O29,3)","v":""},{"$f":"LEFT(BDD!P29,3)","v":""},{"$f":"LEFT(BDD!R29,3)","v":""},{"$f":"LEFT(BDD!S29,3)","v":""},{"$f":"LEFT(BDD!T29,3)","v":""},{"$f":"LEFT(BDD!U29,3)","v":""},{"$f":"LEFT(BDD!V29,3)","v":""},{"$f":"LEFT(BDD!Y29,3)","v":""},null,{"$f":"LEFT(BDD!Z29,3)","v":""},{"$f":"LEFT(BDD!AA29,3)","v":""},{"$f":"LEFT(BDD!AB29,3)","v":""},{"$f":"LEFT(BDD!AC29,3)","v":""},{"$f":"LEFT(BDD!AD29,3)","v":""},{"$f":"LEFT(BDD!AE29,3)","v":""},{"$f":"LEFT(BDD!AF29,3)","v":""},{"$f":"LEFT(BDD!AG29,3)","v":""},{"$f":"LEFT(BDD!AI29,3)","v":""},{"$f":"LEFT(BDD!AK29,3)","v":""},null,{"$f":"LEFT(BDD!AL29,3)","v":""},{"$f":"LEFT(BDD!AM29,3)","v":""},{"$f":"LEFT(BDD!AN29,3)","v":""},{"$f":"LEFT(BDD!AP29,3)","v":""},{"$f":"LEFT(BDD!AQ29,3)","v":""},{"$f":"LEFT(BDD!AR29,3)","v":""},{"$f":"LEFT(BDD!AS29,3)","v":""},{"$f":"LEFT(BDD!AT29,3)","v":""},{"$f":"LEFT(BDD!AU29,3)","v":""},{"$f":"LEFT(BDD!AV29,3)","v":""},{"$f":"LEFT(BDD!AW29,3)","v":""},{"$f":"LEFT(BDD!AX29,3)","v":""},{"$f":"LEFT(BDD!AY29,3)","v":""},{"$f":"LEFT(BDD!AZ29,3)","v":""},{"$f":"LEFT(BDD!BB29,3)","v":""},{"$f":"LEFT(BDD!BC29,3)","v":""},{"$f":"LEFT(BDD!BD29,3)","v":""},{"$f":"LEFT(BDD!BE29,3)","v":""},{"$f":"LEFT(BDD!BF29,3)","v":""},{"$f":"LEFT(BDD!BG29,3)","v":""},{"$f":"LEFT(BDD!BH29,3)","v":""},{"$f":"LEFT(BDD!BI29,3)","v":""},{"$f":"LEFT(BDD!BJ29,3)","v":""},{"$f":"LEFT(BDD!BK29,3)","v":""},{"$f":"LEFT(BDD!#REF!,3)","v":{"$error":"#REF!"}},{"$f":"LEFT(BDD!BL29,3)","v":""},{"$f":"LEFT(BDD!BM29,3)","v":""},{"$f":"LEFT(BDD!BN29,3)","v":""},{"$f":"LEFT(BDD!BO29,3)","v":""},{"$f":"LEFT(BDD!BP29,3)","v":""},{"$f":"LEFT(BDD!BQ30,3)","v":""},{"$f":"LEFT(BDD!BR30,3)","v":""},{"$f":"LEFT(BDD!BS30,3)","v":""},{"$f":"LEFT(BDD!BT30,3)","v":""},{"$f":"LEFT(BDD!BU30,3)","v":""},{"$f":"LEFT(BDD!BV30,3)","v":""},{"$f":"LEFT(BDD!BW30,3)","v":""},{"$f":"LEFT(BDD!BX30,3)","v":""},{"$f":"LEFT(BDD!BY30,3)","v":""},{"$f":"LEFT(BDD!BZ30,3)","v":""},{"$f":"LEFT(BDD!CA30,3)","v":""},{"$f":"LEFT(BDD!CB30,3)","v":""},{"$f":"LEFT(BDD!CC30,3)","v":""},{"$f":"LEFT(BDD!CD30,3)","v":""},{"$f":"LEFT(BDD!CE30,3)","v":""},{"$f":"LEFT(BDD!CF30,3)","v":""},{"$f":"LEFT(BDD!CG30,3)","v":""}]
[{"$f":"LEFT(BDD!A34,3)","v":"450"},{"$f":"BDD!B34","v":1},{"$f":"LEFT(BDD!C30,3)","v":""},{"$f":"LEFT(BDD!D30,3)","v":""},{"$f":"LEFT(BDD!E30,3)","v":""},{"$f":"LEFT(BDD!F30,3)","v":""},{"$f":"LEFT(BDD!G30,3)","v":""},{"$f":"LEFT(BDD!H30,3)","v":""},{"$f":"LEFT(BDD!J30,3)","v":""},{"$f":"LEFT(BDD!K30,3)","v":""},{"$f":"LEFT(BDD!M30,3)","v":""},{"$f":"LEFT(BDD!O30,3)","v":""},{"$f":"LEFT(BDD!P30,3)","v":""},{"$f":"LEFT(BDD!R30,3)","v":""},{"$f":"LEFT(BDD!S30,3)","v":""},{"$f":"LEFT(BDD!T30,3)","v":""},{"$f":"LEFT(BDD!U30,3)","v":""},{"$f":"LEFT(BDD!V30,3)","v":""},{"$f":"LEFT(BDD!W30,3)","v":""},null,{"$f":"LEFT(BDD!X30,3)","v":""},{"$f":"LEFT(BDD!Y30,3)","v":""},{"$f":"LEFT(BDD!Z30,3)","v":""},{"$f":"LEFT(BDD!AA30,3)","v":""},{"$f":"LEFT(BDD!AB30,3)","v":""},{"$f":"LEFT(BDD!AC30,3)","v":""},{"$f":"LEFT(BDD!AD30,3)","v":""},{"$f":"LEFT(BDD!AE30,3)","v":""},{"$f":"LEFT(BDD!AF30,3)","v":""},{"$f":"LEFT(BDD!AG30,3)","v":""},{"$f":"LEFT(BDD!AI30,3)","v":""},null,{"$f":"LEFT(BDD!AK30,3)","v":""},{"$f":"LEFT(BDD!AL30,3)","v":""},{"$f":"LEFT(BDD!AM30,3)","v":""},{"$f":"LEFT(BDD!AN30,3)","v":""},{"$f":"LEFT(BDD!AP30,3)","v":""},{"$f":"LEFT(BDD!AQ30,3)","v":""},{"$f":"LEFT(BDD!AR30,3)","v":""},{"$f":"LEFT(BDD!AS30,3)","v":""},{"$f":"LEFT(BDD!AT30,3)","v":""},{"$f":"LEFT(BDD!AU30,3)","v":""},{"$f":"LEFT(BDD!AV30,3)","v":""},{"$f":"LEFT(BDD!AW30,3)","v":""},{"$f":"LEFT(BDD!AX30,3)","v":""},{"$f":"LEFT(BDD!AY30,3)","v":""},{"$f":"LEFT(BDD!AZ30,3)","v":""},{"$f":"LEFT(BDD!BA30,3)","v":""},{"$f":"LEFT(BDD!BB30,3)","v":""},{"$f":"LEFT(BDD!BC30,3)","v":""},{"$f":"LEFT(BDD!BD30,3)","v":""},{"$f":"LEFT(BDD!BE30,3)","v":""},{"$f":"LEFT(BDD!BF30,3)","v":""},{"$f":"LEFT(BDD!BG30,3)","v":""},{"$f":"LEFT(BDD!BH30,3)","v":""},{"$f":"LEFT(BDD!BI30,3)","v":""},{"$f":"LEFT(BDD!BJ30,3)","v":""},{"$f":"LEFT(BDD!BK30,3)","v":""},{"$f":"LEFT(BDD!#REF!,3)","v":{"$error":"#REF!"}},{"$f":"LEFT(BDD!BL30,3)","v":""},{"$f":"LEFT(BDD!BM30,3)","v":""},{"$f":"LEFT(BDD!BN30,3)","v":""},{"$f":"LEFT(BDD!BO30,3)","v":""},{"$f":"LEFT(BDD!BP30,3)","v":""},{"$f":"LEFT(BDD!BQ32,3)","v":""},{"$f":"LEFT(BDD!BR32,3)","v":""},{"$f":"LEFT(BDD!BS32,3)","v":""},{"$f":"LEFT(BDD!BT32,3)","v":""},{"$f":"LEFT(BDD!BU32,3)","v":""},{"$f":"LEFT(BDD!BV32,3)","v":""},{"$f":"LEFT(BDD!BW32,3)","v":""},{"$f":"LEFT(BDD!BX32,3)","v":""},{"$f":"LEFT(BDD!BY32,3)","v":""},{"$f":"LEFT(BDD!BZ32,3)","v":""},{"$f":"LEFT(BDD!CA32,3)","v":""},{"$f":"LEFT(BDD!CB32,3)","v":""},{"$f":"LEFT(BDD!CC32,3)","v":""},{"$f":"LEFT(BDD!CD32,3)","v":""}]
[{"$f":"LEFT(BDD!A36,3)","v":"505"},{"$f":"BDD!B36","v":1},{"$f":"LEFT(BDD!C33,3)","v":""},{"$f":"LEFT(BDD!D33,3)","v":""},{"$f":"LEFT(BDD!E33,3)","v":""},{"$f":"LEFT(BDD!F33,3)","v":""},{"$f":"LEFT(BDD!G33,3)","v":""},{"$f":"LEFT(BDD!H33,3)","v":""},{"$f":"LEFT(BDD!J33,3)","v":""},{"$f":"LEFT(BDD!K33,3)","v":""},{"$f":"LEFT(BDD!M33,3)","v":""},{"$f":"LEFT(BDD!O33,3)","v":""},{"$f":"LEFT(BDD!P33,3)","v":""},{"$f":"LEFT(BDD!R33,3)","v":""},{"$f":"LEFT(BDD!S33,3)","v":""},{"$f":"LEFT(BDD!T33,3)","v":""},{"$f":"LEFT(BDD!U33,3)","v":""},{"$f":"LEFT(BDD!V33,3)","v":""},{"$f":"LEFT(BDD!W33,3)","v":""},null,{"$f":"LEFT(BDD!X33,3)","v":""},{"$f":"LEFT(BDD!Y33,3)","v":""},{"$f":"LEFT(BDD!Z33,3)","v":""},{"$f":"LEFT(BDD!AA33,3)","v":""},{"$f":"LEFT(BDD!AB33,3)","v":""},{"$f":"LEFT(BDD!AC33,3)","v":""},{"$f":"LEFT(BDD!AD34,3)","v":""},{"$f":"LEFT(BDD!AE33,3)","v":""},{"$f":"LEFT(BDD!AF33,3)","v":""},{"$f":"LEFT(BDD!AG33,3)","v":""},{"$f":"LEFT(BDD!AI33,3)","v":""},null,{"$f":"LEFT(BDD!AJ33,3)","v":""},{"$f":"LEFT(BDD!AK33,3)","v":""},{"$f":"LEFT(BDD!AL33,3)","v":""},{"$f":"LEFT(BDD!AM33,3)","v":""},{"$f":"LEFT(BDD!AN33,3)","v":""},{"$f":"LEFT(BDD!AP33,3)","v":""},{"$f":"LEFT(BDD!AQ33,3)","v":""},{"$f":"LEFT(BDD!AR33,3)","v":""},{"$f":"LEFT(BDD!AS33,3)","v":""},{"$f":"LEFT(BDD!AT33,3)","v":""},{"$f":"LEFT(BDD!AU33,3)","v":""},{"$f":"LEFT(BDD!AV33,3)","v":""},{"$f":"LEFT(BDD!AW33,3)","v":""},{"$f":"LEFT(BDD!AX33,3)","v":""},{"$f":"LEFT(BDD!AY33,3)","v":""},{"$f":"LEFT(BDD!AZ33,3)","v":""},{"$f":"LEFT(BDD!BA33,3)","v":""},{"$f":"LEFT(BDD!BB33,3)","v":""},{"$f":"LEFT(BDD!BC33,3)","v":""},{"$f":"LEFT(BDD!BD33,3)","v":""},{"$f":"LEFT(BDD!BE33,3)","v":""},{"$f":"LEFT(BDD!BF33,3)","v":""},{"$f":"LEFT(BDD!BG33,3)","v":""},{"$f":"LEFT(BDD!BH33,3)","v":""},{"$f":"LEFT(BDD!BI33,3)","v":""},{"$f":"LEFT(BDD!BJ33,3)","v":""},{"$f":"LEFT(BDD!BK33,3)","v":""},{"$f":"LEFT(BDD!#REF!,3)","v":{"$error":"#REF!"}},{"$f":"LEFT(BDD!BL33,3)","v":""},{"$f":"LEFT(BDD!BM33,3)","v":""},{"$f":"LEFT(BDD!BN33,3)","v":""},{"$f":"LEFT(BDD!BO33,3)","v":""},{"$f":"LEFT(BDD!BP33,3)","v":""},{"$f":"LEFT(BDD!BQ34,3)","v":""},{"$f":"LEFT(BDD!BR34,3)","v":""},{"$f":"LEFT(BDD!BS34,3)","v":""},{"$f":"LEFT(BDD!BT34,3)","v":""},{"$f":"LEFT(BDD!BU34,3)","v":""},{"$f":"LEFT(BDD!BV34,3)","v":""},{"$f":"LEFT(BDD!BW34,3)","v":""},{"$f":"LEFT(BDD!BX34,3)","v":""},{"$f":"LEFT(BDD!BY34,3)","v":""},{"$f":"LEFT(BDD!BZ34,3)","v":""},{"$f":"LEFT(BDD!CA34,3)","v":""},{"$f":"LEFT(BDD!CB34,3)","v":""},{"$f":"LEFT(BDD!CC34,3)","v":""}]
[{"$f":"LEFT(BDD!#REF!,3)","v":{"$error":"#REF!"}},{"$f":"BDD!#REF!","v":{"$error":"#REF!"}},{"$f":"LEFT(BDD!C34,3)","v":""},{"$f":"LEFT(BDD!D34,3)","v":""},{"$f":"LEFT(BDD!E34,3)","v":""},{"$f":"LEFT(BDD!F34,3)","v":""},{"$f":"LEFT(BDD!G34,3)","v":""},{"$f":"LEFT(BDD!H34,3)","v":""},{"$f":"LEFT(BDD!J34,3)","v":""},{"$f":"LEFT(BDD!K34,3)","v":""},{"$f":"LEFT(BDD!M34,3)","v":""},{"$f":"LEFT(BDD!O34,3)","v":""},{"$f":"LEFT(BDD!P34,3)","v":""},{"$f":"LEFT(BDD!R34,3)","v":""},{"$f":"LEFT(BDD!S34,3)","v":""},{"$f":"LEFT(BDD!T34,3)","v":""},{"$f":"LEFT(BDD!U34,3)","v":""},{"$f":"LEFT(BDD!V34,3)","v":""},{"$f":"LEFT(BDD!W34,3)","v":""},null,{"$f":"LEFT(BDD!X34,3)","v":""},{"$f":"LEFT(BDD!Y34,3)","v":""},{"$f":"LEFT(BDD!Z34,3)","v":""},{"$f":"LEFT(BDD!AA34,3)","v":""},{"$f":"LEFT(BDD!AB34,3)","v":""},{"$f":"LEFT(BDD!AC34,3)","v":""},{"$f":"LEFT(BDD!#REF!,3)","v":{"$error":"#REF!"}},{"$f":"LEFT(BDD!AE34,3)","v":""},{"$f":"LEFT(BDD!AF34,3)","v":""},{"$f":"LEFT(BDD!AG34,3)","v":""},{"$f":"LEFT(BDD!AI34,3)","v":""},{"$f":"LEFT(BDD!AJ34,3)","v":""},{"$f":"LEFT(BDD!AK34,3)","v":""},{"$f":"LEFT(BDD!AL34,3)","v":""},{"$f":"LEFT(BDD!AM34,3)","v":""},{"$f":"LEFT(BDD!AN34,3)","v":""},{"$f":"LEFT(BDD!AP34,3)","v":""},{"$f":"LEFT(BDD!AQ34,3)","v":""},{"$f":"LEFT(BDD!AR34,3)","v":""},{"$f":"LEFT(BDD!AS34,3)","v":""},{"$f":"LEFT(BDD!AT34,3)","v":""},{"$f":"LEFT(BDD!AU34,3)","v":""},{"$f":"LEFT(BDD!AV34,3)","v":""},{"$f":"LEFT(BDD!AW34,3)","v":""},{"$f":"LEFT(BDD!AX34,3)","v":""},{"$f":"LEFT(BDD!AY34,3)","v":""},{"$f":"LEFT(BDD!AZ34,3)","v":""},{"$f":"LEFT(BDD!BA34,3)","v":""},{"$f":"LEFT(BDD!BB34,3)","v":""},{"$f":"LEFT(BDD!BC34,3)","v":""},{"$f":"LEFT(BDD!BD34,3)","v":""},{"$f":"LEFT(BDD!BE34,3)","v":""},{"$f":"LEFT(BDD!BF34,3)","v":""},{"$f":"LEFT(BDD!BG34,3)","v":""},{"$f":"LEFT(BDD!BH34,3)","v":""},{"$f":"LEFT(BDD!BI34,3)","v":""},{"$f":"LEFT(BDD!BJ34,3)","v":""},{"$f":"LEFT(BDD!BK34,3)","v":""},{"$f":"LEFT(BDD!#REF!,3)","v":{"$error":"#REF!"}},{"$f":"LEFT(BDD!BL34,3)","v":""},{"$f":"LEFT(BDD!BM34,3)","v":""},{"$f":"LEFT(BDD!BN34,3)","v":""},{"$f":"LEFT(BDD!BO34,3)","v":""},{"$f":"LEFT(BDD!BP34,3)","v":""},{"$f":"LEFT(BDD!#REF!,3)","v":{"$error":"#REF!"}},{"$f":"LEFT(BDD!#REF!,3)","v":{"$error":"#REF!"}},{"$f":"LEFT(BDD!#REF!,3)","v":{"$error":"#REF!"}},{"$f":"LEFT(BDD!#REF!,3)","v":{"$error":"#REF!"}},{"$f":"LEFT(BDD!#REF!,3)","v":{"$error":"#REF!"}},{"$f":"LEFT(BDD!#REF!,3)","v":{"$error":"#REF!"}},{"$f":"LEFT(BDD!#REF!,3)","v":{"$error":"#REF!"}},{"$f":"LEFT(BDD!#REF!,3)","v":{"$error":"#REF!"}},{"$f":"LEFT(BDD!#REF!,3)","v":{"$error":"#REF!"}},{"$f":"LEFT(BDD!#REF!,3)","v":{"$error":"#REF!"}},{"$f":"LEFT(BDD!#REF!,3)","v":{"$error":"#REF!"}},{"$f":"LEFT(BDD!#REF!,3)","v":{"$error":"#REF!"}},{"$f":"LEFT(BDD!#REF!,3)","v":{"$error":"#REF!"}}]
[{"$f":"LEFT(BDD!A37,3)","v":"538"},{"$f":"BDD!B37","v":3},{"$f":"LEFT(BDD!#REF!,3)","v":{"$error":"#REF!"}},{"$f":"LEFT(BDD!#REF!,3)","v":{"$error":"#REF!"}},{"$f":"LEFT(BDD!#REF!,3)","v":{"$error":"#REF!"}},{"$f":"LEFT(BDD!#REF!,3)","v":{"$error":"#REF!"}},{"$f":"LEFT(BDD!#REF!,3)","v":{"$error":"#REF!"}},{"$f":"LEFT(BDD!#REF!,3)","v":{"$error":"#REF!"}},{"$f":"LEFT(BDD!#REF!,3)","v":{"$error":"#REF!"}},{"$f":"LEFT(BDD!#REF!,3)","v":{"$error":"#REF!"}},{"$f":"LEFT(BDD!#REF!,3)","v":{"$error":"#REF!"}},{"$f":"LEFT(BDD!#REF!,3)","v":{"$error":"#REF!"}},{"$f":"LEFT(BDD!#REF!,3)","v":{"$error":"#REF!"}},{"$f":"LEFT(BDD!#REF!,3)","v":{"$error":"#REF!"}},{"$f":"LEFT(BDD!#REF!,3)","v":{"$error":"#REF!"}},{"$f":"LEFT(BDD!#REF!,3)","v":{"$error":"#REF!"}},{"$f":"LEFT(BDD!#REF!,3)","v":{"$error":"#REF!"}},{"$f":"LEFT(BDD!#REF!,3)","v":{"$error":"#REF!"}},{"$f":"LEFT(BDD!#REF!,3)","v":{"$error":"#REF!"}},{"$f":"LEFT(BDD!#REF!,3)","v":{"$error":"#REF!"}},{"$f":"LEFT(BDD!#REF!,3)","v":{"$error":"#REF!"}},{"$f":"LEFT(BDD!#REF!,3)","v":{"$error":"#REF!"}},{"$f":"LEFT(BDD!#REF!,3)","v":{"$error":"#REF!"}},{"$f":"LEFT(BDD!#REF!,3)","v":{"$error":"#REF!"}},{"$f":"LEFT(BDD!#REF!,3)","v":{"$error":"#REF!"}},{"$f":"LEFT(BDD!AD35,3)","v":""},{"$f":"LEFT(BDD!#REF!,3)","v":{"$error":"#REF!"}},{"$f":"LEFT(BDD!#REF!,3)","v":{"$error":"#REF!"}},{"$f":"LEFT(BDD!#REF!,3)","v":{"$error":"#REF!"}},{"$f":"LEFT(BDD!#REF!,3)","v":{"$error":"#REF!"}},{"$f":"LEFT(BDD!#REF!,3)","v":{"$error":"#REF!"}},{"$f":"LEFT(BDD!#REF!,3)","v":{"$error":"#REF!"}},{"$f":"LEFT(BDD!#REF!,3)","v":{"$error":"#REF!"}},{"$f":"LEFT(BDD!#REF!,3)","v":{"$error":"#REF!"}},{"$f":"LEFT(BDD!#REF!,3)","v":{"$error":"#REF!"}},{"$f":"LEFT(BDD!#REF!,3)","v":{"$error":"#REF!"}},{"$f":"LEFT(BDD!#REF!,3)","v":{"$error":"#REF!"}},{"$f":"LEFT(BDD!#REF!,3)","v":{"$error":"#REF!"}},{"$f":"LEFT(BDD!#REF!,3)","v":{"$error":"#REF!"}},{"$f":"LEFT(BDD!#REF!,3)","v":{"$error":"#REF!"}},{"$f":"LEFT(BDD!#REF!,3)","v":{"$error":"#REF!"}},{"$f":"LEFT(BDD!#REF!,3)","v":{"$error":"#REF!"}},{"$f":"LEFT(BDD!AX35,3)","v":""},{"$f":"LEFT(BDD!#REF!,3)","v":{"$error":"#REF!"}},{"$f":"LEFT(BDD!#REF!,3)","v":{"$error":"#REF!"}},{"$f":"LEFT(BDD!#REF!,3)","v":{"$error":"#REF!"}},{"$f":"LEFT(BDD!#REF!,3)","v":{"$error":"#REF!"}},{"$f":"LEFT(BDD!#REF!,3)","v":{"$error":"#REF!"}},{"$f":"LEFT(BDD!#REF!,3)","v":{"$error":"#REF!"}},{"$f":"LEFT(BDD!#REF!,3)","v":{"$error":"#REF!"}},{"$f":"LEFT(BDD!#REF!,3)","v":{"$error":"#REF!"}},{"$f":"LEFT(BDD!#REF!,3)","v":{"$error":"#REF!"}},{"$f":"LEFT(BDD!#REF!,3)","v":{"$error":"#REF!"}},{"$f":"LEFT(BDD!#REF!,3)","v":{"$error":"#REF!"}},{"$f":"LEFT(BDD!#REF!,3)","v":{"$error":"#REF!"}},{"$f":"LEFT(BDD!#REF!,3)","v":{"$error":"#REF!"}},{"$f":"LEFT(BDD!#REF!,3)","v":{"$error":"#REF!"}},{"$f":"LEFT(BDD!#REF!,3)","v":{"$error":"#REF!"}},{"$f":"LEFT(BDD!#REF!,3)","v":{"$error":"#REF!"}},{"$f":"LEFT(BDD!#REF!,3)","v":{"$error":"#REF!"}},{"$f":"LEFT(BDD!#REF!,3)","v":{"$error":"#REF!"}},{"$f":"LEFT(BDD!#REF!,3)","v":{"$error":"#REF!"}},{"$f":"LEFT(BDD!BQ35,3)","v":""},{"$f":"LEFT(BDD!BR35,3)","v":""},{"$f":"LEFT(BDD!BS35,3)","v":""},{"$f":"LEFT(BDD!BT35,3)","v":""},{"$f":"LEFT(BDD!BU35,3)","v":""},{"$f":"LEFT(BDD!BV35,3)","v":""},{"$f":"LEFT(BDD!BW35,3)","v":""},{"$f":"LEFT(BDD!BX35,3)","v":""},{"$f":"LEFT(BDD!BY35,3)","v":""},{"$f":"LEFT(BDD!BZ35,3)","v":""},{"$f":"LEFT(BDD!CA35,3)","v":""},{"$f":"LEFT(BDD!CB35,3)","v":""},{"$f":"LEFT(BDD!CC35,3)","v":""},{"$f":"LEFT(BDD!CD35,3)","v":""}]
[{"$f":"LEFT(BDD!#REF!,3)","v":{"$error":"#REF!"}},{"$f":"BDD!#REF!","v":{"$error":"#REF!"}},{"$f":"LEFT(BDD!C35,3)","v":""},{"$f":"LEFT(BDD!D35,3)","v":""},{"$f":"LEFT(BDD!E35,3)","v":""},{"$f":"LEFT(BDD!F35,3)","v":""},{"$f":"LEFT(BDD!G35,3)","v":""},{"$f":"LEFT(BDD!H35,3)","v":""},{"$f":"LEFT(BDD!J35,3)","v":""},{"$f":"LEFT(BDD!K35,3)","v":""},{"$f":"LEFT(BDD!M35,3)","v":""},{"$f":"LEFT(BDD!O35,3)","v":""},{"$f":"LEFT(BDD!P35,3)","v":""},{"$f":"LEFT(BDD!R35,3)","v":""},{"$f":"LEFT(BDD!S35,3)","v":""},{"$f":"LEFT(BDD!T35,3)","v":""},{"$f":"LEFT(BDD!U35,3)","v":""},{"$f":"LEFT(BDD!V35,3)","v":""},{"$f":"LEFT(BDD!W35,3)","v":""},{"$f":"LEFT(BDD!X35,3)","v":""},{"$f":"LEFT(BDD!Y35,3)","v":""},{"$f":"LEFT(BDD!Z35,3)","v":""},{"$f":"LEFT(BDD!AA35,3)","v":""},{"$f":"LEFT(BDD!AB35,3)","v":""},{"$f":"LEFT(BDD!AC35,3)","v":""},{"$f":"LEFT(BDD!#REF!,3)","v":{"$error":"#REF!"}},{"$f":"LEFT(BDD!AE35,3)","v":""},{"$f":"LEFT(BDD!AF35,3)","v":""},{"$f":"LEFT(BDD!AG35,3)","v":""},{"$f":"LEFT(BDD!AI35,3)","v":""},{"$f":"LEFT(BDD!AJ35,3)","v":""},{"$f":"LEFT(BDD!AK35,3)","v":""},{"$f":"LEFT(BDD!AL35,3)","v":""},{"$f":"LEFT(BDD!AM35,3)","v":""},{"$f":"LEFT(BDD!AN35,3)","v":""},{"$f":"LEFT(BDD!AP35,3)","v":""},{"$f":"LEFT(BDD!AQ35,3)","v":""},{"$f":"LEFT(BDD!AR35,3)","v":""},{"$f":"LEFT(BDD!AS35,3)","v":""},{"$f":"LEFT(BDD!AT35,3)","v":""},{"$f":"LEFT(BDD!AU35,3)","v":""},{"$f":"LEFT(BDD!AV35,3)","v":""},{"$f":"LEFT(BDD!AW35,3)","v":""},{"$f":"LEFT(BDD!AX35,3)","v":""},{"$f":"LEFT(BDD!AY35,3)","v":""},{"$f":"LEFT(BDD!AZ35,3)","v":""},{"$f":"LEFT(BDD!BA35,3)","v":""},{"$f":"LEFT(BDD!BB35,3)","v":""},{"$f":"LEFT(BDD!BC35,3)","v":""},{"$f":"LEFT(BDD!BD35,3)","v":""},{"$f":"LEFT(BDD!BE35,3)","v":""},{"$f":"LEFT(BDD!BF35,3)","v":""},{"$f":"LEFT(BDD!BG35,3)","v":""},{"$f":"LEFT(BDD!BH35,3)","v":""},{"$f":"LEFT(BDD!BI35,3)","v":""},{"$f":"LEFT(BDD!BJ35,3)","v":""},{"$f":"LEFT(BDD!BK35,3)","v":""},{"$f":"LEFT(BDD!#REF!,3)","v":{"$error":"#REF!"}},{"$f":"LEFT(BDD!BL35,3)","v":""},{"$f":"LEFT(BDD!BM35,3)","v":""},{"$f":"LEFT(BDD!BN35,3)","v":""},{"$f":"LEFT(BDD!BO35,3)","v":""},{"$f":"LEFT(BDD!BP35,3)","v":""},{"$f":"LEFT(BDD!#REF!,3)","v":{"$error":"#REF!"}},{"$f":"LEFT(BDD!#REF!,3)","v":{"$error":"#REF!"}},{"$f":"LEFT(BDD!#REF!,3)","v":{"$error":"#REF!"}},{"$f":"LEFT(BDD!#REF!,3)","v":{"$error":"#REF!"}},{"$f":"LEFT(BDD!#REF!,3)","v":{"$error":"#REF!"}},{"$f":"LEFT(BDD!#REF!,3)","v":{"$error":"#REF!"}},{"$f":"LEFT(BDD!#REF!,3)","v":{"$error":"#REF!"}},{"$f":"LEFT(BDD!#REF!,3)","v":{"$error":"#REF!"}},{"$f":"LEFT(BDD!#REF!,3)","v":{"$error":"#REF!"}},{"$f":"LEFT(BDD!#REF!,3)","v":{"$error":"#REF!"}},{"$f":"LEFT(BDD!#REF!,3)","v":{"$error":"#REF!"}},{"$f":"LEFT(BDD!#REF!,3)","v":{"$error":"#REF!"}},{"$f":"LEFT(BDD!#REF!,3)","v":{"$error":"#REF!"}},{"$f":"LEFT(BDD!#REF!,3)","v":{"$error":"#REF!"}}]
[{"$f":"LEFT(BDD!A38,3)","v":"600"},{"$f":"BDD!B38","v":1},{"$f":"LEFT(BDD!#REF!,3)","v":{"$error":"#REF!"}},{"$f":"LEFT(BDD!#REF!,3)","v":{"$error":"#REF!"}},{"$f":"LEFT(BDD!#REF!,3)","v":{"$error":"#REF!"}},{"$f":"LEFT(BDD!#REF!,3)","v":{"$error":"#REF!"}},{"$f":"LEFT(BDD!#REF!,3)","v":{"$error":"#REF!"}},{"$f":"LEFT(BDD!#REF!,3)","v":{"$error":"#REF!"}},{"$f":"LEFT(BDD!#REF!,3)","v":{"$error":"#REF!"}},{"$f":"LEFT(BDD!#REF!,3)","v":{"$error":"#REF!"}},{"$f":"LEFT(BDD!#REF!,3)","v":{"$error":"#REF!"}},{"$f":"LEFT(BDD!#REF!,3)","v":{"$error":"#REF!"}},{"$f":"LEFT(BDD!#REF!,3)","v":{"$error":"#REF!"}},{"$f":"LEFT(BDD!#REF!,3)","v":{"$error":"#REF!"}},{"$f":"LEFT(BDD!#REF!,3)","v":{"$error":"#REF!"}},{"$f":"LEFT(BDD!#REF!,3)","v":{"$error":"#REF!"}},{"$f":"LEFT(BDD!#REF!,3)","v":{"$error":"#REF!"}},{"$f":"LEFT(BDD!#REF!,3)","v":{"$error":"#REF!"}},{"$f":"LEFT(BDD!#REF!,3)","v":{"$error":"#REF!"}},{"$f":"LEFT(BDD!#REF!,3)","v":{"$error":"#REF!"}},{"$f":"LEFT(BDD!#REF!,3)","v":{"$error":"#REF!"}},{"$f":"LEFT(BDD!#REF!,3)","v":{"$error":"#REF!"}},{"$f":"LEFT(BDD!#REF!,3)","v":{"$error":"#REF!"}},{"$f":"LEFT(BDD!#REF!,3)","v":{"$error":"#REF!"}},{"$f":"LEFT(BDD!#REF!,3)","v":{"$error":"#REF!"}},{"$f":"LEFT(BDD!AD36,3)","v":""},{"$f":"LEFT(BDD!#REF!,3)","v":{"$error":"#REF!"}},{"$f":"LEFT(BDD!#REF!,3)","v":{"$error":"#REF!"}},{"$f":"LEFT(BDD!#REF!,3)","v":{"$error":"#REF!"}},{"$f":"LEFT(BDD!#REF!,3)","v":{"$error":"#REF!"}},{"$f":"LEFT(BDD!#REF!,3)","v":{"$error":"#REF!"}},{"$f":"LEFT(BDD!#REF!,3)","v":{"$error":"#REF!"}},{"$f":"LEFT(BDD!#REF!,3)","v":{"$error":"#REF!"}},{"$f":"LEFT(BDD!#REF!,3)","v":{"$error":"#REF!"}},{"$f":"LEFT(BDD!#REF!,3)","v":{"$error":"#REF!"}},{"$f":"LEFT(BDD!#REF!,3)","v":{"$error":"#REF!"}},{"$f":"LEFT(BDD!#REF!,3)","v":{"$error":"#REF!"}},{"$f":"LEFT(BDD!#REF!,3)","v":{"$error":"#REF!"}},{"$f":"LEFT(BDD!#REF!,3)","v":{"$error":"#REF!"}},{"$f":"LEFT(BDD!#REF!,3)","v":{"$error":"#REF!"}},{"$f":"LEFT(BDD!#REF!,3)","v":{"$error":"#REF!"}},{"$f":"LEFT(BDD!#REF!,3)","v":{"$error":"#REF!"}},{"$f":"LEFT(BDD!#REF!,3)","v":{"$error":"#REF!"}},{"$f":"LEFT(BDD!#REF!,3)","v":{"$error":"#REF!"}},{"$f":"LEFT(BDD!#REF!,3)","v":{"$error":"#REF!"}},{"$f":"LEFT(BDD!#REF!,3)","v":{"$error":"#REF!"}},{"$f":"LEFT(BDD!#REF!,3)","v":{"$error":"#REF!"}},{"$f":"LEFT(BDD!#REF!,3)","v":{"$error":"#REF!"}},{"$f":"LEFT(BDD!#REF!,3)","v":{"$error":"#REF!"}},{"$f":"LEFT(BDD!#REF!,3)","v":{"$error":"#REF!"}},{"$f":"LEFT(BDD!#REF!,3)","v":{"$error":"#REF!"}},{"$f":"LEFT(BDD!#REF!,3)","v":{"$error":"#REF!"}},{"$f":"LEFT(BDD!#REF!,3)","v":{"$error":"#REF!"}},{"$f":"LEFT(BDD!#REF!,3)","v":{"$error":"#REF!"}},{"$f":"LEFT(BDD!#REF!,3)","v":{"$error":"#REF!"}},{"$f":"LEFT(BDD!#REF!,3)","v":{"$error":"#REF!"}},{"$f":"LEFT(BDD!#REF!,3)","v":{"$error":"#REF!"}},{"$f":"LEFT(BDD!#REF!,3)","v":{"$error":"#REF!"}},{"$f":"LEFT(BDD!#REF!,3)","v":{"$error":"#REF!"}},{"$f":"LEFT(BDD!#REF!,3)","v":{"$error":"#REF!"}},{"$f":"LEFT(BDD!#REF!,3)","v":{"$error":"#REF!"}},{"$f":"LEFT(BDD!#REF!,3)","v":{"$error":"#REF!"}},{"$f":"LEFT(BDD!#REF!,3)","v":{"$error":"#REF!"}},{"$f":"LEFT(BDD!BQ36,3)","v":""},{"$f":"LEFT(BDD!BR36,3)","v":""},{"$f":"LEFT(BDD!BS36,3)","v":""},{"$f":"LEFT(BDD!BT36,3)","v":""},{"$f":"LEFT(BDD!BU36,3)","v":""},{"$f":"LEFT(BDD!BV36,3)","v":""},{"$f":"LEFT(BDD!BW36,3)","v":""},{"$f":"LEFT(BDD!BX36,3)","v":""},{"$f":"LEFT(BDD!BY36,3)","v":""},{"$f":"LEFT(BDD!BZ36,3)","v":""},{"$f":"LEFT(BDD!CA36,3)","v":""},{"$f":"LEFT(BDD!CB36,3)","v":""},{"$f":"LEFT(BDD!CC36,3)","v":""},{"$f":"LEFT(BDD!CD36,3)","v":""},{"$f":"LEFT(BDD!CE36,3)","v":""}]
[{"$f":"LEFT(BDD!A40,3)","v":"630"},{"$f":"BDD!B40","v":1},{"$f":"LEFT(BDD!C36,3)","v":""},{"$f":"LEFT(BDD!D36,3)","v":""},{"$f":"LEFT(BDD!E36,3)","v":""},{"$f":"LEFT(BDD!F36,3)","v":""},{"$f":"LEFT(BDD!G36,3)","v":""},{"$f":"LEFT(BDD!H36,3)","v":""},{"$f":"LEFT(BDD!J36,3)","v":""},{"$f":"LEFT(BDD!K36,3)","v":""},{"$f":"LEFT(BDD!M36,3)","v":""},{"$f":"LEFT(BDD!O36,3)","v":""},{"$f":"LEFT(BDD!P36,3)","v":""},{"$f":"LEFT(BDD!R36,3)","v":""},{"$f":"LEFT(BDD!S36,3)","v":""},{"$f":"LEFT(BDD!T36,3)","v":""},{"$f":"LEFT(BDD!U36,3)","v":""},{"$f":"LEFT(BDD!V36,3)","v":""},{"$f":"LEFT(BDD!W36,3)","v":""},{"$f":"LEFT(BDD!X36,3)","v":""},{"$f":"LEFT(BDD!Y36,3)","v":""},{"$f":"LEFT(BDD!Z36,3)","v":""},{"$f":"LEFT(BDD!AA36,3)","v":""},{"$f":"LEFT(BDD!AB36,3)","v":""},{"$f":"LEFT(BDD!AC36,3)","v":""},{"$f":"LEFT(BDD!AD39,3)","v":""},{"$f":"LEFT(BDD!AE36,3)","v":""},{"$f":"LEFT(BDD!AF36,3)","v":""},{"$f":"LEFT(BDD!AG36,3)","v":""},{"$f":"LEFT(BDD!AI36,3)","v":""},{"$f":"LEFT(BDD!AJ36,3)","v":""},{"$f":"LEFT(BDD!AK36,3)","v":""},{"$f":"LEFT(BDD!AL36,3)","v":""},{"$f":"LEFT(BDD!AM36,3)","v":""},{"$f":"LEFT(BDD!AN36,3)","v":""},{"$f":"LEFT(BDD!AP36,3)","v":""},{"$f":"LEFT(BDD!AQ36,3)","v":""},{"$f":"LEFT(BDD!AR36,3)","v":""},{"$f":"LEFT(BDD!AS36,3)","v":""},{"$f":"LEFT(BDD!AT36,3)","v":""},{"$f":"LEFT(BDD!AU36,3)","v":""},{"$f":"LEFT(BDD!AV36,3)","v":""},{"$f":"LEFT(BDD!AW36,3)","v":""},{"$f":"LEFT(BDD!AX36,3)","v":""},{"$f":"LEFT(BDD!AY36,3)","v":""},{"$f":"LEFT(BDD!AZ36,3)","v":""},{"$f":"LEFT(BDD!BA36,3)","v":""},{"$f":"LEFT(BDD!BB36,3)","v":""},{"$f":"LEFT(BDD!BC36,3)","v":""},{"$f":"LEFT(BDD!BD36,3)","v":""},{"$f":"LEFT(BDD!BE36,3)","v":""},{"$f":"LEFT(BDD!BF36,3)","v":""},{"$f":"LEFT(BDD!BG36,3)","v":""},{"$f":"LEFT(BDD!BH36,3)","v":""},{"$f":"LEFT(BDD!BI36,3)","v":""},{"$f":"LEFT(BDD!BJ36,3)","v":""},{"$f":"LEFT(BDD!BK36,3)","v":""},{"$f":"LEFT(BDD!#REF!,3)","v":{"$error":"#REF!"}},{"$f":"LEFT(BDD!BL36,3)","v":""},{"$f":"LEFT(BDD!BM36,3)","v":""},{"$f":"LEFT(BDD!BN36,3)","v":""},{"$f":"LEFT(BDD!BO36,3)","v":""},{"$f":"LEFT(BDD!BP36,3)","v":""},{"$f":"LEFT(BDD!BQ38,3)","v":""},{"$f":"LEFT(BDD!BR38,3)","v":""},{"$f":"LEFT(BDD!BS38,3)","v":""},{"$f":"LEFT(BDD!BT38,3)","v":""},{"$f":"LEFT(BDD!BU38,3)","v":""},{"$f":"LEFT(BDD!BV38,3)","v":""},{"$f":"LEFT(BDD!BW38,3)","v":""},{"$f":"LEFT(BDD!BX38,3)","v":""},{"$f":"LEFT(BDD!BY38,3)","v":""},{"$f":"LEFT(BDD!BZ38,3)","v":""},{"$f":"LEFT(BDD!CA38,3)","v":""},{"$f":"LEFT(BDD!CB38,3)","v":""},{"$f":"LEFT(BDD!CC38,3)","v":""},{"$f":"LEFT(BDD!CD38,3)","v":""},{"$f":"LEFT(BDD!CE38,3)","v":""}]
[{"$f":"LEFT(BDD!#REF!,3)","v":{"$error":"#REF!"}},{"$f":"BDD!#REF!","v":{"$error":"#REF!"}},{"$f":"LEFT(BDD!C39,3)","v":""},{"$f":"LEFT(BDD!D39,3)","v":""},{"$f":"LEFT(BDD!E39,3)","v":""},{"$f":"LEFT(BDD!F39,3)","v":""},{"$f":"LEFT(BDD!G39,3)","v":""},{"$f":"LEFT(BDD!H39,3)","v":""},{"$f":"LEFT(BDD!J39,3)","v":""},{"$f":"LEFT(BDD!K39,3)","v":""},{"$f":"LEFT(BDD!M39,3)","v":""},{"$f":"LEFT(BDD!O39,3)","v":""},{"$f":"LEFT(BDD!P39,3)","v":""},{"$f":"LEFT(BDD!R39,3)","v":""},{"$f":"LEFT(BDD!S39,3)","v":""},{"$f":"LEFT(BDD!T39,3)","v":""},{"$f":"LEFT(BDD!U39,3)","v":""},{"$f":"LEFT(BDD!V39,3)","v":""},{"$f":"LEFT(BDD!W39,3)","v":""},{"$f":"LEFT(BDD!X39,3)","v":""},{"$f":"LEFT(BDD!Y39,3)","v":""},{"$f":"LEFT(BDD!Z39,3)","v":""},{"$f":"LEFT(BDD!AA39,3)","v":""},{"$f":"LEFT(BDD!AB40,3)","v":""},{"$f":"LEFT(BDD!AC39,3)","v":""},{"$f":"LEFT(BDD!AD40,3)","v":""},{"$f":"LEFT(BDD!AE39,3)","v":""},{"$f":"LEFT(BDD!AF39,3)","v":""},{"$f":"LEFT(BDD!AG39,3)","v":""},{"$f":"LEFT(BDD!AI39,3)","v":""},{"$f":"LEFT(BDD!AJ39,3)","v":""},{"$f":"LEFT(BDD!AK39,3)","v":""},{"$f":"LEFT(BDD!AL39,3)","v":""},{"$f":"LEFT(BDD!AM39,3)","v":""},{"$f":"LEFT(BDD!AN39,3)","v":""},{"$f":"LEFT(BDD!AP39,3)","v":""},{"$f":"LEFT(BDD!AQ39,3)","v":""},{"$f":"LEFT(BDD!AR39,3)","v":""},{"$f":"LEFT(BDD!AS39,3)","v":""},{"$f":"LEFT(BDD!AT39,3)","v":""},{"$f":"LEFT(BDD!AU39,3)","v":""},{"$f":"LEFT(BDD!AV39,3)","v":""},{"$f":"LEFT(BDD!AW39,3)","v":""},{"$f":"LEFT(BDD!AX39,3)","v":""},{"$f":"LEFT(BDD!AY39,3)","v":""},{"$f":"LEFT(BDD!AZ39,3)","v":""},{"$f":"LEFT(BDD!BA39,3)","v":""},{"$f":"LEFT(BDD!BB39,3)","v":""},{"$f":"LEFT(BDD!BC39,3)","v":""},{"$f":"LEFT(BDD!BD39,3)","v":""},{"$f":"LEFT(BDD!BE39,3)","v":""},{"$f":"LEFT(BDD!BF39,3)","v":""},{"$f":"LEFT(BDD!BG39,3)","v":""},{"$f":"LEFT(BDD!BH39,3)","v":""},{"$f":"LEFT(BDD!BI39,3)","v":""},{"$f":"LEFT(BDD!BJ39,3)","v":""},{"$f":"LEFT(BDD!BK39,3)","v":""},{"$f":"LEFT(BDD!#REF!,3)","v":{"$error":"#REF!"}},{"$f":"LEFT(BDD!BL39,3)","v":""},{"$f":"LEFT(BDD!BM39,3)","v":""},{"$f":"LEFT(BDD!BN39,3)","v":""},{"$f":"LEFT(BDD!BO39,3)","v":""},{"$f":"LEFT(BDD!BP39,3)","v":""},{"$f":"LEFT(BDD!BQ40,3)","v":""},{"$f":"LEFT(BDD!BR40,3)","v":""},{"$f":"LEFT(BDD!BS40,3)","v":""},{"$f":"LEFT(BDD!BT40,3)","v":""},{"$f":"LEFT(BDD!BU40,3)","v":""},{"$f":"LEFT(BDD!BV40,3)","v":""},{"$f":"LEFT(BDD!BW40,3)","v":""},{"$f":"LEFT(BDD!BX40,3)","v":""},{"$f":"LEFT(BDD!BY40,3)","v":""},{"$f":"LEFT(BDD!BZ40,3)","v":""},{"$f":"LEFT(BDD!CA40,3)","v":""},{"$f":"LEFT(BDD!CB40,3)","v":""},{"$f":"LEFT(BDD!CC40,3)","v":""},{"$f":"LEFT(BDD!CD40,3)","v":""},{"$f":"LEFT(BDD!CE40,3)","v":""}]
[{"$f":"LEFT(BDD!A42,3)","v":"700"},{"$f":"BDD!B42","v":9},{"$f":"LEFT(BDD!C40,3)","v":""},{"$f":"LEFT(BDD!D40,3)","v":""},{"$f":"LEFT(BDD!E40,3)","v":""},{"$f":"LEFT(BDD!F40,3)","v":""},{"$f":"LEFT(BDD!G40,3)","v":""},{"$f":"LEFT(BDD!H40,3)","v":""},{"$f":"LEFT(BDD!J40,3)","v":""},{"$f":"LEFT(BDD!K40,3)","v":""},{"$f":"LEFT(BDD!M40,3)","v":""},{"$f":"LEFT(BDD!O40,3)","v":""},{"$f":"LEFT(BDD!P40,3)","v":""},{"$f":"LEFT(BDD!R40,3)","v":""},{"$f":"LEFT(BDD!S40,3)","v":""},{"$f":"LEFT(BDD!T40,3)","v":""},{"$f":"LEFT(BDD!U40,3)","v":""},{"$f":"LEFT(BDD!V40,3)","v":""},{"$f":"LEFT(BDD!W40,3)","v":""},{"$f":"LEFT(BDD!X40,3)","v":""},{"$f":"LEFT(BDD!Y40,3)","v":""},{"$f":"LEFT(BDD!Z40,3)","v":""},{"$f":"LEFT(BDD!AA40,3)","v":""},{"$f":"LEFT(BDD!AB41,3)","v":""},{"$f":"LEFT(BDD!AC40,3)","v":""},{"$f":"LEFT(BDD!AD41,3)","v":""},{"$f":"LEFT(BDD!AE40,3)","v":""},{"$f":"LEFT(BDD!AF40,3)","v":""},{"$f":"LEFT(BDD!AG40,3)","v":""},{"$f":"LEFT(BDD!AI40,3)","v":""},{"$f":"LEFT(BDD!AJ40,3)","v":""},{"$f":"LEFT(BDD!AK40,3)","v":""},{"$f":"LEFT(BDD!AL40,3)","v":""},{"$f":"LEFT(BDD!AM40,3)","v":""},{"$f":"LEFT(BDD!AN40,3)","v":""},{"$f":"LEFT(BDD!AP40,3)","v":""},{"$f":"LEFT(BDD!AQ40,3)","v":""},{"$f":"LEFT(BDD!AR40,3)","v":""},{"$f":"LEFT(BDD!AS40,3)","v":""},{"$f":"LEFT(BDD!AT40,3)","v":""},{"$f":"LEFT(BDD!AU40,3)","v":""},{"$f":"LEFT(BDD!AV40,3)","v":""},{"$f":"LEFT(BDD!AW40,3)","v":""},{"$f":"LEFT(BDD!AX41,3)","v":""},{"$f":"LEFT(BDD!AY40,3)","v":""},{"$f":"LEFT(BDD!AZ40,3)","v":""},{"$f":"LEFT(BDD!BA40,3)","v":""},{"$f":"LEFT(BDD!BB40,3)","v":""},{"$f":"LEFT(BDD!BC40,3)","v":""},{"$f":"LEFT(BDD!BD40,3)","v":""},{"$f":"LEFT(BDD!BE40,3)","v":""},{"$f":"LEFT(BDD!BF40,3)","v":""},{"$f":"LEFT(BDD!BG40,3)","v":""},{"$f":"LEFT(BDD!BH40,3)","v":""},{"$f":"LEFT(BDD!BI40,3)","v":""},{"$f":"LEFT(BDD!BJ40,3)","v":""},{"$f":"LEFT(BDD!BK40,3)","v":""},{"$f":"LEFT(BDD!#REF!,3)","v":{"$error":"#REF!"}},{"$f":"LEFT(BDD!BL40,3)","v":""},{"$f":"LEFT(BDD!BM40,3)","v":""},{"$f":"LEFT(BDD!BN40,3)","v":""},{"$f":"LEFT(BDD!BO40,3)","v":""},{"$f":"LEFT(BDD!BP40,3)","v":""},{"$f":"LEFT(BDD!BQ41,3)","v":""},{"$f":"LEFT(BDD!BR41,3)","v":""},{"$f":"LEFT(BDD!BS41,3)","v":""},{"$f":"LEFT(BDD!BT41,3)","v":""},{"$f":"LEFT(BDD!BU41,3)","v":""},{"$f":"LEFT(BDD!BV41,3)","v":""},{"$f":"LEFT(BDD!BW41,3)","v":""},{"$f":"LEFT(BDD!BX41,3)","v":""},{"$f":"LEFT(BDD!BY41,3)","v":""},{"$f":"LEFT(BDD!BZ41,3)","v":""},{"$f":"LEFT(BDD!CA41,3)","v":""},{"$f":"LEFT(BDD!CB41,3)","v":""},{"$f":"LEFT(BDD!CC41,3)","v":""},{"$f":"LEFT(BDD!CD41,3)","v":""},{"$f":"LEFT(BDD!CE41,3)","v":""}]
[{"$f":"LEFT(BDD!A43,3)","v":"703"},{"$f":"BDD!B43","v":1},{"$f":"LEFT(BDD!C41,3)","v":""},{"$f":"LEFT(BDD!D41,3)","v":""},{"$f":"LEFT(BDD!E41,3)","v":""},{"$f":"LEFT(BDD!F41,3)","v":""},{"$f":"LEFT(BDD!G41,3)","v":""},{"$f":"LEFT(BDD!H41,3)","v":""},{"$f":"LEFT(BDD!J41,3)","v":""},{"$f":"LEFT(BDD!K41,3)","v":""},{"$f":"LEFT(BDD!M41,3)","v":""},{"$f":"LEFT(BDD!O41,3)","v":""},{"$f":"LEFT(BDD!P41,3)","v":""},{"$f":"LEFT(BDD!R41,3)","v":""},{"$f":"LEFT(BDD!S41,3)","v":""},{"$f":"LEFT(BDD!T41,3)","v":""},{"$f":"LEFT(BDD!U41,3)","v":""},{"$f":"LEFT(BDD!V41,3)","v":""},{"$f":"LEFT(BDD!W41,3)","v":""},{"$f":"LEFT(BDD!X41,3)","v":""},{"$f":"LEFT(BDD!Y41,3)","v":""},{"$f":"LEFT(BDD!Z41,3)","v":""},{"$f":"LEFT(BDD!AA41,3)","v":""},{"$f":"LEFT(BDD!AB42,3)","v":""},{"$f":"LEFT(BDD!AC41,3)","v":""},{"$f":"LEFT(BDD!AD42,3)","v":""},{"$f":"LEFT(BDD!AE41,3)","v":""},{"$f":"LEFT(BDD!AF41,3)","v":""},{"$f":"LEFT(BDD!AG41,3)","v":""},{"$f":"LEFT(BDD!AI41,3)","v":""},{"$f":"LEFT(BDD!AJ41,3)","v":""},{"$f":"LEFT(BDD!AK41,3)","v":""},{"$f":"LEFT(BDD!AL41,3)","v":""},{"$f":"LEFT(BDD!AM41,3)","v":""},{"$f":"LEFT(BDD!AN41,3)","v":""},{"$f":"LEFT(BDD!AP41,3)","v":""},{"$f":"LEFT(BDD!AQ41,3)","v":""},{"$f":"LEFT(BDD!AR41,3)","v":""},{"$f":"LEFT(BDD!AS41,3)","v":""},{"$f":"LEFT(BDD!AT41,3)","v":""},{"$f":"LEFT(BDD!AU41,3)","v":""},{"$f":"LEFT(BDD!AV41,3)","v":""},{"$f":"LEFT(BDD!AW41,3)","v":""},{"$f":"LEFT(BDD!AX42,3)","v":""},{"$f":"LEFT(BDD!AY41,3)","v":""},{"$f":"LEFT(BDD!AZ41,3)","v":""},{"$f":"LEFT(BDD!BA41,3)","v":""},{"$f":"LEFT(BDD!BB41,3)","v":""},{"$f":"LEFT(BDD!BC41,3)","v":""},{"$f":"LEFT(BDD!BD41,3)","v":""},{"$f":"LEFT(BDD!BE41,3)","v":""},{"$f":"LEFT(BDD!BF41,3)","v":""},{"$f":"LEFT(BDD!BG41,3)","v":""},{"$f":"LEFT(BDD!BH41,3)","v":""},{"$f":"LEFT(BDD!BI41,3)","v":""},{"$f":"LEFT(BDD!BJ41,3)","v":""},{"$f":"LEFT(BDD!BK41,3)","v":""},{"$f":"LEFT(BDD!#REF!,3)","v":{"$error":"#REF!"}},{"$f":"LEFT(BDD!BL41,3)","v":""},{"$f":"LEFT(BDD!BM41,3)","v":""},{"$f":"LEFT(BDD!BN41,3)","v":""},{"$f":"LEFT(BDD!BO41,3)","v":""},{"$f":"LEFT(BDD!BP41,3)","v":""},{"$f":"LEFT(BDD!BQ42,3)","v":""},{"$f":"LEFT(BDD!BR42,3)","v":""},{"$f":"LEFT(BDD!BS42,3)","v":""},{"$f":"LEFT(BDD!BT42,3)","v":""},{"$f":"LEFT(BDD!BU42,3)","v":""},{"$f":"LEFT(BDD!BV42,3)","v":""},{"$f":"LEFT(BDD!BW42,3)","v":""},{"$f":"LEFT(BDD!BX42,3)","v":""},{"$f":"LEFT(BDD!BY42,3)","v":""},{"$f":"LEFT(BDD!BZ42,3)","v":""},{"$f":"LEFT(BDD!CA42,3)","v":""},{"$f":"LEFT(BDD!CB42,3)","v":""},{"$f":"LEFT(BDD!CC42,3)","v":""},{"$f":"LEFT(BDD!CD42,3)","v":""},{"$f":"LEFT(BDD!CE42,3)","v":""}]
[{"$f":"LEFT(BDD!A44,3)","v":"710"},{"$f":"BDD!B44","v":1},{"$f":"LEFT(BDD!C42,3)","v":""},{"$f":"LEFT(BDD!D42,3)","v":""},{"$f":"LEFT(BDD!E42,3)","v":""},{"$f":"LEFT(BDD!F42,3)","v":""},{"$f":"LEFT(BDD!G42,3)","v":""},{"$f":"LEFT(BDD!H42,3)","v":""},{"$f":"LEFT(BDD!J42,3)","v":""},{"$f":"LEFT(BDD!K42,3)","v":""},{"$f":"LEFT(BDD!M42,3)","v":""},{"$f":"LEFT(BDD!O42,3)","v":""},{"$f":"LEFT(BDD!P42,3)","v":""},{"$f":"LEFT(BDD!R42,3)","v":""},{"$f":"LEFT(BDD!S42,3)","v":""},{"$f":"LEFT(BDD!T42,3)","v":""},{"$f":"LEFT(BDD!U42,3)","v":""},{"$f":"LEFT(BDD!V42,3)","v":""},{"$f":"LEFT(BDD!W42,3)","v":""},{"$f":"LEFT(BDD!X42,3)","v":""},{"$f":"LEFT(BDD!Y42,3)","v":""},{"$f":"LEFT(BDD!Z42,3)","v":""},{"$f":"LEFT(BDD!AA42,3)","v":""},{"$f":"LEFT(BDD!AB43,3)","v":""},{"$f":"LEFT(BDD!AC42,3)","v":""},{"$f":"LEFT(BDD!AD43,3)","v":""},{"$f":"LEFT(BDD!AE42,3)","v":""},{"$f":"LEFT(BDD!AF42,3)","v":""},{"$f":"LEFT(BDD!AG42,3)","v":""},{"$f":"LEFT(BDD!AI42,3)","v":""},{"$f":"LEFT(BDD!AJ42,3)","v":""},{"$f":"LEFT(BDD!AK42,3)","v":""},{"$f":"LEFT(BDD!AL42,3)","v":""},{"$f":"LEFT(BDD!AM42,3)","v":""},{"$f":"LEFT(BDD!AN42,3)","v":""},{"$f":"LEFT(BDD!AP42,3)","v":""},{"$f":"LEFT(BDD!AQ42,3)","v":""},{"$f":"LEFT(BDD!AR42,3)","v":""},{"$f":"LEFT(BDD!AS42,3)","v":""},{"$f":"LEFT(BDD!AT42,3)","v":""},{"$f":"LEFT(BDD!AU42,3)","v":""},{"$f":"LEFT(BDD!AV42,3)","v":""},{"$f":"LEFT(BDD!AW42,3)","v":""},{"$f":"LEFT(BDD!AX43,3)","v":""},{"$f":"LEFT(BDD!AY42,3)","v":""},{"$f":"LEFT(BDD!AZ42,3)","v":""},{"$f":"LEFT(BDD!BA42,3)","v":""},{"$f":"LEFT(BDD!BB42,3)","v":""},{"$f":"LEFT(BDD!BC42,3)","v":""},{"$f":"LEFT(BDD!BD42,3)","v":""},{"$f":"LEFT(BDD!BE42,3)","v":""},{"$f":"LEFT(BDD!BF42,3)","v":""},{"$f":"LEFT(BDD!BG42,3)","v":""},{"$f":"LEFT(BDD!BH42,3)","v":""},{"$f":"LEFT(BDD!BI42,3)","v":""},{"$f":"LEFT(BDD!BJ42,3)","v":""},{"$f":"LEFT(BDD!BK42,3)","v":""},{"$f":"LEFT(BDD!#REF!,3)","v":{"$error":"#REF!"}},{"$f":"LEFT(BDD!BL42,3)","v":""},{"$f":"LEFT(BDD!BM42,3)","v":""},{"$f":"LEFT(BDD!BN42,3)","v":""},{"$f":"LEFT(BDD!BO42,3)","v":""},{"$f":"LEFT(BDD!BP42,3)","v":""},{"$f":"LEFT(BDD!BQ43,3)","v":""},{"$f":"LEFT(BDD!BR43,3)","v":""},{"$f":"LEFT(BDD!BS43,3)","v":""},{"$f":"LEFT(BDD!BT43,3)","v":""},{"$f":"LEFT(BDD!BU43,3)","v":""},{"$f":"LEFT(BDD!BV43,3)","v":""},{"$f":"LEFT(BDD!BW43,3)","v":""},{"$f":"LEFT(BDD!BX43,3)","v":""},{"$f":"LEFT(BDD!BY43,3)","v":""},{"$f":"LEFT(BDD!BZ43,3)","v":""},{"$f":"LEFT(BDD!CA43,3)","v":""},{"$f":"LEFT(BDD!CB43,3)","v":""},{"$f":"LEFT(BDD!CC43,3)","v":""},{"$f":"LEFT(BDD!CD43,3)","v":""},{"$f":"LEFT(BDD!CE43,3)","v":""}]
[{"$f":"LEFT(BDD!A45,3)","v":"771"},{"$f":"BDD!B45","v":1},{"$f":"LEFT(BDD!C43,3)","v":""},{"$f":"LEFT(BDD!D43,3)","v":""},{"$f":"LEFT(BDD!E43,3)","v":""},{"$f":"LEFT(BDD!F43,3)","v":""},{"$f":"LEFT(BDD!G43,3)","v":""},{"$f":"LEFT(BDD!H43,3)","v":""},{"$f":"LEFT(BDD!J43,3)","v":""},{"$f":"LEFT(BDD!K43,3)","v":""},{"$f":"LEFT(BDD!M43,3)","v":""},{"$f":"LEFT(BDD!O43,3)","v":""},{"$f":"LEFT(BDD!P43,3)","v":""},{"$f":"LEFT(BDD!R43,3)","v":""},{"$f":"LEFT(BDD!S43,3)","v":""},{"$f":"LEFT(BDD!T43,3)","v":""},{"$f":"LEFT(BDD!U43,3)","v":""},{"$f":"LEFT(BDD!V43,3)","v":""},{"$f":"LEFT(BDD!W43,3)","v":""},{"$f":"LEFT(BDD!X43,3)","v":""},{"$f":"LEFT(BDD!Y43,3)","v":""},{"$f":"LEFT(BDD!Z43,3)","v":""},{"$f":"LEFT(BDD!AA43,3)","v":""},{"$f":"LEFT(BDD!AB44,3)","v":""},{"$f":"LEFT(BDD!AC43,3)","v":""},{"$f":"LEFT(BDD!AD44,3)","v":""},{"$f":"LEFT(BDD!AE43,3)","v":""},{"$f":"LEFT(BDD!AF43,3)","v":""},{"$f":"LEFT(BDD!AG43,3)","v":""},{"$f":"LEFT(BDD!AI43,3)","v":""},{"$f":"LEFT(BDD!AJ43,3)","v":""},{"$f":"LEFT(BDD!AK43,3)","v":""},{"$f":"LEFT(BDD!AL43,3)","v":""},{"$f":"LEFT(BDD!AM43,3)","v":""},{"$f":"LEFT(BDD!AN43,3)","v":""},{"$f":"LEFT(BDD!AP43,3)","v":""},{"$f":"LEFT(BDD!AQ43,3)","v":""},{"$f":"LEFT(BDD!AR43,3)","v":""},{"$f":"LEFT(BDD!AS43,3)","v":""},{"$f":"LEFT(BDD!AT43,3)","v":""},{"$f":"LEFT(BDD!AU43,3)","v":""},{"$f":"LEFT(BDD!AV43,3)","v":""},{"$f":"LEFT(BDD!AW43,3)","v":""},{"$f":"LEFT(BDD!AX44,3)","v":""},{"$f":"LEFT(BDD!AY43,3)","v":""},{"$f":"LEFT(BDD!AZ43,3)","v":""},{"$f":"LEFT(BDD!BA43,3)","v":""},{"$f":"LEFT(BDD!BB43,3)","v":""},{"$f":"LEFT(BDD!BC43,3)","v":""},{"$f":"LEFT(BDD!BD43,3)","v":""},{"$f":"LEFT(BDD!BE43,3)","v":""},{"$f":"LEFT(BDD!BF43,3)","v":""},{"$f":"LEFT(BDD!BG43,3)","v":""},{"$f":"LEFT(BDD!BH43,3)","v":""},{"$f":"LEFT(BDD!BI43,3)","v":""},{"$f":"LEFT(BDD!BJ43,3)","v":""},{"$f":"LEFT(BDD!BK43,3)","v":""},{"$f":"LEFT(BDD!#REF!,3)","v":{"$error":"#REF!"}},{"$f":"LEFT(BDD!BL43,3)","v":""},{"$f":"LEFT(BDD!BM43,3)","v":""},{"$f":"LEFT(BDD!BN43,3)","v":""},{"$f":"LEFT(BDD!BO43,3)","v":""},{"$f":"LEFT(BDD!BP43,3)","v":""},{"$f":"LEFT(BDD!BQ44,3)","v":""},{"$f":"LEFT(BDD!BR44,3)","v":""},{"$f":"LEFT(BDD!BS44,3)","v":""},{"$f":"LEFT(BDD!BT44,3)","v":""},{"$f":"LEFT(BDD!BU44,3)","v":""},{"$f":"LEFT(BDD!BV44,3)","v":""},{"$f":"LEFT(BDD!BW44,3)","v":""},{"$f":"LEFT(BDD!BX44,3)","v":""},{"$f":"LEFT(BDD!BY44,3)","v":""},{"$f":"LEFT(BDD!BZ44,3)","v":""},{"$f":"LEFT(BDD!CA44,3)","v":""},{"$f":"LEFT(BDD!CB44,3)","v":""},{"$f":"LEFT(BDD!CC44,3)","v":""},{"$f":"LEFT(BDD!CD44,3)","v":""},{"$f":"LEFT(BDD!CE44,3)","v":""}]
[{"$f":"LEFT(BDD!A46,3)","v":"773"},{"$f":"BDD!B46","v":1},{"$f":"LEFT(BDD!C44,3)","v":""},{"$f":"LEFT(BDD!D44,3)","v":""},{"$f":"LEFT(BDD!E44,3)","v":""},{"$f":"LEFT(BDD!F44,3)","v":""},{"$f":"LEFT(BDD!G44,3)","v":""},{"$f":"LEFT(BDD!H44,3)","v":""},{"$f":"LEFT(BDD!J44,3)","v":""},{"$f":"LEFT(BDD!K44,3)","v":""},{"$f":"LEFT(BDD!M44,3)","v":""},{"$f":"LEFT(BDD!O44,3)","v":""},{"$f":"LEFT(BDD!P44,3)","v":""},{"$f":"LEFT(BDD!R44,3)","v":""},{"$f":"LEFT(BDD!S44,3)","v":""},{"$f":"LEFT(BDD!T44,3)","v":""},{"$f":"LEFT(BDD!U44,3)","v":""},{"$f":"LEFT(BDD!V44,3)","v":""},{"$f":"LEFT(BDD!W44,3)","v":""},{"$f":"LEFT(BDD!X44,3)","v":""},{"$f":"LEFT(BDD!Y44,3)","v":""},{"$f":"LEFT(BDD!Z44,3)","v":""},{"$f":"LEFT(BDD!AA44,3)","v":""},{"$f":"LEFT(BDD!AB45,3)","v":""},{"$f":"LEFT(BDD!AC44,3)","v":""},{"$f":"LEFT(BDD!AD45,3)","v":""},{"$f":"LEFT(BDD!AE44,3)","v":""},{"$f":"LEFT(BDD!AF44,3)","v":""},{"$f":"LEFT(BDD!AG44,3)","v":""},{"$f":"LEFT(BDD!AI44,3)","v":""},{"$f":"LEFT(BDD!AJ44,3)","v":""},{"$f":"LEFT(BDD!AK44,3)","v":""},{"$f":"LEFT(BDD!AL44,3)","v":""},{"$f":"LEFT(BDD!AM44,3)","v":""},{"$f":"LEFT(BDD!AN44,3)","v":""},{"$f":"LEFT(BDD!AP44,3)","v":""},{"$f":"LEFT(BDD!AQ44,3)","v":""},{"$f":"LEFT(BDD!AR44,3)","v":""},{"$f":"LEFT(BDD!AS44,3)","v":""},{"$f":"LEFT(BDD!AT44,3)","v":""},{"$f":"LEFT(BDD!AU44,3)","v":""},{"$f":"LEFT(BDD!AV44,3)","v":""},{"$f":"LEFT(BDD!AW44,3)","v":""},{"$f":"LEFT(BDD!AX45,3)","v":""},{"$f":"LEFT(BDD!AY44,3)","v":""},{"$f":"LEFT(BDD!AZ44,3)","v":""},{"$f":"LEFT(BDD!BA44,3)","v":""},{"$f":"LEFT(BDD!BB44,3)","v":""},{"$f":"LEFT(BDD!BC44,3)","v":""},{"$f":"LEFT(BDD!BD44,3)","v":""},{"$f":"LEFT(BDD!BE44,3)","v":""},{"$f":"LEFT(BDD!BF44,3)","v":""},{"$f":"LEFT(BDD!BG44,3)","v":""},{"$f":"LEFT(BDD!BH44,3)","v":""},{"$f":"LEFT(BDD!BI44,3)","v":""},{"$f":"LEFT(BDD!BJ44,3)","v":""},{"$f":"LEFT(BDD!BK44,3)","v":""},{"$f":"LEFT(BDD!#REF!,3)","v":{"$error":"#REF!"}},{"$f":"LEFT(BDD!BL44,3)","v":""},{"$f":"LEFT(BDD!BM44,3)","v":""},{"$f":"LEFT(BDD!BN44,3)","v":""},{"$f":"LEFT(BDD!BO44,3)","v":""},{"$f":"LEFT(BDD!BP44,3)","v":""},{"$f":"LEFT(BDD!BQ45,3)","v":""},{"$f":"LEFT(BDD!BR45,3)","v":""},{"$f":"LEFT(BDD!BS45,3)","v":""},{"$f":"LEFT(BDD!BT45,3)","v":""},{"$f":"LEFT(BDD!BU45,3)","v":""},{"$f":"LEFT(BDD!BV45,3)","v":""},{"$f":"LEFT(BDD!BW45,3)","v":""},{"$f":"LEFT(BDD!BX45,3)","v":""},{"$f":"LEFT(BDD!BY45,3)","v":""},{"$f":"LEFT(BDD!BZ45,3)","v":""},{"$f":"LEFT(BDD!CA45,3)","v":""},{"$f":"LEFT(BDD!CB45,3)","v":""},{"$f":"LEFT(BDD!CC45,3)","v":""},{"$f":"LEFT(BDD!CD45,3)","v":""},{"$f":"LEFT(BDD!CE45,3)","v":""}]
[{"$f":"LEFT(BDD!#REF!,3)","v":{"$error":"#REF!"}},{"$f":"BDD!#REF!","v":{"$error":"#REF!"}},{"$f":"LEFT(BDD!C45,3)","v":""},{"$f":"LEFT(BDD!D45,3)","v":""},{"$f":"LEFT(BDD!E45,3)","v":""},{"$f":"LEFT(BDD!F45,3)","v":""},{"$f":"LEFT(BDD!G45,3)","v":""},{"$f":"LEFT(BDD!H45,3)","v":""},{"$f":"LEFT(BDD!J45,3)","v":""},{"$f":"LEFT(BDD!K45,3)","v":""},{"$f":"LEFT(BDD!M45,3)","v":""},{"$f":"LEFT(BDD!O45,3)","v":""},{"$f":"LEFT(BDD!P45,3)","v":""},{"$f":"LEFT(BDD!R45,3)","v":""},{"$f":"LEFT(BDD!S45,3)","v":""},{"$f":"LEFT(BDD!T45,3)","v":""},{"$f":"LEFT(BDD!U45,3)","v":""},{"$f":"LEFT(BDD!V45,3)","v":""},{"$f":"LEFT(BDD!W45,3)","v":""},{"$f":"LEFT(BDD!X45,3)","v":""},{"$f":"LEFT(BDD!Y45,3)","v":""},{"$f":"LEFT(BDD!Z45,3)","v":""},{"$f":"LEFT(BDD!AA45,3)","v":""},{"$f":"LEFT(BDD!AB46,3)","v":""},{"$f":"LEFT(BDD!AC45,3)","v":""},{"$f":"LEFT(BDD!AD46,3)","v":""},{"$f":"LEFT(BDD!AE45,3)","v":""},{"$f":"LEFT(BDD!AF45,3)","v":""},{"$f":"LEFT(BDD!AG45,3)","v":""},{"$f":"LEFT(BDD!AI45,3)","v":""},{"$f":"LEFT(BDD!AJ45,3)","v":""},{"$f":"LEFT(BDD!AK45,3)","v":""},{"$f":"LEFT(BDD!AL45,3)","v":""},{"$f":"LEFT(BDD!AM45,3)","v":""},{"$f":"LEFT(BDD!AN45,3)","v":""},{"$f":"LEFT(BDD!AP45,3)","v":""},{"$f":"LEFT(BDD!AQ45,3)","v":""},{"$f":"LEFT(BDD!AR45,3)","v":""},{"$f":"LEFT(BDD!AS45,3)","v":""},{"$f":"LEFT(BDD!AT45,3)","v":""},{"$f":"LEFT(BDD!AU45,3)","v":""},{"$f":"LEFT(BDD!AV45,3)","v":""},{"$f":"LEFT(BDD!AW45,3)","v":""},{"$f":"LEFT(BDD!AX46,3)","v":""},{"$f":"LEFT(BDD!AY45,3)","v":""},{"$f":"LEFT(BDD!AZ45,3)","v":""},{"$f":"LEFT(BDD!BA45,3)","v":""},{"$f":"LEFT(BDD!BB45,3)","v":""},{"$f":"LEFT(BDD!BC45,3)","v":""},{"$f":"LEFT(BDD!BD45,3)","v":""},{"$f":"LEFT(BDD!BE45,3)","v":""},{"$f":"LEFT(BDD!BF45,3)","v":""},{"$f":"LEFT(BDD!BG45,3)","v":""},{"$f":"LEFT(BDD!BH45,3)","v":""},{"$f":"LEFT(BDD!BI45,3)","v":""},{"$f":"LEFT(BDD!BJ45,3)","v":""},{"$f":"LEFT(BDD!BK45,3)","v":""},{"$f":"LEFT(BDD!#REF!,3)","v":{"$error":"#REF!"}},{"$f":"LEFT(BDD!BL45,3)","v":""},{"$f":"LEFT(BDD!BM45,3)","v":""},{"$f":"LEFT(BDD!BN45,3)","v":""},{"$f":"LEFT(BDD!BO45,3)","v":""},{"$f":"LEFT(BDD!BP45,3)","v":""},{"$f":"LEFT(BDD!BQ46,3)","v":""},{"$f":"LEFT(BDD!BR46,3)","v":""},{"$f":"LEFT(BDD!BS46,3)","v":""},{"$f":"LEFT(BDD!BT46,3)","v":""},{"$f":"LEFT(BDD!BU46,3)","v":""},{"$f":"LEFT(BDD!BV46,3)","v":""},{"$f":"LEFT(BDD!BW46,3)","v":""},{"$f":"LEFT(BDD!BX46,3)","v":""},{"$f":"LEFT(BDD!BY46,3)","v":""},{"$f":"LEFT(BDD!BZ46,3)","v":""},{"$f":"LEFT(BDD!CA46,3)","v":""},{"$f":"LEFT(BDD!CB46,3)","v":""},{"$f":"LEFT(BDD!CC46,3)","v":""},{"$f":"LEFT(BDD!CD46,3)","v":""},{"$f":"LEFT(BDD!CE46,3)","v":""}]
[{"$f":"LEFT(BDD!#REF!,3)","v":{"$error":"#REF!"}},{"$f":"BDD!#REF!","v":{"$error":"#REF!"}},{"$f":"LEFT(BDD!C46,3)","v":""},{"$f":"LEFT(BDD!D46,3)","v":""},{"$f":"LEFT(BDD!E46,3)","v":""},{"$f":"LEFT(BDD!F46,3)","v":""},{"$f":"LEFT(BDD!G46,3)","v":""},{"$f":"LEFT(BDD!H46,3)","v":""},{"$f":"LEFT(BDD!J46,3)","v":""},{"$f":"LEFT(BDD!K46,3)","v":""},{"$f":"LEFT(BDD!M46,3)","v":""},{"$f":"LEFT(BDD!O46,3)","v":""},{"$f":"LEFT(BDD!P46,3)","v":""},{"$f":"LEFT(BDD!R46,3)","v":""},{"$f":"LEFT(BDD!S46,3)","v":""},{"$f":"LEFT(BDD!T46,3)","v":""},{"$f":"LEFT(BDD!U46,3)","v":""},{"$f":"LEFT(BDD!V46,3)","v":""},{"$f":"LEFT(BDD!W46,3)","v":""},{"$f":"LEFT(BDD!X46,3)","v":""},{"$f":"LEFT(BDD!Y46,3)","v":""},{"$f":"LEFT(BDD!Z46,3)","v":""},{"$f":"LEFT(BDD!AA46,3)","v":""},{"$f":"LEFT(BDD!AB46,3)","v":""},{"$f":"LEFT(BDD!AC46,3)","v":""},{"$f":"LEFT(BDD!AD47,3)","v":""},{"$f":"LEFT(BDD!AE46,3)","v":""},{"$f":"LEFT(BDD!AF46,3)","v":""},{"$f":"LEFT(BDD!AG46,3)","v":""},{"$f":"LEFT(BDD!AI46,3)","v":""},{"$f":"LEFT(BDD!AJ46,3)","v":""},{"$f":"LEFT(BDD!AK46,3)","v":""},{"$f":"LEFT(BDD!AL46,3)","v":""},{"$f":"LEFT(BDD!AM46,3)","v":""},{"$f":"LEFT(BDD!AN46,3)","v":""},{"$f":"LEFT(BDD!AP46,3)","v":""},{"$f":"LEFT(BDD!AQ46,3)","v":""},{"$f":"LEFT(BDD!AR46,3)","v":""},{"$f":"LEFT(BDD!AS46,3)","v":""},{"$f":"LEFT(BDD!AT46,3)","v":""},{"$f":"LEFT(BDD!AU46,3)","v":""},{"$f":"LEFT(BDD!AV46,3)","v":""},{"$f":"LEFT(BDD!AW46,3)","v":""},{"$f":"LEFT(BDD!AX47,3)","v":""},{"$f":"LEFT(BDD!AY46,3)","v":""},{"$f":"LEFT(BDD!AZ46,3)","v":""},{"$f":"LEFT(BDD!BA46,3)","v":""},{"$f":"LEFT(BDD!BB46,3)","v":""},{"$f":"LEFT(BDD!BC46,3)","v":""},{"$f":"LEFT(BDD!BD46,3)","v":""},{"$f":"LEFT(BDD!BE46,3)","v":""},{"$f":"LEFT(BDD!BF46,3)","v":""},{"$f":"LEFT(BDD!BG46,3)","v":""},{"$f":"LEFT(BDD!BH46,3)","v":""},{"$f":"LEFT(BDD!BI46,3)","v":""},{"$f":"LEFT(BDD!BJ46,3)","v":""},{"$f":"LEFT(BDD!BK46,3)","v":""},{"$f":"LEFT(BDD!#REF!,3)","v":{"$error":"#REF!"}},{"$f":"LEFT(BDD!BL46,3)","v":""},{"$f":"LEFT(BDD!BM46,3)","v":""},{"$f":"LEFT(BDD!BN46,3)","v":""},{"$f":"LEFT(BDD!BO46,3)","v":""},{"$f":"LEFT(BDD!BP46,3)","v":""},{"$f":"LEFT(BDD!BQ47,3)","v":""},{"$f":"LEFT(BDD!BR47,3)","v":""},{"$f":"LEFT(BDD!BS47,3)","v":""},{"$f":"LEFT(BDD!BT47,3)","v":""},{"$f":"LEFT(BDD!BU47,3)","v":""},{"$f":"LEFT(BDD!BV47,3)","v":""},{"$f":"LEFT(BDD!BW47,3)","v":""},{"$f":"LEFT(BDD!BX47,3)","v":""},{"$f":"LEFT(BDD!BY47,3)","v":""},{"$f":"LEFT(BDD!BZ47,3)","v":""},{"$f":"LEFT(BDD!CA47,3)","v":""},{"$f":"LEFT(BDD!CB47,3)","v":""},{"$f":"LEFT(BDD!CC47,3)","v":""},{"$f":"LEFT(BDD!CD47,3)","v":""},{"$f":"LEFT(BDD!CE47,3)","v":""}]
[{"$f":"LEFT(BDD!A47,3)","v":"787"},{"$f":"BDD!B47","v":1},{"$f":"LEFT(BDD!C47,3)","v":""},{"$f":"LEFT(BDD!D47,3)","v":""},{"$f":"LEFT(BDD!E47,3)","v":""},{"$f":"LEFT(BDD!F47,3)","v":""},{"$f":"LEFT(BDD!G47,3)","v":""},{"$f":"LEFT(BDD!H47,3)","v":""},{"$f":"LEFT(BDD!J47,3)","v":""},{"$f":"LEFT(BDD!K47,3)","v":""},{"$f":"LEFT(BDD!M47,3)","v":""},{"$f":"LEFT(BDD!O47,3)","v":""},{"$f":"LEFT(BDD!P47,3)","v":""},{"$f":"LEFT(BDD!R47,3)","v":""},{"$f":"LEFT(BDD!S47,3)","v":""},{"$f":"LEFT(BDD!T47,3)","v":""},{"$f":"LEFT(BDD!U47,3)","v":""},{"$f":"LEFT(BDD!V47,3)","v":""},{"$f":"LEFT(BDD!W47,3)","v":""},{"$f":"LEFT(BDD!X47,3)","v":""},{"$f":"LEFT(BDD!Y47,3)","v":""},{"$f":"LEFT(BDD!Z47,3)","v":""},{"$f":"LEFT(BDD!AA47,3)","v":""},{"$f":"LEFT(BDD!AB47,3)","v":""},{"$f":"LEFT(BDD!AC47,3)","v":""},{"$f":"LEFT(BDD!AD48,3)","v":""},{"$f":"LEFT(BDD!AE47,3)","v":""},{"$f":"LEFT(BDD!AF47,3)","v":""},{"$f":"LEFT(BDD!AG47,3)","v":""},{"$f":"LEFT(BDD!AI47,3)","v":""},{"$f":"LEFT(BDD!AJ47,3)","v":""},{"$f":"LEFT(BDD!AK47,3)","v":""},{"$f":"LEFT(BDD!AL47,3)","v":""},{"$f":"LEFT(BDD!AM47,3)","v":""},{"$f":"LEFT(BDD!AN47,3)","v":""},{"$f":"LEFT(BDD!AP47,3)","v":""},{"$f":"LEFT(BDD!AQ47,3)","v":""},{"$f":"LEFT(BDD!AR47,3)","v":""},{"$f":"LEFT(BDD!AS47,3)","v":""},{"$f":"LEFT(BDD!AT47,3)","v":""},{"$f":"LEFT(BDD!AU47,3)","v":""},{"$f":"LEFT(BDD!AV47,3)","v":""},{"$f":"LEFT(BDD!AW47,3)","v":""},{"$f":"LEFT(BDD!AX48,3)","v":""},{"$f":"LEFT(BDD!AY47,3)","v":""},{"$f":"LEFT(BDD!AZ47,3)","v":""},{"$f":"LEFT(BDD!BA47,3)","v":""},{"$f":"LEFT(BDD!BB47,3)","v":""},{"$f":"LEFT(BDD!BC47,3)","v":""},{"$f":"LEFT(BDD!BD47,3)","v":""},{"$f":"LEFT(BDD!BE47,3)","v":""},{"$f":"LEFT(BDD!BF47,3)","v":""},{"$f":"LEFT(BDD!BG47,3)","v":""},{"$f":"LEFT(BDD!BH47,3)","v":""},{"$f":"LEFT(BDD!BI47,3)","v":""},{"$f":"LEFT(BDD!BJ47,3)","v":""},{"$f":"LEFT(BDD!BK47,3)","v":""},{"$f":"LEFT(BDD!#REF!,3)","v":{"$error":"#REF!"}},{"$f":"LEFT(BDD!BL47,3)","v":""},{"$f":"LEFT(BDD!BM47,3)","v":""},{"$f":"LEFT(BDD!BN47,3)","v":""},{"$f":"LEFT(BDD!BO47,3)","v":""},{"$f":"LEFT(BDD!BP47,3)","v":""},{"$f":"LEFT(BDD!BQ48,3)","v":""},{"$f":"LEFT(BDD!BR48,3)","v":""},{"$f":"LEFT(BDD!BS48,3)","v":""},{"$f":"LEFT(BDD!BT48,3)","v":""},{"$f":"LEFT(BDD!BU48,3)","v":""},{"$f":"LEFT(BDD!BV48,3)","v":""},{"$f":"LEFT(BDD!BW48,3)","v":""},{"$f":"LEFT(BDD!BX48,3)","v":""},{"$f":"LEFT(BDD!BY48,3)","v":""},{"$f":"LEFT(BDD!BZ48,3)","v":""},{"$f":"LEFT(BDD!CA48,3)","v":""},{"$f":"LEFT(BDD!CB48,3)","v":""},{"$f":"LEFT(BDD!CC48,3)","v":""},{"$f":"LEFT(BDD!CD48,3)","v":""},{"$f":"LEFT(BDD!CE48,3)","v":""}]
[{"$f":"LEFT(BDD!A48,3)","v":"796"},{"$f":"BDD!B48","v":20},{"$f":"LEFT(BDD!C48,3)","v":""},{"$f":"LEFT(BDD!D48,3)","v":""},{"$f":"LEFT(BDD!E48,3)","v":""},{"$f":"LEFT(BDD!F48,3)","v":""},{"$f":"LEFT(BDD!G48,3)","v":""},{"$f":"LEFT(BDD!H48,3)","v":""},{"$f":"LEFT(BDD!J48,3)","v":""},{"$f":"LEFT(BDD!K48,3)","v":""},{"$f":"LEFT(BDD!M48,3)","v":""},{"$f":"LEFT(BDD!O48,3)","v":""},{"$f":"LEFT(BDD!P48,3)","v":""},{"$f":"LEFT(BDD!R48,3)","v":""},{"$f":"LEFT(BDD!S48,3)","v":""},{"$f":"LEFT(BDD!T48,3)","v":""},{"$f":"LEFT(BDD!U48,3)","v":""},{"$f":"LEFT(BDD!V48,3)","v":""},{"$f":"LEFT(BDD!W48,3)","v":""},{"$f":"LEFT(BDD!X48,3)","v":""},{"$f":"LEFT(BDD!Y48,3)","v":""},{"$f":"LEFT(BDD!Z48,3)","v":""},{"$f":"LEFT(BDD!AA48,3)","v":""},{"$f":"LEFT(BDD!AB48,3)","v":""},{"$f":"LEFT(BDD!AC48,3)","v":""},{"$f":"LEFT(BDD!AD49,3)","v":""},{"$f":"LEFT(BDD!AE48,3)","v":""},{"$f":"LEFT(BDD!AF48,3)","v":""},{"$f":"LEFT(BDD!AG48,3)","v":""},{"$f":"LEFT(BDD!AI48,3)","v":""},{"$f":"LEFT(BDD!AJ48,3)","v":""},{"$f":"LEFT(BDD!AK48,3)","v":""},{"$f":"LEFT(BDD!AL48,3)","v":""},{"$f":"LEFT(BDD!AM48,3)","v":""},{"$f":"LEFT(BDD!AN48,3)","v":""},{"$f":"LEFT(BDD!AP48,3)","v":""},{"$f":"LEFT(BDD!AQ48,3)","v":""},{"$f":"LEFT(BDD!AR48,3)","v":""},{"$f":"LEFT(BDD!AS48,3)","v":""},{"$f":"LEFT(BDD!AT48,3)","v":""},{"$f":"LEFT(BDD!AU48,3)","v":""},{"$f":"LEFT(BDD!AV48,3)","v":""},{"$f":"LEFT(BDD!AW48,3)","v":""},{"$f":"LEFT(BDD!AX49,3)","v":""},{"$f":"LEFT(BDD!AY48,3)","v":""},{"$f":"LEFT(BDD!AZ48,3)","v":""},{"$f":"LEFT(BDD!BA48,3)","v":""},{"$f":"LEFT(BDD!BB48,3)","v":""},{"$f":"LEFT(BDD!BC48,3)","v":""},{"$f":"LEFT(BDD!BD48,3)","v":""},{"$f":"LEFT(BDD!BE48,3)","v":""},{"$f":"LEFT(BDD!BF48,3)","v":""},{"$f":"LEFT(BDD!BG48,3)","v":""},{"$f":"LEFT(BDD!BH48,3)","v":""},{"$f":"LEFT(BDD!BI48,3)","v":""},{"$f":"LEFT(BDD!BJ48,3)","v":""},{"$f":"LEFT(BDD!BK48,3)","v":""},{"$f":"LEFT(BDD!#REF!,3)","v":{"$error":"#REF!"}},{"$f":"LEFT(BDD!BL48,3)","v":""},{"$f":"LEFT(BDD!BM48,3)","v":""},{"$f":"LEFT(BDD!BN48,3)","v":""},{"$f":"LEFT(BDD!BO48,3)","v":""},{"$f":"LEFT(BDD!BP48,3)","v":""},{"$f":"LEFT(BDD!BQ49,3)","v":""},{"$f":"LEFT(BDD!BR49,3)","v":""},{"$f":"LEFT(BDD!BS49,3)","v":""},{"$f":"LEFT(BDD!BT49,3)","v":""},{"$f":"LEFT(BDD!BU49,3)","v":""},{"$f":"LEFT(BDD!BV49,3)","v":""},{"$f":"LEFT(BDD!BW49,3)","v":""},{"$f":"LEFT(BDD!BX49,3)","v":""},{"$f":"LEFT(BDD!BY49,3)","v":""},{"$f":"LEFT(BDD!BZ49,3)","v":""},{"$f":"LEFT(BDD!CA49,3)","v":""},{"$f":"LEFT(BDD!CB49,3)","v":""},{"$f":"LEFT(BDD!CC49,3)","v":""},{"$f":"LEFT(BDD!CD49,3)","v":""},{"$f":"LEFT(BDD!CE49,3)","v":""}]
[{"$f":"LEFT(BDD!A49,3)","v":"801"},{"$f":"BDD!B49","v":1},{"$f":"LEFT(BDD!C49,3)","v":""},{"$f":"LEFT(BDD!D49,3)","v":""},{"$f":"LEFT(BDD!E49,3)","v":""},{"$f":"LEFT(BDD!F49,3)","v":""},{"$f":"LEFT(BDD!G49,3)","v":""},{"$f":"LEFT(BDD!H49,3)","v":""},{"$f":"LEFT(BDD!J49,3)","v":""},{"$f":"LEFT(BDD!K49,3)","v":""},{"$f":"LEFT(BDD!M49,3)","v":""},{"$f":"LEFT(BDD!O49,3)","v":""},{"$f":"LEFT(BDD!P49,3)","v":""},{"$f":"LEFT(BDD!R49,3)","v":""},{"$f":"LEFT(BDD!S49,3)","v":""},{"$f":"LEFT(BDD!T49,3)","v":""},{"$f":"LEFT(BDD!U49,3)","v":""},{"$f":"LEFT(BDD!V49,3)","v":""},{"$f":"LEFT(BDD!W49,3)","v":""},{"$f":"LEFT(BDD!X49,3)","v":""},{"$f":"LEFT(BDD!Y49,3)","v":""},{"$f":"LEFT(BDD!Z49,3)","v":""},{"$f":"LEFT(BDD!AA49,3)","v":""},{"$f":"LEFT(BDD!AB49,3)","v":""},{"$f":"LEFT(BDD!AC49,3)","v":""},{"$f":"LEFT(BDD!AD50,3)","v":""},{"$f":"LEFT(BDD!AE49,3)","v":""},{"$f":"LEFT(BDD!AF49,3)","v":""},{"$f":"LEFT(BDD!AG49,3)","v":""},{"$f":"LEFT(BDD!AI49,3)","v":""},{"$f":"LEFT(BDD!AJ49,3)","v":""},{"$f":"LEFT(BDD!AK49,3)","v":""},{"$f":"LEFT(BDD!AL49,3)","v":""},{"$f":"LEFT(BDD!AM49,3)","v":""},{"$f":"LEFT(BDD!AN49,3)","v":""},{"$f":"LEFT(BDD!AP49,3)","v":""},{"$f":"LEFT(BDD!AQ49,3)","v":""},{"$f":"LEFT(BDD!AR49,3)","v":""},{"$f":"LEFT(BDD!AS49,3)","v":""},{"$f":"LEFT(BDD!AT49,3)","v":""},{"$f":"LEFT(BDD!AU49,3)","v":""},{"$f":"LEFT(BDD!AV49,3)","v":""},{"$f":"LEFT(BDD!AW49,3)","v":""},{"$f":"LEFT(BDD!AX50,3)","v":""},{"$f":"LEFT(BDD!AY49,3)","v":""},{"$f":"LEFT(BDD!AZ49,3)","v":""},{"$f":"LEFT(BDD!BA49,3)","v":""},{"$f":"LEFT(BDD!BB49,3)","v":""},{"$f":"LEFT(BDD!BC49,3)","v":""},{"$f":"LEFT(BDD!BD49,3)","v":""},{"$f":"LEFT(BDD!BE49,3)","v":""},{"$f":"LEFT(BDD!BF49,3)","v":""},{"$f":"LEFT(BDD!BG49,3)","v":""},{"$f":"LEFT(BDD!BH49,3)","v":""},{"$f":"LEFT(BDD!BI49,3)","v":""},{"$f":"LEFT(BDD!BJ49,3)","v":""},{"$f":"LEFT(BDD!BK49,3)","v":""},{"$f":"LEFT(BDD!#REF!,3)","v":{"$error":"#REF!"}},{"$f":"LEFT(BDD!BL49,3)","v":""},{"$f":"LEFT(BDD!BM49,3)","v":""},{"$f":"LEFT(BDD!BN49,3)","v":""},{"$f":"LEFT(BDD!BO49,3)","v":""},{"$f":"LEFT(BDD!BP49,3)","v":""},{"$f":"LEFT(BDD!BQ50,3)","v":""},{"$f":"LEFT(BDD!BR50,3)","v":""},{"$f":"LEFT(BDD!BS50,3)","v":""},{"$f":"LEFT(BDD!BT50,3)","v":""},{"$f":"LEFT(BDD!BU50,3)","v":""},{"$f":"LEFT(BDD!BV50,3)","v":""},{"$f":"LEFT(BDD!BW50,3)","v":""},{"$f":"LEFT(BDD!BX50,3)","v":""},{"$f":"LEFT(BDD!BY50,3)","v":""},{"$f":"LEFT(BDD!BZ50,3)","v":""},{"$f":"LEFT(BDD!CA50,3)","v":""},{"$f":"LEFT(BDD!CB50,3)","v":""},{"$f":"LEFT(BDD!CC50,3)","v":""},{"$f":"LEFT(BDD!CD50,3)","v":""},{"$f":"LEFT(BDD!CE50,3)","v":""}]
[{"$f":"LEFT(BDD!A50,3)","v":"813"},{"$f":"BDD!B50","v":1},{"$f":"LEFT(BDD!C50,3)","v":""},{"$f":"LEFT(BDD!D50,3)","v":""},{"$f":"LEFT(BDD!E50,3)","v":""},{"$f":"LEFT(BDD!F50,3)","v":""},{"$f":"LEFT(BDD!G50,3)","v":""},{"$f":"LEFT(BDD!H50,3)","v":""},{"$f":"LEFT(BDD!J50,3)","v":""},{"$f":"LEFT(BDD!K50,3)","v":""},{"$f":"LEFT(BDD!M50,3)","v":""},{"$f":"LEFT(BDD!O50,3)","v":""},{"$f":"LEFT(BDD!P50,3)","v":""},{"$f":"LEFT(BDD!R50,3)","v":""},{"$f":"LEFT(BDD!S50,3)","v":""},{"$f":"LEFT(BDD!T50,3)","v":""},{"$f":"LEFT(BDD!U50,3)","v":""},{"$f":"LEFT(BDD!V50,3)","v":""},{"$f":"LEFT(BDD!W50,3)","v":""},{"$f":"LEFT(BDD!X50,3)","v":""},{"$f":"LEFT(BDD!Y50,3)","v":""},{"$f":"LEFT(BDD!Z50,3)","v":""},{"$f":"LEFT(BDD!AA50,3)","v":""},{"$f":"LEFT(BDD!AB50,3)","v":""},{"$f":"LEFT(BDD!AC50,3)","v":""},{"$f":"LEFT(BDD!AD51,3)","v":""},{"$f":"LEFT(BDD!AE50,3)","v":""},{"$f":"LEFT(BDD!AF50,3)","v":""},{"$f":"LEFT(BDD!AG50,3)","v":""},{"$f":"LEFT(BDD!AI50,3)","v":""},{"$f":"LEFT(BDD!AJ50,3)","v":""},{"$f":"LEFT(BDD!AK50,3)","v":""},{"$f":"LEFT(BDD!AL50,3)","v":""},{"$f":"LEFT(BDD!AM50,3)","v":""},{"$f":"LEFT(BDD!AN50,3)","v":""},{"$f":"LEFT(BDD!AP50,3)","v":""},{"$f":"LEFT(BDD!AQ50,3)","v":""},{"$f":"LEFT(BDD!AR50,3)","v":""},{"$f":"LEFT(BDD!AS50,3)","v":""},{"$f":"LEFT(BDD!AT50,3)","v":""},{"$f":"LEFT(BDD!AU50,3)","v":""},{"$f":"LEFT(BDD!AV50,3)","v":""},{"$f":"LEFT(BDD!AW50,3)","v":""},{"$f":"LEFT(BDD!AX51,3)","v":""},{"$f":"LEFT(BDD!AY50,3)","v":""},{"$f":"LEFT(BDD!AZ50,3)","v":""},{"$f":"LEFT(BDD!BA50,3)","v":""},{"$f":"LEFT(BDD!BB50,3)","v":""},{"$f":"LEFT(BDD!BC50,3)","v":""},{"$f":"LEFT(BDD!BD50,3)","v":""},{"$f":"LEFT(BDD!BE50,3)","v":""},{"$f":"LEFT(BDD!BF50,3)","v":""},{"$f":"LEFT(BDD!BG50,3)","v":""},{"$f":"LEFT(BDD!BH50,3)","v":""},{"$f":"LEFT(BDD!BI50,3)","v":""},{"$f":"LEFT(BDD!BJ50,3)","v":""},{"$f":"LEFT(BDD!BK50,3)","v":""},{"$f":"LEFT(BDD!#REF!,3)","v":{"$error":"#REF!"}},{"$f":"LEFT(BDD!BL50,3)","v":""},{"$f":"LEFT(BDD!BM50,3)","v":""},{"$f":"LEFT(BDD!BN50,3)","v":""},{"$f":"LEFT(BDD!BO50,3)","v":""},{"$f":"LEFT(BDD!BP50,3)","v":""},{"$f":"LEFT(BDD!BQ51,3)","v":""},{"$f":"LEFT(BDD!BR51,3)","v":""},{"$f":"LEFT(BDD!BS51,3)","v":""},{"$f":"LEFT(BDD!BT51,3)","v":""},{"$f":"LEFT(BDD!BU51,3)","v":""},{"$f":"LEFT(BDD!BV51,3)","v":""},{"$f":"LEFT(BDD!BW51,3)","v":""},{"$f":"LEFT(BDD!BX51,3)","v":""},{"$f":"LEFT(BDD!BY51,3)","v":""},{"$f":"LEFT(BDD!BZ51,3)","v":""},{"$f":"LEFT(BDD!CA51,3)","v":""},{"$f":"LEFT(BDD!CB51,3)","v":""},{"$f":"LEFT(BDD!CC51,3)","v":""},{"$f":"LEFT(BDD!CD51,3)","v":""},{"$f":"LEFT(BDD!CE51,3)","v":""}]
[{"$f":"LEFT(BDD!A51,3)","v":"815"},{"$f":"BDD!B51","v":1},{"$f":"LEFT(BDD!C51,3)","v":""},{"$f":"LEFT(BDD!D51,3)","v":""},{"$f":"LEFT(BDD!E51,3)","v":""},{"$f":"LEFT(BDD!F51,3)","v":""},{"$f":"LEFT(BDD!G51,3)","v":""},{"$f":"LEFT(BDD!H51,3)","v":""},{"$f":"LEFT(BDD!J51,3)","v":""},{"$f":"LEFT(BDD!K51,3)","v":""},{"$f":"LEFT(BDD!M51,3)","v":""},{"$f":"LEFT(BDD!O51,3)","v":""},{"$f":"LEFT(BDD!P51,3)","v":""},{"$f":"LEFT(BDD!R51,3)","v":""},{"$f":"LEFT(BDD!S51,3)","v":""},{"$f":"LEFT(BDD!T51,3)","v":""},{"$f":"LEFT(BDD!U51,3)","v":""},{"$f":"LEFT(BDD!V51,3)","v":""},{"$f":"LEFT(BDD!W51,3)","v":""},{"$f":"LEFT(BDD!X51,3)","v":""},{"$f":"LEFT(BDD!Y51,3)","v":""},{"$f":"LEFT(BDD!Z51,3)","v":""},{"$f":"LEFT(BDD!AA51,3)","v":""},{"$f":"LEFT(BDD!AB51,3)","v":""},{"$f":"LEFT(BDD!AC51,3)","v":""},{"$f":"LEFT(BDD!AD52,3)","v":""},{"$f":"LEFT(BDD!AE51,3)","v":""},{"$f":"LEFT(BDD!AF51,3)","v":""},{"$f":"LEFT(BDD!AG51,3)","v":""},{"$f":"LEFT(BDD!AI51,3)","v":""},{"$f":"LEFT(BDD!AJ51,3)","v":""},{"$f":"LEFT(BDD!AK51,3)","v":""},{"$f":"LEFT(BDD!AL51,3)","v":""},{"$f":"LEFT(BDD!AM51,3)","v":""},{"$f":"LEFT(BDD!AN51,3)","v":""},{"$f":"LEFT(BDD!AP51,3)","v":""},{"$f":"LEFT(BDD!AQ51,3)","v":""},{"$f":"LEFT(BDD!AR51,3)","v":""},{"$f":"LEFT(BDD!AS51,3)","v":""},{"$f":"LEFT(BDD!AT51,3)","v":""},{"$f":"LEFT(BDD!AU51,3)","v":""},{"$f":"LEFT(BDD!AV51,3)","v":""},{"$f":"LEFT(BDD!AW51,3)","v":""},{"$f":"LEFT(BDD!AX52,3)","v":""},{"$f":"LEFT(BDD!AY51,3)","v":""},{"$f":"LEFT(BDD!AZ51,3)","v":""},{"$f":"LEFT(BDD!BA51,3)","v":""},{"$f":"LEFT(BDD!BB51,3)","v":""},{"$f":"LEFT(BDD!BC51,3)","v":""},{"$f":"LEFT(BDD!BD51,3)","v":""},{"$f":"LEFT(BDD!BE51,3)","v":""},{"$f":"LEFT(BDD!BF51,3)","v":""},{"$f":"LEFT(BDD!BG51,3)","v":""},{"$f":"LEFT(BDD!BH51,3)","v":""},{"$f":"LEFT(BDD!BI51,3)","v":""},{"$f":"LEFT(BDD!BJ51,3)","v":""},{"$f":"LEFT(BDD!BK51,3)","v":""},{"$f":"LEFT(BDD!#REF!,3)","v":{"$error":"#REF!"}},{"$f":"LEFT(BDD!BL51,3)","v":""},{"$f":"LEFT(BDD!BM51,3)","v":""},{"$f":"LEFT(BDD!BN51,3)","v":""},{"$f":"LEFT(BDD!BO51,3)","v":""},{"$f":"LEFT(BDD!BP51,3)","v":""},{"$f":"LEFT(BDD!BQ52,3)","v":""},{"$f":"LEFT(BDD!BR52,3)","v":""},{"$f":"LEFT(BDD!BS52,3)","v":""},{"$f":"LEFT(BDD!BT52,3)","v":""},{"$f":"LEFT(BDD!BU52,3)","v":""},{"$f":"LEFT(BDD!BV52,3)","v":""},{"$f":"LEFT(BDD!BW52,3)","v":""},{"$f":"LEFT(BDD!BX52,3)","v":""},{"$f":"LEFT(BDD!BY52,3)","v":""},{"$f":"LEFT(BDD!BZ52,3)","v":""},{"$f":"LEFT(BDD!CA52,3)","v":""},{"$f":"LEFT(BDD!CB52,3)","v":""},{"$f":"LEFT(BDD!CC52,3)","v":""},{"$f":"LEFT(BDD!CD52,3)","v":""},{"$f":"LEFT(BDD!CE52,3)","v":""}]
[{"$f":"LEFT(BDD!A52,3)","v":"816"},{"$f":"BDD!B52","v":1},{"$f":"LEFT(BDD!C52,3)","v":""},{"$f":"LEFT(BDD!D52,3)","v":""},{"$f":"LEFT(BDD!E52,3)","v":""},{"$f":"LEFT(BDD!F52,3)","v":""},{"$f":"LEFT(BDD!G52,3)","v":""},{"$f":"LEFT(BDD!H52,3)","v":""},{"$f":"LEFT(BDD!J52,3)","v":""},{"$f":"LEFT(BDD!K52,3)","v":""},{"$f":"LEFT(BDD!M52,3)","v":""},{"$f":"LEFT(BDD!O52,3)","v":""},{"$f":"LEFT(BDD!P52,3)","v":""},{"$f":"LEFT(BDD!R52,3)","v":""},{"$f":"LEFT(BDD!S52,3)","v":""},{"$f":"LEFT(BDD!T52,3)","v":""},{"$f":"LEFT(BDD!U52,3)","v":""},{"$f":"LEFT(BDD!V52,3)","v":""},{"$f":"LEFT(BDD!W52,3)","v":""},{"$f":"LEFT(BDD!X52,3)","v":""},{"$f":"LEFT(BDD!Y52,3)","v":""},{"$f":"LEFT(BDD!Z52,3)","v":""},{"$f":"LEFT(BDD!AA52,3)","v":""},{"$f":"LEFT(BDD!AB52,3)","v":""},{"$f":"LEFT(BDD!AC52,3)","v":""},{"$f":"LEFT(BDD!AD53,3)","v":""},{"$f":"LEFT(BDD!AE52,3)","v":""},{"$f":"LEFT(BDD!AF52,3)","v":""},{"$f":"LEFT(BDD!AG52,3)","v":""},{"$f":"LEFT(BDD!AI52,3)","v":""},{"$f":"LEFT(BDD!AJ52,3)","v":""},{"$f":"LEFT(BDD!AK52,3)","v":""},{"$f":"LEFT(BDD!AL52,3)","v":""},{"$f":"LEFT(BDD!AM52,3)","v":""},{"$f":"LEFT(BDD!AN52,3)","v":""},{"$f":"LEFT(BDD!AP52,3)","v":""},{"$f":"LEFT(BDD!AQ52,3)","v":""},{"$f":"LEFT(BDD!AR52,3)","v":""},{"$f":"LEFT(BDD!AS52,3)","v":""},{"$f":"LEFT(BDD!AT52,3)","v":""},{"$f":"LEFT(BDD!AU52,3)","v":""},{"$f":"LEFT(BDD!AV52,3)","v":""},{"$f":"LEFT(BDD!AW52,3)","v":""},{"$f":"LEFT(BDD!AX53,3)","v":""},{"$f":"LEFT(BDD!AY52,3)","v":""},{"$f":"LEFT(BDD!AZ52,3)","v":""},{"$f":"LEFT(BDD!BA52,3)","v":""},{"$f":"LEFT(BDD!BB52,3)","v":""},{"$f":"LEFT(BDD!BC52,3)","v":""},{"$f":"LEFT(BDD!BD52,3)","v":""},{"$f":"LEFT(BDD!BE52,3)","v":""},{"$f":"LEFT(BDD!BF52,3)","v":""},{"$f":"LEFT(BDD!BG52,3)","v":""},{"$f":"LEFT(BDD!BH52,3)","v":""},{"$f":"LEFT(BDD!BI52,3)","v":""},{"$f":"LEFT(BDD!BJ52,3)","v":""},{"$f":"LEFT(BDD!BK52,3)","v":""},{"$f":"LEFT(BDD!#REF!,3)","v":{"$error":"#REF!"}},{"$f":"LEFT(BDD!BL52,3)","v":""},{"$f":"LEFT(BDD!BM52,3)","v":""},{"$f":"LEFT(BDD!BN52,3)","v":""},{"$f":"LEFT(BDD!BO52,3)","v":""},{"$f":"LEFT(BDD!BP52,3)","v":""},{"$f":"LEFT(BDD!BQ53,3)","v":""},{"$f":"LEFT(BDD!BR53,3)","v":""},{"$f":"LEFT(BDD!BS53,3)","v":""},{"$f":"LEFT(BDD!BT53,3)","v":""},{"$f":"LEFT(BDD!BU53,3)","v":""},{"$f":"LEFT(BDD!BV53,3)","v":""},{"$f":"LEFT(BDD!BW53,3)","v":""},{"$f":"LEFT(BDD!BX53,3)","v":""},{"$f":"LEFT(BDD!BY53,3)","v":""},{"$f":"LEFT(BDD!BZ53,3)","v":""},{"$f":"LEFT(BDD!CA53,3)","v":""},{"$f":"LEFT(BDD!CB53,3)","v":""},{"$f":"LEFT(BDD!CC53,3)","v":""},{"$f":"LEFT(BDD!CD53,3)","v":""},{"$f":"LEFT(BDD!CE53,3)","v":""}]
[{"$f":"LEFT(BDD!A53,3)","v":"817"},{"$f":"BDD!B53","v":1},{"$f":"LEFT(BDD!C53,3)","v":""},{"$f":"LEFT(BDD!D53,3)","v":""},{"$f":"LEFT(BDD!E53,3)","v":""},{"$f":"LEFT(BDD!F53,3)","v":""},{"$f":"LEFT(BDD!G53,3)","v":""},{"$f":"LEFT(BDD!H53,3)","v":""},{"$f":"LEFT(BDD!J53,3)","v":""},{"$f":"LEFT(BDD!K53,3)","v":""},{"$f":"LEFT(BDD!M53,3)","v":""},{"$f":"LEFT(BDD!O53,3)","v":""},{"$f":"LEFT(BDD!P53,3)","v":""},{"$f":"LEFT(BDD!R53,3)","v":""},{"$f":"LEFT(BDD!S53,3)","v":""},{"$f":"LEFT(BDD!T53,3)","v":""},{"$f":"LEFT(BDD!U53,3)","v":""},{"$f":"LEFT(BDD!V53,3)","v":""},{"$f":"LEFT(BDD!W53,3)","v":""},{"$f":"LEFT(BDD!X53,3)","v":""},{"$f":"LEFT(BDD!Y53,3)","v":""},{"$f":"LEFT(BDD!Z53,3)","v":""},{"$f":"LEFT(BDD!AA53,3)","v":""},{"$f":"LEFT(BDD!AB53,3)","v":""},{"$f":"LEFT(BDD!AC53,3)","v":""},{"$f":"LEFT(BDD!AD55,3)","v":""},{"$f":"LEFT(BDD!AE53,3)","v":""},{"$f":"LEFT(BDD!AF53,3)","v":""},{"$f":"LEFT(BDD!AG53,3)","v":""},{"$f":"LEFT(BDD!AI53,3)","v":""},{"$f":"LEFT(BDD!AJ53,3)","v":""},{"$f":"LEFT(BDD!AK53,3)","v":""},{"$f":"LEFT(BDD!AL53,3)","v":""},{"$f":"LEFT(BDD!AM53,3)","v":""},{"$f":"LEFT(BDD!AN53,3)","v":""},{"$f":"LEFT(BDD!AP53,3)","v":""},{"$f":"LEFT(BDD!AQ53,3)","v":""},{"$f":"LEFT(BDD!AR53,3)","v":""},{"$f":"LEFT(BDD!AS53,3)","v":""},{"$f":"LEFT(BDD!AT53,3)","v":""},{"$f":"LEFT(BDD!AU53,3)","v":""},{"$f":"LEFT(BDD!AV53,3)","v":""},{"$f":"LEFT(BDD!AW53,3)","v":""},{"$f":"LEFT(BDD!AX55,3)","v":""},{"$f":"LEFT(BDD!AY53,3)","v":""},{"$f":"LEFT(BDD!AZ53,3)","v":""},{"$f":"LEFT(BDD!BA53,3)","v":""},{"$f":"LEFT(BDD!BB53,3)","v":""},{"$f":"LEFT(BDD!BC53,3)","v":""},{"$f":"LEFT(BDD!BD53,3)","v":""},{"$f":"LEFT(BDD!BE53,3)","v":""},{"$f":"LEFT(BDD!BF53,3)","v":""},{"$f":"LEFT(BDD!BG53,3)","v":""},{"$f":"LEFT(BDD!BH53,3)","v":""},{"$f":"LEFT(BDD!BI53,3)","v":""},{"$f":"LEFT(BDD!BJ53,3)","v":""},{"$f":"LEFT(BDD!BK53,3)","v":""},{"$f":"LEFT(BDD!#REF!,3)","v":{"$error":"#REF!"}},{"$f":"LEFT(BDD!BL53,3)","v":""},{"$f":"LEFT(BDD!BM53,3)","v":""},{"$f":"LEFT(BDD!BN53,3)","v":""},{"$f":"LEFT(BDD!BO53,3)","v":""},{"$f":"LEFT(BDD!BP53,3)","v":""},{"$f":"LEFT(BDD!BQ55,3)","v":""},{"$f":"LEFT(BDD!BR55,3)","v":""},{"$f":"LEFT(BDD!BS55,3)","v":""},{"$f":"LEFT(BDD!BT55,3)","v":""},{"$f":"LEFT(BDD!BU55,3)","v":""},{"$f":"LEFT(BDD!BV55,3)","v":""},{"$f":"LEFT(BDD!BW55,3)","v":""},{"$f":"LEFT(BDD!BX55,3)","v":""},{"$f":"LEFT(BDD!BY55,3)","v":""},{"$f":"LEFT(BDD!BZ55,3)","v":""},{"$f":"LEFT(BDD!CA55,3)","v":""},{"$f":"LEFT(BDD!CB55,3)","v":""},{"$f":"LEFT(BDD!CC55,3)","v":""},{"$f":"LEFT(BDD!CD55,3)","v":""},{"$f":"LEFT(BDD!CE55,3)","v":""}]
[{"$f":"LEFT(BDD!A54,3)","v":"826"},{"$f":"BDD!B54","v":1},{"$f":"LEFT(BDD!C55,3)","v":""},{"$f":"LEFT(BDD!D55,3)","v":""},{"$f":"LEFT(BDD!E55,3)","v":""},{"$f":"LEFT(BDD!F55,3)","v":""},{"$f":"LEFT(BDD!G55,3)","v":""},{"$f":"LEFT(BDD!H55,3)","v":""},{"$f":"LEFT(BDD!J55,3)","v":""},{"$f":"LEFT(BDD!K55,3)","v":""},{"$f":"LEFT(BDD!M55,3)","v":""},{"$f":"LEFT(BDD!O55,3)","v":""},{"$f":"LEFT(BDD!P55,3)","v":""},{"$f":"LEFT(BDD!R55,3)","v":""},{"$f":"LEFT(BDD!S55,3)","v":""},{"$f":"LEFT(BDD!T55,3)","v":""},{"$f":"LEFT(BDD!U55,3)","v":""},{"$f":"LEFT(BDD!V55,3)","v":""},{"$f":"LEFT(BDD!W55,3)","v":""},{"$f":"LEFT(BDD!X55,3)","v":""},{"$f":"LEFT(BDD!Y55,3)","v":""},{"$f":"LEFT(BDD!Z55,3)","v":""},{"$f":"LEFT(BDD!AA55,3)","v":""},{"$f":"LEFT(BDD!AB55,3)","v":""},{"$f":"LEFT(BDD!AC55,3)","v":""},{"$f":"LEFT(BDD!AD57,3)","v":""},{"$f":"LEFT(BDD!AE55,3)","v":""},{"$f":"LEFT(BDD!AF55,3)","v":""},{"$f":"LEFT(BDD!AG55,3)","v":""},{"$f":"LEFT(BDD!AI55,3)","v":""},{"$f":"LEFT(BDD!AJ55,3)","v":""},{"$f":"LEFT(BDD!AK55,3)","v":""},{"$f":"LEFT(BDD!AL55,3)","v":""},{"$f":"LEFT(BDD!AM55,3)","v":""},{"$f":"LEFT(BDD!AN55,3)","v":""},{"$f":"LEFT(BDD!AP55,3)","v":""},{"$f":"LEFT(BDD!AQ55,3)","v":""},{"$f":"LEFT(BDD!AR55,3)","v":""},{"$f":"LEFT(BDD!AS55,3)","v":""},{"$f":"LEFT(BDD!AT55,3)","v":""},{"$f":"LEFT(BDD!AU55,3)","v":""},{"$f":"LEFT(BDD!AV55,3)","v":""},{"$f":"LEFT(BDD!AW55,3)","v":""},{"$f":"LEFT(BDD!AX57,3)","v":""},{"$f":"LEFT(BDD!AY55,3)","v":""},{"$f":"LEFT(BDD!AZ55,3)","v":""},{"$f":"LEFT(BDD!BA55,3)","v":""},{"$f":"LEFT(BDD!BB55,3)","v":""},{"$f":"LEFT(BDD!BC55,3)","v":""},{"$f":"LEFT(BDD!BD55,3)","v":""},{"$f":"LEFT(BDD!BE55,3)","v":""},{"$f":"LEFT(BDD!BF55,3)","v":""},{"$f":"LEFT(BDD!BG55,3)","v":""},{"$f":"LEFT(BDD!BH55,3)","v":""},{"$f":"LEFT(BDD!BI55,3)","v":""},{"$f":"LEFT(BDD!BJ55,3)","v":""},{"$f":"LEFT(BDD!BK55,3)","v":""},{"$f":"LEFT(BDD!#REF!,3)","v":{"$error":"#REF!"}},{"$f":"LEFT(BDD!BL55,3)","v":""},{"$f":"LEFT(BDD!BM55,3)","v":""},{"$f":"LEFT(BDD!BN55,3)","v":""},{"$f":"LEFT(BDD!BO55,3)","v":""},{"$f":"LEFT(BDD!BP55,3)","v":""},{"$f":"LEFT(BDD!BQ57,3)","v":""},{"$f":"LEFT(BDD!BR57,3)","v":""},{"$f":"LEFT(BDD!BS57,3)","v":""},{"$f":"LEFT(BDD!BT57,3)","v":""},{"$f":"LEFT(BDD!BU57,3)","v":""},{"$f":"LEFT(BDD!BV57,3)","v":""},{"$f":"LEFT(BDD!BW57,3)","v":""},{"$f":"LEFT(BDD!BX57,3)","v":""},{"$f":"LEFT(BDD!BY57,3)","v":""},{"$f":"LEFT(BDD!BZ57,3)","v":""},{"$f":"LEFT(BDD!CA57,3)","v":""},{"$f":"LEFT(BDD!CB57,3)","v":""},{"$f":"LEFT(BDD!CC57,3)","v":""},{"$f":"LEFT(BDD!CD57,3)","v":""},{"$f":"LEFT(BDD!CE57,3)","v":""}]
[{"$f":"LEFT(BDD!A55,3)","v":"827"},{"$f":"BDD!B55","v":1},{"$f":"LEFT(BDD!C57,3)","v":""},{"$f":"LEFT(BDD!D57,3)","v":""},{"$f":"LEFT(BDD!E57,3)","v":""},{"$f":"LEFT(BDD!F57,3)","v":""},{"$f":"LEFT(BDD!G57,3)","v":""},{"$f":"LEFT(BDD!H57,3)","v":""},{"$f":"LEFT(BDD!J57,3)","v":""},{"$f":"LEFT(BDD!K57,3)","v":""},{"$f":"LEFT(BDD!M57,3)","v":""},{"$f":"LEFT(BDD!O57,3)","v":""},{"$f":"LEFT(BDD!P57,3)","v":""},{"$f":"LEFT(BDD!R57,3)","v":""},{"$f":"LEFT(BDD!S57,3)","v":""},{"$f":"LEFT(BDD!T57,3)","v":""},{"$f":"LEFT(BDD!U57,3)","v":""},{"$f":"LEFT(BDD!V57,3)","v":""},{"$f":"LEFT(BDD!W57,3)","v":""},{"$f":"LEFT(BDD!X57,3)","v":""},{"$f":"LEFT(BDD!Y57,3)","v":""},{"$f":"LEFT(BDD!Z57,3)","v":""},{"$f":"LEFT(BDD!AA57,3)","v":""},{"$f":"LEFT(BDD!AB58,3)","v":""},{"$f":"LEFT(BDD!AC57,3)","v":""},{"$f":"LEFT(BDD!AD58,3)","v":""},{"$f":"LEFT(BDD!AE57,3)","v":""},{"$f":"LEFT(BDD!AF57,3)","v":""},{"$f":"LEFT(BDD!AG57,3)","v":""},{"$f":"LEFT(BDD!AI57,3)","v":""},{"$f":"LEFT(BDD!AJ57,3)","v":""},{"$f":"LEFT(BDD!AK57,3)","v":""},{"$f":"LEFT(BDD!AL57,3)","v":""},{"$f":"LEFT(BDD!AM57,3)","v":""},{"$f":"LEFT(BDD!AN57,3)","v":""},{"$f":"LEFT(BDD!AP57,3)","v":""},{"$f":"LEFT(BDD!AQ57,3)","v":""},{"$f":"LEFT(BDD!AR57,3)","v":""},{"$f":"LEFT(BDD!AS57,3)","v":""},{"$f":"LEFT(BDD!AT57,3)","v":""},{"$f":"LEFT(BDD!AU57,3)","v":""},{"$f":"LEFT(BDD!AV57,3)","v":""},{"$f":"LEFT(BDD!AW57,3)","v":""},{"$f":"LEFT(BDD!AX58,3)","v":""},{"$f":"LEFT(BDD!AY57,3)","v":""},{"$f":"LEFT(BDD!AZ57,3)","v":""},{"$f":"LEFT(BDD!BA57,3)","v":""},{"$f":"LEFT(BDD!BB57,3)","v":""},{"$f":"LEFT(BDD!BC57,3)","v":""},{"$f":"LEFT(BDD!BD57,3)","v":""},{"$f":"LEFT(BDD!BE57,3)","v":""},{"$f":"LEFT(BDD!BF57,3)","v":""},{"$f":"LEFT(BDD!BG57,3)","v":""},{"$f":"LEFT(BDD!BH57,3)","v":""},{"$f":"LEFT(BDD!BI57,3)","v":""},{"$f":"LEFT(BDD!BJ57,3)","v":""},{"$f":"LEFT(BDD!BK57,3)","v":""},{"$f":"LEFT(BDD!#REF!,3)","v":{"$error":"#REF!"}},{"$f":"LEFT(BDD!BL57,3)","v":""},{"$f":"LEFT(BDD!BM57,3)","v":""},{"$f":"LEFT(BDD!BN57,3)","v":""},{"$f":"LEFT(BDD!BO57,3)","v":""},{"$f":"LEFT(BDD!BP57,3)","v":""},{"$f":"LEFT(BDD!BQ58,3)","v":""},{"$f":"LEFT(BDD!BR58,3)","v":""},{"$f":"LEFT(BDD!BS58,3)","v":""},{"$f":"LEFT(BDD!BT58,3)","v":""},{"$f":"LEFT(BDD!BU58,3)","v":""},{"$f":"LEFT(BDD!BV58,3)","v":""},{"$f":"LEFT(BDD!BW58,3)","v":""},{"$f":"LEFT(BDD!BX58,3)","v":""},{"$f":"LEFT(BDD!BY58,3)","v":""},{"$f":"LEFT(BDD!BZ58,3)","v":""},{"$f":"LEFT(BDD!CA58,3)","v":""},{"$f":"LEFT(BDD!CB58,3)","v":""},{"$f":"LEFT(BDD!CC58,3)","v":""},{"$f":"LEFT(BDD!CD58,3)","v":""},{"$f":"LEFT(BDD!CE58,3)","v":""}]
[{"$f":"LEFT(BDD!A57,3)","v":"872"},{"$f":"BDD!B57","v":1},{"$f":"LEFT(BDD!C58,3)","v":""},{"$f":"LEFT(BDD!D58,3)","v":""},{"$f":"LEFT(BDD!E58,3)","v":""},{"$f":"LEFT(BDD!F58,3)","v":""},{"$f":"LEFT(BDD!G58,3)","v":""},{"$f":"LEFT(BDD!H58,3)","v":""},{"$f":"LEFT(BDD!J58,3)","v":""},{"$f":"LEFT(BDD!K58,3)","v":""},{"$f":"LEFT(BDD!M58,3)","v":""},{"$f":"LEFT(BDD!O58,3)","v":""},{"$f":"LEFT(BDD!P58,3)","v":""},{"$f":"LEFT(BDD!R58,3)","v":""},{"$f":"LEFT(BDD!S58,3)","v":""},{"$f":"LEFT(BDD!T58,3)","v":""},{"$f":"LEFT(BDD!U58,3)","v":""},{"$f":"LEFT(BDD!V58,3)","v":""},{"$f":"LEFT(BDD!W58,3)","v":""},{"$f":"LEFT(BDD!X58,3)","v":""},{"$f":"LEFT(BDD!Y58,3)","v":""},{"$f":"LEFT(BDD!Z58,3)","v":""},{"$f":"LEFT(BDD!AA58,3)","v":""},{"$f":"LEFT(BDD!AB59,3)","v":""},{"$f":"LEFT(BDD!AC58,3)","v":""},{"$f":"LEFT(BDD!AD59,3)","v":""},{"$f":"LEFT(BDD!AE58,3)","v":""},{"$f":"LEFT(BDD!AF58,3)","v":""},{"$f":"LEFT(BDD!AG58,3)","v":""},{"$f":"LEFT(BDD!AI58,3)","v":""},{"$f":"LEFT(BDD!AJ58,3)","v":""},{"$f":"LEFT(BDD!AK58,3)","v":""},{"$f":"LEFT(BDD!AL58,3)","v":""},{"$f":"LEFT(BDD!AM58,3)","v":""},{"$f":"LEFT(BDD!AN58,3)","v":""},{"$f":"LEFT(BDD!AP58,3)","v":""},{"$f":"LEFT(BDD!AQ58,3)","v":""},{"$f":"LEFT(BDD!AR58,3)","v":""},{"$f":"LEFT(BDD!AS58,3)","v":""},{"$f":"LEFT(BDD!AT58,3)","v":""},{"$f":"LEFT(BDD!AU58,3)","v":""},{"$f":"LEFT(BDD!AV58,3)","v":""},{"$f":"LEFT(BDD!AW58,3)","v":""},{"$f":"LEFT(BDD!AX59,3)","v":""},{"$f":"LEFT(BDD!AY58,3)","v":""},{"$f":"LEFT(BDD!AZ58,3)","v":""},{"$f":"LEFT(BDD!BA58,3)","v":""},{"$f":"LEFT(BDD!BB58,3)","v":""},{"$f":"LEFT(BDD!BC58,3)","v":""},{"$f":"LEFT(BDD!BD58,3)","v":""},{"$f":"LEFT(BDD!BE58,3)","v":""},{"$f":"LEFT(BDD!BF58,3)","v":""},{"$f":"LEFT(BDD!BG58,3)","v":""},{"$f":"LEFT(BDD!BH58,3)","v":""},{"$f":"LEFT(BDD!BI58,3)","v":""},{"$f":"LEFT(BDD!BJ58,3)","v":""},{"$f":"LEFT(BDD!BK58,3)","v":""},{"$f":"LEFT(BDD!#REF!,3)","v":{"$error":"#REF!"}},{"$f":"LEFT(BDD!BL58,3)","v":""},{"$f":"LEFT(BDD!BM58,3)","v":""},{"$f":"LEFT(BDD!BN58,3)","v":""},{"$f":"LEFT(BDD!BO58,3)","v":""},{"$f":"LEFT(BDD!BP58,3)","v":""},{"$f":"LEFT(BDD!BQ59,3)","v":""},{"$f":"LEFT(BDD!BR59,3)","v":""},{"$f":"LEFT(BDD!BS59,3)","v":""},{"$f":"LEFT(BDD!BT59,3)","v":""},{"$f":"LEFT(BDD!BU59,3)","v":""},{"$f":"LEFT(BDD!BV59,3)","v":""},{"$f":"LEFT(BDD!BW59,3)","v":""},{"$f":"LEFT(BDD!BX59,3)","v":""},{"$f":"LEFT(BDD!BY59,3)","v":""},{"$f":"LEFT(BDD!BZ59,3)","v":""},{"$f":"LEFT(BDD!CA59,3)","v":""},{"$f":"LEFT(BDD!CB59,3)","v":""},{"$f":"LEFT(BDD!CC59,3)","v":""},{"$f":"LEFT(BDD!CD59,3)","v":""},{"$f":"LEFT(BDD!CE59,3)","v":""}]
[{"$f":"LEFT(BDD!A59,3)","v":"878"},{"$f":"BDD!B59","v":1},{"$f":"LEFT(BDD!C59,3)","v":""},{"$f":"LEFT(BDD!D59,3)","v":""},{"$f":"LEFT(BDD!E59,3)","v":""},{"$f":"LEFT(BDD!F59,3)","v":""},{"$f":"LEFT(BDD!G59,3)","v":""},{"$f":"LEFT(BDD!H59,3)","v":""},{"$f":"LEFT(BDD!J59,3)","v":""},{"$f":"LEFT(BDD!K59,3)","v":""},{"$f":"LEFT(BDD!M59,3)","v":""},{"$f":"LEFT(BDD!O59,3)","v":""},{"$f":"LEFT(BDD!P59,3)","v":""},{"$f":"LEFT(BDD!R59,3)","v":""},{"$f":"LEFT(BDD!S59,3)","v":""},{"$f":"LEFT(BDD!T59,3)","v":""},{"$f":"LEFT(BDD!U59,3)","v":""},{"$f":"LEFT(BDD!V59,3)","v":""},{"$f":"LEFT(BDD!W59,3)","v":""},{"$f":"LEFT(BDD!X59,3)","v":""},{"$f":"LEFT(BDD!Y59,3)","v":""},{"$f":"LEFT(BDD!Z59,3)","v":""},{"$f":"LEFT(BDD!AA59,3)","v":""},{"$f":"LEFT(BDD!AB60,3)","v":""},{"$f":"LEFT(BDD!AC59,3)","v":""},{"$f":"LEFT(BDD!AD60,3)","v":""},{"$f":"LEFT(BDD!AE59,3)","v":""},{"$f":"LEFT(BDD!AF59,3)","v":""},{"$f":"LEFT(BDD!AG59,3)","v":""},{"$f":"LEFT(BDD!AI59,3)","v":""},{"$f":"LEFT(BDD!AJ59,3)","v":""},{"$f":"LEFT(BDD!AK59,3)","v":""},{"$f":"LEFT(BDD!AL59,3)","v":""},{"$f":"LEFT(BDD!AM59,3)","v":""},{"$f":"LEFT(BDD!AN59,3)","v":""},{"$f":"LEFT(BDD!AP59,3)","v":""},{"$f":"LEFT(BDD!AQ59,3)","v":""},{"$f":"LEFT(BDD!AR59,3)","v":""},{"$f":"LEFT(BDD!AS59,3)","v":""},{"$f":"LEFT(BDD!AT59,3)","v":""},{"$f":"LEFT(BDD!AU59,3)","v":""},{"$f":"LEFT(BDD!AV59,3)","v":""},{"$f":"LEFT(BDD!AW59,3)","v":""},{"$f":"LEFT(BDD!AX60,3)","v":""},{"$f":"LEFT(BDD!AY59,3)","v":""},{"$f":"LEFT(BDD!AZ59,3)","v":""},{"$f":"LEFT(BDD!BA59,3)","v":""},{"$f":"LEFT(BDD!BB59,3)","v":""},{"$f":"LEFT(BDD!BC59,3)","v":""},{"$f":"LEFT(BDD!BD59,3)","v":""},{"$f":"LEFT(BDD!BE59,3)","v":""},{"$f":"LEFT(BDD!BF59,3)","v":""},{"$f":"LEFT(BDD!BG59,3)","v":""},{"$f":"LEFT(BDD!BH59,3)","v":""},{"$f":"LEFT(BDD!BI59,3)","v":""},{"$f":"LEFT(BDD!BJ59,3)","v":""},{"$f":"LEFT(BDD!BK59,3)","v":""},{"$f":"LEFT(BDD!#REF!,3)","v":{"$error":"#REF!"}},{"$f":"LEFT(BDD!BL59,3)","v":""},{"$f":"LEFT(BDD!BM59,3)","v":""},{"$f":"LEFT(BDD!BN59,3)","v":""},{"$f":"LEFT(BDD!BO59,3)","v":""},{"$f":"LEFT(BDD!BP59,3)","v":""},{"$f":"LEFT(BDD!BQ60,3)","v":""},{"$f":"LEFT(BDD!BR60,3)","v":""},{"$f":"LEFT(BDD!BS60,3)","v":""},{"$f":"LEFT(BDD!BT60,3)","v":""},{"$f":"LEFT(BDD!BU60,3)","v":""},{"$f":"LEFT(BDD!BV60,3)","v":""},{"$f":"LEFT(BDD!BW60,3)","v":""},{"$f":"LEFT(BDD!BX60,3)","v":""},{"$f":"LEFT(BDD!BY60,3)","v":""},{"$f":"LEFT(BDD!BZ60,3)","v":""},{"$f":"LEFT(BDD!CA60,3)","v":""},{"$f":"LEFT(BDD!CB60,3)","v":""},{"$f":"LEFT(BDD!CC60,3)","v":""},{"$f":"LEFT(BDD!CD60,3)","v":""},{"$f":"LEFT(BDD!CE60,3)","v":""}]
[{"$f":"LEFT(BDD!A60,3)","v":"884"},{"$f":"BDD!B60","v":1},{"$f":"LEFT(BDD!C60,3)","v":""},{"$f":"LEFT(BDD!D60,3)","v":""},{"$f":"LEFT(BDD!E60,3)","v":""},{"$f":"LEFT(BDD!F60,3)","v":""},{"$f":"LEFT(BDD!G60,3)","v":""},{"$f":"LEFT(BDD!H60,3)","v":""},{"$f":"LEFT(BDD!J60,3)","v":""},{"$f":"LEFT(BDD!K60,3)","v":""},{"$f":"LEFT(BDD!M60,3)","v":""},{"$f":"LEFT(BDD!O60,3)","v":""},{"$f":"LEFT(BDD!P60,3)","v":""},{"$f":"LEFT(BDD!R60,3)","v":""},{"$f":"LEFT(BDD!S60,3)","v":""},{"$f":"LEFT(BDD!T60,3)","v":""},{"$f":"LEFT(BDD!U60,3)","v":""},{"$f":"LEFT(BDD!V60,3)","v":""},{"$f":"LEFT(BDD!W60,3)","v":""},{"$f":"LEFT(BDD!X60,3)","v":""},{"$f":"LEFT(BDD!Y60,3)","v":""},{"$f":"LEFT(BDD!Z60,3)","v":""},{"$f":"LEFT(BDD!AA60,3)","v":""},{"$f":"LEFT(BDD!AB61,3)","v":""},{"$f":"LEFT(BDD!AC60,3)","v":""},{"$f":"LEFT(BDD!AD61,3)","v":""},{"$f":"LEFT(BDD!AE60,3)","v":""},{"$f":"LEFT(BDD!AF60,3)","v":""},{"$f":"LEFT(BDD!AG60,3)","v":""},{"$f":"LEFT(BDD!AI60,3)","v":""},{"$f":"LEFT(BDD!AJ60,3)","v":""},{"$f":"LEFT(BDD!AK60,3)","v":""},{"$f":"LEFT(BDD!AL60,3)","v":""},{"$f":"LEFT(BDD!AM60,3)","v":""},{"$f":"LEFT(BDD!AN60,3)","v":""},{"$f":"LEFT(BDD!AP60,3)","v":""},{"$f":"LEFT(BDD!AQ60,3)","v":""},{"$f":"LEFT(BDD!AR60,3)","v":""},{"$f":"LEFT(BDD!AS60,3)","v":""},{"$f":"LEFT(BDD!AT60,3)","v":""},{"$f":"LEFT(BDD!AU60,3)","v":""},{"$f":"LEFT(BDD!AV60,3)","v":""},{"$f":"LEFT(BDD!AW60,3)","v":""},{"$f":"LEFT(BDD!AX61,3)","v":""},{"$f":"LEFT(BDD!AY60,3)","v":""},{"$f":"LEFT(BDD!AZ60,3)","v":""},{"$f":"LEFT(BDD!BA60,3)","v":""},{"$f":"LEFT(BDD!BB60,3)","v":""},{"$f":"LEFT(BDD!BC60,3)","v":""},{"$f":"LEFT(BDD!BD60,3)","v":""},{"$f":"LEFT(BDD!BE60,3)","v":""},{"$f":"LEFT(BDD!BF60,3)","v":""},{"$f":"LEFT(BDD!BG60,3)","v":""},{"$f":"LEFT(BDD!BH60,3)","v":""},{"$f":"LEFT(BDD!BI60,3)","v":""},{"$f":"LEFT(BDD!BJ60,3)","v":""},{"$f":"LEFT(BDD!BK60,3)","v":""},{"$f":"LEFT(BDD!#REF!,3)","v":{"$error":"#REF!"}},{"$f":"LEFT(BDD!BL60,3)","v":""},{"$f":"LEFT(BDD!BM60,3)","v":""},{"$f":"LEFT(BDD!BN60,3)","v":""},{"$f":"LEFT(BDD!BO60,3)","v":""},{"$f":"LEFT(BDD!BP60,3)","v":""},{"$f":"LEFT(BDD!BQ61,3)","v":""},{"$f":"LEFT(BDD!BR61,3)","v":""},{"$f":"LEFT(BDD!BS61,3)","v":""},{"$f":"LEFT(BDD!BT61,3)","v":""},{"$f":"LEFT(BDD!BU61,3)","v":""},{"$f":"LEFT(BDD!BV61,3)","v":""},{"$f":"LEFT(BDD!BW61,3)","v":""},{"$f":"LEFT(BDD!BX61,3)","v":""},{"$f":"LEFT(BDD!BY61,3)","v":""},{"$f":"LEFT(BDD!BZ61,3)","v":""},{"$f":"LEFT(BDD!CA61,3)","v":""},{"$f":"LEFT(BDD!CB61,3)","v":""},{"$f":"LEFT(BDD!CC61,3)","v":""},{"$f":"LEFT(BDD!CD61,3)","v":""},{"$f":"LEFT(BDD!CE61,3)","v":""}]
[{"$f":"LEFT(BDD!A63,3)","v":""},{"$f":"BDD!B63","v":0},{"$f":"LEFT(BDD!C61,3)","v":""},{"$f":"LEFT(BDD!D61,3)","v":""},{"$f":"LEFT(BDD!E61,3)","v":""},{"$f":"LEFT(BDD!F61,3)","v":""},{"$f":"LEFT(BDD!G61,3)","v":""},{"$f":"LEFT(BDD!H61,3)","v":""},{"$f":"LEFT(BDD!J61,3)","v":""},{"$f":"LEFT(BDD!K61,3)","v":""},{"$f":"LEFT(BDD!M61,3)","v":""},{"$f":"LEFT(BDD!O61,3)","v":""},{"$f":"LEFT(BDD!P61,3)","v":""},{"$f":"LEFT(BDD!R61,3)","v":""},{"$f":"LEFT(BDD!S61,3)","v":""},{"$f":"LEFT(BDD!T61,3)","v":""},{"$f":"LEFT(BDD!U61,3)","v":""},{"$f":"LEFT(BDD!V61,3)","v":""},{"$f":"LEFT(BDD!W61,3)","v":""},{"$f":"LEFT(BDD!X61,3)","v":""},{"$f":"LEFT(BDD!Y61,3)","v":""},{"$f":"LEFT(BDD!Z61,3)","v":""},{"$f":"LEFT(BDD!AA61,3)","v":""},{"$f":"LEFT(BDD!AB62,3)","v":""},{"$f":"LEFT(BDD!AC61,3)","v":""},{"$f":"LEFT(BDD!AD62,3)","v":""},{"$f":"LEFT(BDD!AE61,3)","v":""},{"$f":"LEFT(BDD!AF61,3)","v":""},{"$f":"LEFT(BDD!AG61,3)","v":""},{"$f":"LEFT(BDD!AI61,3)","v":""},{"$f":"LEFT(BDD!AJ61,3)","v":""},{"$f":"LEFT(BDD!AK61,3)","v":""},{"$f":"LEFT(BDD!AL61,3)","v":""},{"$f":"LEFT(BDD!AM61,3)","v":""},{"$f":"LEFT(BDD!AN61,3)","v":""},{"$f":"LEFT(BDD!AP61,3)","v":""},{"$f":"LEFT(BDD!AQ61,3)","v":""},{"$f":"LEFT(BDD!AR61,3)","v":""},{"$f":"LEFT(BDD!AS61,3)","v":""},{"$f":"LEFT(BDD!AT61,3)","v":""},{"$f":"LEFT(BDD!AU61,3)","v":""},{"$f":"LEFT(BDD!AV61,3)","v":""},{"$f":"LEFT(BDD!AW61,3)","v":""},{"$f":"LEFT(BDD!AX62,3)","v":""},{"$f":"LEFT(BDD!AY61,3)","v":""},{"$f":"LEFT(BDD!AZ61,3)","v":""},{"$f":"LEFT(BDD!BA61,3)","v":""},{"$f":"LEFT(BDD!BB61,3)","v":""},{"$f":"LEFT(BDD!BC61,3)","v":""},{"$f":"LEFT(BDD!BD61,3)","v":""},{"$f":"LEFT(BDD!BE61,3)","v":""},{"$f":"LEFT(BDD!BF61,3)","v":""},{"$f":"LEFT(BDD!BG61,3)","v":""},{"$f":"LEFT(BDD!BH61,3)","v":""},{"$f":"LEFT(BDD!BI61,3)","v":""},{"$f":"LEFT(BDD!BJ61,3)","v":""},{"$f":"LEFT(BDD!BK61,3)","v":""},{"$f":"LEFT(BDD!#REF!,3)","v":{"$error":"#REF!"}},{"$f":"LEFT(BDD!BL61,3)","v":""},{"$f":"LEFT(BDD!BM61,3)","v":""},{"$f":"LEFT(BDD!BN61,3)","v":""},{"$f":"LEFT(BDD!BO61,3)","v":""},{"$f":"LEFT(BDD!BP61,3)","v":""},{"$f":"LEFT(BDD!BQ62,3)","v":""},{"$f":"LEFT(BDD!BR62,3)","v":""},{"$f":"LEFT(BDD!BS62,3)","v":""},{"$f":"LEFT(BDD!BT62,3)","v":""},{"$f":"LEFT(BDD!BU62,3)","v":""},{"$f":"LEFT(BDD!BV62,3)","v":""},{"$f":"LEFT(BDD!BW62,3)","v":""},{"$f":"LEFT(BDD!BX62,3)","v":""},{"$f":"LEFT(BDD!BY62,3)","v":""},{"$f":"LEFT(BDD!BZ62,3)","v":""},{"$f":"LEFT(BDD!CA62,3)","v":""},{"$f":"LEFT(BDD!CB62,3)","v":""},{"$f":"LEFT(BDD!CC62,3)","v":""},{"$f":"LEFT(BDD!CD62,3)","v":""},{"$f":"LEFT(BDD!CE62,3)","v":""}]
[{"$f":"LEFT(BDD!A64,3)","v":""},{"$f":"BDD!B64","v":0},{"$f":"LEFT(BDD!C62,3)","v":""},{"$f":"LEFT(BDD!D62,3)","v":""},{"$f":"LEFT(BDD!E62,3)","v":""},{"$f":"LEFT(BDD!F62,3)","v":""},{"$f":"LEFT(BDD!G62,3)","v":""},{"$f":"LEFT(BDD!H62,3)","v":""},{"$f":"LEFT(BDD!J62,3)","v":""},{"$f":"LEFT(BDD!K62,3)","v":""},{"$f":"LEFT(BDD!M62,3)","v":""},{"$f":"LEFT(BDD!O62,3)","v":""},{"$f":"LEFT(BDD!P62,3)","v":""},{"$f":"LEFT(BDD!R62,3)","v":""},{"$f":"LEFT(BDD!S62,3)","v":""},{"$f":"LEFT(BDD!T62,3)","v":""},{"$f":"LEFT(BDD!U62,3)","v":""},{"$f":"LEFT(BDD!V62,3)","v":""},{"$f":"LEFT(BDD!W62,3)","v":""},{"$f":"LEFT(BDD!X62,3)","v":""},{"$f":"LEFT(BDD!Y62,3)","v":""},{"$f":"LEFT(BDD!Z62,3)","v":""},{"$f":"LEFT(BDD!AA62,3)","v":""},{"$f":"LEFT(BDD!AB63,3)","v":""},{"$f":"LEFT(BDD!AC62,3)","v":""},{"$f":"LEFT(BDD!AD63,3)","v":""},{"$f":"LEFT(BDD!AE62,3)","v":""},{"$f":"LEFT(BDD!AF62,3)","v":""},{"$f":"LEFT(BDD!AG62,3)","v":""},{"$f":"LEFT(BDD!AI62,3)","v":""},{"$f":"LEFT(BDD!AJ62,3)","v":""},{"$f":"LEFT(BDD!AK62,3)","v":""},{"$f":"LEFT(BDD!AL62,3)","v":""},{"$f":"LEFT(BDD!AM62,3)","v":""},{"$f":"LEFT(BDD!AN62,3)","v":""},{"$f":"LEFT(BDD!AP62,3)","v":""},{"$f":"LEFT(BDD!AQ62,3)","v":""},{"$f":"LEFT(BDD!AR62,3)","v":""},{"$f":"LEFT(BDD!AS62,3)","v":""},{"$f":"LEFT(BDD!AT62,3)","v":""},{"$f":"LEFT(BDD!AU62,3)","v":""},{"$f":"LEFT(BDD!AV62,3)","v":""},{"$f":"LEFT(BDD!AW62,3)","v":""},{"$f":"LEFT(BDD!AX63,3)","v":""},{"$f":"LEFT(BDD!AY62,3)","v":""},{"$f":"LEFT(BDD!AZ62,3)","v":""},{"$f":"LEFT(BDD!BA62,3)","v":""},{"$f":"LEFT(BDD!BB62,3)","v":""},{"$f":"LEFT(BDD!BC62,3)","v":""},{"$f":"LEFT(BDD!BD62,3)","v":""},{"$f":"LEFT(BDD!BE62,3)","v":""},{"$f":"LEFT(BDD!BF62,3)","v":""},{"$f":"LEFT(BDD!BG62,3)","v":""},{"$f":"LEFT(BDD!BH62,3)","v":""},{"$f":"LEFT(BDD!BI62,3)","v":""},{"$f":"LEFT(BDD!BJ62,3)","v":""},{"$f":"LEFT(BDD!BK62,3)","v":""},{"$f":"LEFT(BDD!#REF!,3)","v":{"$error":"#REF!"}},{"$f":"LEFT(BDD!BL62,3)","v":""},{"$f":"LEFT(BDD!BM62,3)","v":""},{"$f":"LEFT(BDD!BN62,3)","v":""},{"$f":"LEFT(BDD!BO62,3)","v":""},{"$f":"LEFT(BDD!BP62,3)","v":""},{"$f":"LEFT(BDD!BQ63,3)","v":""},{"$f":"LEFT(BDD!BR63,3)","v":""},{"$f":"LEFT(BDD!BS63,3)","v":""},{"$f":"LEFT(BDD!BT63,3)","v":""},{"$f":"LEFT(BDD!BU63,3)","v":""},{"$f":"LEFT(BDD!BV63,3)","v":""},{"$f":"LEFT(BDD!BW63,3)","v":""},{"$f":"LEFT(BDD!BX63,3)","v":""},{"$f":"LEFT(BDD!BY63,3)","v":""},{"$f":"LEFT(BDD!BZ63,3)","v":""},{"$f":"LEFT(BDD!CA63,3)","v":""},{"$f":"LEFT(BDD!CB63,3)","v":""},{"$f":"LEFT(BDD!CC63,3)","v":""},{"$f":"LEFT(BDD!CD63,3)","v":""},{"$f":"LEFT(BDD!CE63,3)","v":""}]
[{"$f":"LEFT(BDD!A65,3)","v":""},{"$f":"BDD!B65","v":0},{"$f":"LEFT(BDD!C63,3)","v":""},{"$f":"LEFT(BDD!D63,3)","v":""},{"$f":"LEFT(BDD!E63,3)","v":""},{"$f":"LEFT(BDD!F63,3)","v":""},{"$f":"LEFT(BDD!G63,3)","v":""},{"$f":"LEFT(BDD!H63,3)","v":""},{"$f":"LEFT(BDD!J63,3)","v":""},{"$f":"LEFT(BDD!K63,3)","v":""},{"$f":"LEFT(BDD!M63,3)","v":""},{"$f":"LEFT(BDD!O63,3)","v":""},{"$f":"LEFT(BDD!P63,3)","v":""},{"$f":"LEFT(BDD!R63,3)","v":""},{"$f":"LEFT(BDD!S63,3)","v":""},{"$f":"LEFT(BDD!T63,3)","v":""},{"$f":"LEFT(BDD!U63,3)","v":""},{"$f":"LEFT(BDD!V63,3)","v":""},{"$f":"LEFT(BDD!W63,3)","v":""},{"$f":"LEFT(BDD!X63,3)","v":""},{"$f":"LEFT(BDD!Y63,3)","v":""},{"$f":"LEFT(BDD!Z63,3)","v":""},{"$f":"LEFT(BDD!AA63,3)","v":""},{"$f":"LEFT(BDD!AB64,3)","v":""},{"$f":"LEFT(BDD!AC63,3)","v":""},{"$f":"LEFT(BDD!AD64,3)","v":""},{"$f":"LEFT(BDD!AE63,3)","v":""},{"$f":"LEFT(BDD!AF63,3)","v":""},{"$f":"LEFT(BDD!AG63,3)","v":""},{"$f":"LEFT(BDD!AI63,3)","v":""},{"$f":"LEFT(BDD!AJ63,3)","v":""},{"$f":"LEFT(BDD!AK63,3)","v":""},{"$f":"LEFT(BDD!AL63,3)","v":""},{"$f":"LEFT(BDD!AM63,3)","v":""},{"$f":"LEFT(BDD!AN63,3)","v":""},{"$f":"LEFT(BDD!AP63,3)","v":""},{"$f":"LEFT(BDD!AQ63,3)","v":""},{"$f":"LEFT(BDD!AR63,3)","v":""},{"$f":"LEFT(BDD!AS63,3)","v":""},{"$f":"LEFT(BDD!AT63,3)","v":""},{"$f":"LEFT(BDD!AU63,3)","v":""},{"$f":"LEFT(BDD!AV63,3)","v":""},{"$f":"LEFT(BDD!AW63,3)","v":""},{"$f":"LEFT(BDD!AX64,3)","v":""},{"$f":"LEFT(BDD!AY63,3)","v":""},{"$f":"LEFT(BDD!AZ63,3)","v":""},{"$f":"LEFT(BDD!BA63,3)","v":""},{"$f":"LEFT(BDD!BB63,3)","v":""},{"$f":"LEFT(BDD!BC63,3)","v":""},{"$f":"LEFT(BDD!BD63,3)","v":""},{"$f":"LEFT(BDD!BE63,3)","v":""},{"$f":"LEFT(BDD!BF63,3)","v":""},{"$f":"LEFT(BDD!BG63,3)","v":""},{"$f":"LEFT(BDD!BH63,3)","v":""},{"$f":"LEFT(BDD!BI63,3)","v":""},{"$f":"LEFT(BDD!BJ63,3)","v":""},{"$f":"LEFT(BDD!BK63,3)","v":""},{"$f":"LEFT(BDD!#REF!,3)","v":{"$error":"#REF!"}},{"$f":"LEFT(BDD!BL63,3)","v":""},{"$f":"LEFT(BDD!BM63,3)","v":""},{"$f":"LEFT(BDD!BN63,3)","v":""},{"$f":"LEFT(BDD!BO63,3)","v":""},{"$f":"LEFT(BDD!BP63,3)","v":""},{"$f":"LEFT(BDD!BQ64,3)","v":""},{"$f":"LEFT(BDD!BR64,3)","v":""},{"$f":"LEFT(BDD!BS64,3)","v":""},{"$f":"LEFT(BDD!BT64,3)","v":""},{"$f":"LEFT(BDD!BU64,3)","v":""},{"$f":"LEFT(BDD!BV64,3)","v":""},{"$f":"LEFT(BDD!BW64,3)","v":""},{"$f":"LEFT(BDD!BX64,3)","v":""},{"$f":"LEFT(BDD!BY64,3)","v":""},{"$f":"LEFT(BDD!BZ64,3)","v":""},{"$f":"LEFT(BDD!CA64,3)","v":""},{"$f":"LEFT(BDD!CB64,3)","v":""},{"$f":"LEFT(BDD!CC64,3)","v":""},{"$f":"LEFT(BDD!CD64,3)","v":""},{"$f":"LEFT(BDD!CE64,3)","v":""}]
[{"$f":"LEFT(BDD!A66,3)","v":""},{"$f":"BDD!B66","v":0},{"$f":"LEFT(BDD!C64,3)","v":""},{"$f":"LEFT(BDD!D64,3)","v":""},{"$f":"LEFT(BDD!E64,3)","v":""},{"$f":"LEFT(BDD!F64,3)","v":""},{"$f":"LEFT(BDD!G64,3)","v":""},{"$f":"LEFT(BDD!H64,3)","v":""},{"$f":"LEFT(BDD!J64,3)","v":""},{"$f":"LEFT(BDD!K64,3)","v":""},{"$f":"LEFT(BDD!M64,3)","v":""},{"$f":"LEFT(BDD!O64,3)","v":""},{"$f":"LEFT(BDD!P64,3)","v":""},{"$f":"LEFT(BDD!R64,3)","v":""},{"$f":"LEFT(BDD!S64,3)","v":""},{"$f":"LEFT(BDD!T64,3)","v":""},{"$f":"LEFT(BDD!U64,3)","v":""},{"$f":"LEFT(BDD!V64,3)","v":""},{"$f":"LEFT(BDD!W64,3)","v":""},{"$f":"LEFT(BDD!X64,3)","v":""},{"$f":"LEFT(BDD!Y64,3)","v":""},{"$f":"LEFT(BDD!Z64,3)","v":""},{"$f":"LEFT(BDD!AA64,3)","v":""},{"$f":"LEFT(BDD!AB64,3)","v":""},{"$f":"LEFT(BDD!AC64,3)","v":""},{"$f":"LEFT(BDD!AD65,3)","v":""},{"$f":"LEFT(BDD!AE64,3)","v":""},{"$f":"LEFT(BDD!AF64,3)","v":""},{"$f":"LEFT(BDD!AG64,3)","v":""},{"$f":"LEFT(BDD!AI64,3)","v":""},{"$f":"LEFT(BDD!AJ64,3)","v":""},{"$f":"LEFT(BDD!AK64,3)","v":""},{"$f":"LEFT(BDD!AL64,3)","v":""},{"$f":"LEFT(BDD!AM64,3)","v":""},{"$f":"LEFT(BDD!AN64,3)","v":""},{"$f":"LEFT(BDD!AP64,3)","v":""},{"$f":"LEFT(BDD!AQ64,3)","v":""},{"$f":"LEFT(BDD!AR64,3)","v":""},{"$f":"LEFT(BDD!AS64,3)","v":""},{"$f":"LEFT(BDD!AT64,3)","v":""},{"$f":"LEFT(BDD!AU64,3)","v":""},{"$f":"LEFT(BDD!AV64,3)","v":""},{"$f":"LEFT(BDD!AW64,3)","v":""},{"$f":"LEFT(BDD!AX65,3)","v":""},{"$f":"LEFT(BDD!AY64,3)","v":""},{"$f":"LEFT(BDD!AZ64,3)","v":""},{"$f":"LEFT(BDD!BA64,3)","v":""},{"$f":"LEFT(BDD!BB64,3)","v":""},{"$f":"LEFT(BDD!BC64,3)","v":""},{"$f":"LEFT(BDD!BD64,3)","v":""},{"$f":"LEFT(BDD!BE64,3)","v":""},{"$f":"LEFT(BDD!BF64,3)","v":""},{"$f":"LEFT(BDD!BG64,3)","v":""},{"$f":"LEFT(BDD!BH64,3)","v":""},{"$f":"LEFT(BDD!BI64,3)","v":""},{"$f":"LEFT(BDD!BJ64,3)","v":""},{"$f":"LEFT(BDD!BK64,3)","v":""},{"$f":"LEFT(BDD!#REF!,3)","v":{"$error":"#REF!"}},{"$f":"LEFT(BDD!BL64,3)","v":""},{"$f":"LEFT(BDD!BM64,3)","v":""},{"$f":"LEFT(BDD!BN64,3)","v":""},{"$f":"LEFT(BDD!BO64,3)","v":""},{"$f":"LEFT(BDD!BP64,3)","v":""},{"$f":"LEFT(BDD!BQ65,3)","v":""},{"$f":"LEFT(BDD!BR65,3)","v":""},{"$f":"LEFT(BDD!BS65,3)","v":""},{"$f":"LEFT(BDD!BT65,3)","v":""},{"$f":"LEFT(BDD!BU65,3)","v":""},{"$f":"LEFT(BDD!BV65,3)","v":""},{"$f":"LEFT(BDD!BW65,3)","v":""},{"$f":"LEFT(BDD!BX65,3)","v":""},{"$f":"LEFT(BDD!BY65,3)","v":""},{"$f":"LEFT(BDD!BZ65,3)","v":""},{"$f":"LEFT(BDD!CA65,3)","v":""},{"$f":"LEFT(BDD!CB65,3)","v":""},{"$f":"LEFT(BDD!CC65,3)","v":""},{"$f":"LEFT(BDD!CD65,3)","v":""},{"$f":"LEFT(BDD!CE65,3)","v":""}]
[{"$f":"LEFT(BDD!A67,3)","v":""},{"$f":"BDD!B67","v":0},{"$f":"LEFT(BDD!C65,3)","v":""},{"$f":"LEFT(BDD!D65,3)","v":""},{"$f":"LEFT(BDD!E65,3)","v":""},{"$f":"LEFT(BDD!F65,3)","v":""},{"$f":"LEFT(BDD!G65,3)","v":""},{"$f":"LEFT(BDD!H65,3)","v":""},{"$f":"LEFT(BDD!J65,3)","v":""},{"$f":"LEFT(BDD!K65,3)","v":""},{"$f":"LEFT(BDD!M65,3)","v":""},{"$f":"LEFT(BDD!O65,3)","v":""},{"$f":"LEFT(BDD!P65,3)","v":""},{"$f":"LEFT(BDD!R65,3)","v":""},{"$f":"LEFT(BDD!S65,3)","v":""},{"$f":"LEFT(BDD!T65,3)","v":""},{"$f":"LEFT(BDD!U65,3)","v":""},{"$f":"LEFT(BDD!V65,3)","v":""},{"$f":"LEFT(BDD!W65,3)","v":""},{"$f":"LEFT(BDD!X65,3)","v":""},{"$f":"LEFT(BDD!Y65,3)","v":""},{"$f":"LEFT(BDD!Z65,3)","v":""},{"$f":"LEFT(BDD!AA65,3)","v":""},{"$f":"LEFT(BDD!AB65,3)","v":""},{"$f":"LEFT(BDD!AC65,3)","v":""},{"$f":"LEFT(BDD!AD66,3)","v":""},{"$f":"LEFT(BDD!AE65,3)","v":""},{"$f":"LEFT(BDD!AF65,3)","v":""},{"$f":"LEFT(BDD!AG65,3)","v":""},{"$f":"LEFT(BDD!AI65,3)","v":""},{"$f":"LEFT(BDD!AJ65,3)","v":""},{"$f":"LEFT(BDD!AK65,3)","v":""},{"$f":"LEFT(BDD!AL65,3)","v":""},{"$f":"LEFT(BDD!AM65,3)","v":""},{"$f":"LEFT(BDD!AN65,3)","v":""},{"$f":"LEFT(BDD!AP65,3)","v":""},{"$f":"LEFT(BDD!AQ65,3)","v":""},{"$f":"LEFT(BDD!AR65,3)","v":""},{"$f":"LEFT(BDD!AS65,3)","v":""},{"$f":"LEFT(BDD!AT65,3)","v":""},{"$f":"LEFT(BDD!AU65,3)","v":""},{"$f":"LEFT(BDD!AV65,3)","v":""},{"$f":"LEFT(BDD!AW65,3)","v":""},{"$f":"LEFT(BDD!AX66,3)","v":""},{"$f":"LEFT(BDD!AY65,3)","v":""},{"$f":"LEFT(BDD!AZ65,3)","v":""},{"$f":"LEFT(BDD!BA65,3)","v":""},{"$f":"LEFT(BDD!BB65,3)","v":""},{"$f":"LEFT(BDD!BC65,3)","v":""},{"$f":"LEFT(BDD!BD65,3)","v":""},{"$f":"LEFT(BDD!BE65,3)","v":""},{"$f":"LEFT(BDD!BF65,3)","v":""},{"$f":"LEFT(BDD!BG65,3)","v":""},{"$f":"LEFT(BDD!BH65,3)","v":""},{"$f":"LEFT(BDD!BI65,3)","v":""},{"$f":"LEFT(BDD!BJ65,3)","v":""},{"$f":"LEFT(BDD!BK65,3)","v":""},{"$f":"LEFT(BDD!#REF!,3)","v":{"$error":"#REF!"}},{"$f":"LEFT(BDD!BL65,3)","v":""},{"$f":"LEFT(BDD!BM65,3)","v":""},{"$f":"LEFT(BDD!BN65,3)","v":""},{"$f":"LEFT(BDD!BO65,3)","v":""},{"$f":"LEFT(BDD!BP65,3)","v":""},{"$f":"LEFT(BDD!BQ66,3)","v":""},{"$f":"LEFT(BDD!BR66,3)","v":""},{"$f":"LEFT(BDD!BS66,3)","v":""},{"$f":"LEFT(BDD!BT66,3)","v":""},{"$f":"LEFT(BDD!BU66,3)","v":""},{"$f":"LEFT(BDD!BV66,3)","v":""},{"$f":"LEFT(BDD!BW66,3)","v":""},{"$f":"LEFT(BDD!BX66,3)","v":""},{"$f":"LEFT(BDD!BY66,3)","v":""},{"$f":"LEFT(BDD!BZ66,3)","v":""},{"$f":"LEFT(BDD!CA66,3)","v":""},{"$f":"LEFT(BDD!CB66,3)","v":""},{"$f":"LEFT(BDD!CC66,3)","v":""},{"$f":"LEFT(BDD!CD66,3)","v":""},{"$f":"LEFT(BDD!CE66,3)","v":""}]
[{"$f":"LEFT(BDD!A68,3)","v":""},{"$f":"BDD!B68","v":0},{"$f":"LEFT(BDD!C66,3)","v":""},{"$f":"LEFT(BDD!D66,3)","v":""},{"$f":"LEFT(BDD!E66,3)","v":""},{"$f":"LEFT(BDD!F66,3)","v":""},{"$f":"LEFT(BDD!G66,3)","v":""},{"$f":"LEFT(BDD!H66,3)","v":""},{"$f":"LEFT(BDD!J66,3)","v":""},{"$f":"LEFT(BDD!K66,3)","v":""},{"$f":"LEFT(BDD!M66,3)","v":""},{"$f":"LEFT(BDD!O66,3)","v":""},{"$f":"LEFT(BDD!P66,3)","v":""},{"$f":"LEFT(BDD!R66,3)","v":""},{"$f":"LEFT(BDD!S66,3)","v":""},{"$f":"LEFT(BDD!T66,3)","v":""},{"$f":"LEFT(BDD!U66,3)","v":""},{"$f":"LEFT(BDD!V66,3)","v":""},{"$f":"LEFT(BDD!W66,3)","v":""},{"$f":"LEFT(BDD!X66,3)","v":""},{"$f":"LEFT(BDD!Y66,3)","v":""},{"$f":"LEFT(BDD!Z66,3)","v":""},{"$f":"LEFT(BDD!AA66,3)","v":""},{"$f":"LEFT(BDD!AB66,3)","v":""},{"$f":"LEFT(BDD!AC66,3)","v":""},{"$f":"LEFT(BDD!AD67,3)","v":""},{"$f":"LEFT(BDD!AE66,3)","v":""},{"$f":"LEFT(BDD!AF66,3)","v":""},{"$f":"LEFT(BDD!AG66,3)","v":""},{"$f":"LEFT(BDD!AI66,3)","v":""},{"$f":"LEFT(BDD!AJ66,3)","v":""},{"$f":"LEFT(BDD!AK66,3)","v":""},{"$f":"LEFT(BDD!AL66,3)","v":""},{"$f":"LEFT(BDD!AM66,3)","v":""},{"$f":"LEFT(BDD!AN66,3)","v":""},{"$f":"LEFT(BDD!AP66,3)","v":""},{"$f":"LEFT(BDD!AQ66,3)","v":""},{"$f":"LEFT(BDD!AR66,3)","v":""},{"$f":"LEFT(BDD!AS66,3)","v":""},{"$f":"LEFT(BDD!AT66,3)","v":""},{"$f":"LEFT(BDD!AU66,3)","v":""},{"$f":"LEFT(BDD!AV66,3)","v":""},{"$f":"LEFT(BDD!AW66,3)","v":""},{"$f":"LEFT(BDD!AX67,3)","v":""},{"$f":"LEFT(BDD!AY66,3)","v":""},{"$f":"LEFT(BDD!AZ66,3)","v":""},{"$f":"LEFT(BDD!BA66,3)","v":""},{"$f":"LEFT(BDD!BB66,3)","v":""},{"$f":"LEFT(BDD!BC66,3)","v":""},{"$f":"LEFT(BDD!BD66,3)","v":""},{"$f":"LEFT(BDD!BE66,3)","v":""},{"$f":"LEFT(BDD!BF66,3)","v":""},{"$f":"LEFT(BDD!BG66,3)","v":""},{"$f":"LEFT(BDD!BH66,3)","v":""},{"$f":"LEFT(BDD!BI66,3)","v":""},{"$f":"LEFT(BDD!BJ66,3)","v":""},{"$f":"LEFT(BDD!BK66,3)","v":""},{"$f":"LEFT(BDD!#REF!,3)","v":{"$error":"#REF!"}},{"$f":"LEFT(BDD!BL66,3)","v":""},{"$f":"LEFT(BDD!BM66,3)","v":""},{"$f":"LEFT(BDD!BN66,3)","v":""},{"$f":"LEFT(BDD!BO66,3)","v":""},{"$f":"LEFT(BDD!BP66,3)","v":""},{"$f":"LEFT(BDD!BQ67,3)","v":""},{"$f":"LEFT(BDD!BR67,3)","v":""},{"$f":"LEFT(BDD!BS67,3)","v":""},{"$f":"LEFT(BDD!BT67,3)","v":""},{"$f":"LEFT(BDD!BU67,3)","v":""},{"$f":"LEFT(BDD!BV67,3)","v":""},{"$f":"LEFT(BDD!BW67,3)","v":""},{"$f":"LEFT(BDD!BX67,3)","v":""},{"$f":"LEFT(BDD!BY67,3)","v":""},{"$f":"LEFT(BDD!BZ67,3)","v":""},{"$f":"LEFT(BDD!CA67,3)","v":""},{"$f":"LEFT(BDD!CB67,3)","v":""},{"$f":"LEFT(BDD!CC67,3)","v":""},{"$f":"LEFT(BDD!CD67,3)","v":""},{"$f":"LEFT(BDD!CE67,3)","v":""}]
[{"$f":"LEFT(BDD!A69,3)","v":""},{"$f":"BDD!B69","v":0},{"$f":"LEFT(BDD!C67,3)","v":""},{"$f":"LEFT(BDD!D67,3)","v":""},{"$f":"LEFT(BDD!E67,3)","v":""},{"$f":"LEFT(BDD!F67,3)","v":""},{"$f":"LEFT(BDD!G67,3)","v":""},{"$f":"LEFT(BDD!H67,3)","v":""},{"$f":"LEFT(BDD!J67,3)","v":""},{"$f":"LEFT(BDD!K67,3)","v":""},{"$f":"LEFT(BDD!M67,3)","v":""},{"$f":"LEFT(BDD!O67,3)","v":""},{"$f":"LEFT(BDD!P67,3)","v":""},{"$f":"LEFT(BDD!R67,3)","v":""},{"$f":"LEFT(BDD!S67,3)","v":""},{"$f":"LEFT(BDD!T67,3)","v":""},{"$f":"LEFT(BDD!U67,3)","v":""},{"$f":"LEFT(BDD!V67,3)","v":""},{"$f":"LEFT(BDD!W67,3)","v":""},{"$f":"LEFT(BDD!X67,3)","v":""},{"$f":"LEFT(BDD!Y67,3)","v":""},{"$f":"LEFT(BDD!Z67,3)","v":""},{"$f":"LEFT(BDD!AA67,3)","v":""},{"$f":"LEFT(BDD!AB67,3)","v":""},{"$f":"LEFT(BDD!AC67,3)","v":""},{"$f":"LEFT(BDD!AD68,3)","v":""},{"$f":"LEFT(BDD!AE67,3)","v":""},{"$f":"LEFT(BDD!AF67,3)","v":""},{"$f":"LEFT(BDD!AG67,3)","v":""},{"$f":"LEFT(BDD!AI67,3)","v":""},{"$f":"LEFT(BDD!AJ67,3)","v":""},{"$f":"LEFT(BDD!AK67,3)","v":""},{"$f":"LEFT(BDD!AL67,3)","v":""},{"$f":"LEFT(BDD!AM67,3)","v":""},{"$f":"LEFT(BDD!AN67,3)","v":""},{"$f":"LEFT(BDD!AP67,3)","v":""},{"$f":"LEFT(BDD!AQ67,3)","v":""},{"$f":"LEFT(BDD!AR67,3)","v":""},{"$f":"LEFT(BDD!AS67,3)","v":""},{"$f":"LEFT(BDD!AT67,3)","v":""},{"$f":"LEFT(BDD!AU67,3)","v":""},{"$f":"LEFT(BDD!AV67,3)","v":""},{"$f":"LEFT(BDD!AW67,3)","v":""},{"$f":"LEFT(BDD!AX68,3)","v":""},{"$f":"LEFT(BDD!AY67,3)","v":""},{"$f":"LEFT(BDD!AZ67,3)","v":""},{"$f":"LEFT(BDD!BA67,3)","v":""},{"$f":"LEFT(BDD!BB67,3)","v":""},{"$f":"LEFT(BDD!BC67,3)","v":""},{"$f":"LEFT(BDD!BD67,3)","v":""},{"$f":"LEFT(BDD!BE67,3)","v":""},{"$f":"LEFT(BDD!BF67,3)","v":""},{"$f":"LEFT(BDD!BG67,3)","v":""},{"$f":"LEFT(BDD!BH67,3)","v":""},{"$f":"LEFT(BDD!BI67,3)","v":""},{"$f":"LEFT(BDD!BJ67,3)","v":""},{"$f":"LEFT(BDD!BK67,3)","v":""},{"$f":"LEFT(BDD!#REF!,3)","v":{"$error":"#REF!"}},{"$f":"LEFT(BDD!BL67,3)","v":""},{"$f":"LEFT(BDD!BM67,3)","v":""},{"$f":"LEFT(BDD!BN67,3)","v":""},{"$f":"LEFT(BDD!BO67,3)","v":""},{"$f":"LEFT(BDD!BP67,3)","v":""},{"$f":"LEFT(BDD!BQ68,3)","v":""},{"$f":"LEFT(BDD!BR68,3)","v":""},{"$f":"LEFT(BDD!BS68,3)","v":""},{"$f":"LEFT(BDD!BT68,3)","v":""},{"$f":"LEFT(BDD!BU68,3)","v":""},{"$f":"LEFT(BDD!BV68,3)","v":""},{"$f":"LEFT(BDD!BW68,3)","v":""},{"$f":"LEFT(BDD!BX68,3)","v":""},{"$f":"LEFT(BDD!BY68,3)","v":""},{"$f":"LEFT(BDD!BZ68,3)","v":""},{"$f":"LEFT(BDD!CA68,3)","v":""},{"$f":"LEFT(BDD!CB68,3)","v":""},{"$f":"LEFT(BDD!CC68,3)","v":""},{"$f":"LEFT(BDD!CD68,3)","v":""},{"$f":"LEFT(BDD!CE68,3)","v":""}]
[{"$f":"LEFT(BDD!A70,3)","v":""},{"$f":"BDD!B70","v":0},{"$f":"LEFT(BDD!C68,3)","v":""},{"$f":"LEFT(BDD!D68,3)","v":""},{"$f":"LEFT(BDD!E68,3)","v":""},{"$f":"LEFT(BDD!F68,3)","v":""},{"$f":"LEFT(BDD!G68,3)","v":""},{"$f":"LEFT(BDD!H68,3)","v":""},{"$f":"LEFT(BDD!J68,3)","v":""},{"$f":"LEFT(BDD!K68,3)","v":""},{"$f":"LEFT(BDD!M68,3)","v":""},{"$f":"LEFT(BDD!O68,3)","v":""},{"$f":"LEFT(BDD!P68,3)","v":""},{"$f":"LEFT(BDD!R68,3)","v":""},{"$f":"LEFT(BDD!S68,3)","v":""},{"$f":"LEFT(BDD!T68,3)","v":""},{"$f":"LEFT(BDD!U68,3)","v":""},{"$f":"LEFT(BDD!V68,3)","v":""},{"$f":"LEFT(BDD!W68,3)","v":""},{"$f":"LEFT(BDD!X68,3)","v":""},{"$f":"LEFT(BDD!Y68,3)","v":""},{"$f":"LEFT(BDD!Z68,3)","v":""},{"$f":"LEFT(BDD!AA68,3)","v":""},{"$f":"LEFT(BDD!AB68,3)","v":""},{"$f":"LEFT(BDD!AC68,3)","v":""},{"$f":"LEFT(BDD!AD69,3)","v":""},{"$f":"LEFT(BDD!AE68,3)","v":""},{"$f":"LEFT(BDD!AF68,3)","v":""},{"$f":"LEFT(BDD!AG68,3)","v":""},{"$f":"LEFT(BDD!AI68,3)","v":""},{"$f":"LEFT(BDD!AJ68,3)","v":""},{"$f":"LEFT(BDD!AK68,3)","v":""},{"$f":"LEFT(BDD!AL68,3)","v":""},{"$f":"LEFT(BDD!AM68,3)","v":""},{"$f":"LEFT(BDD!AN68,3)","v":""},{"$f":"LEFT(BDD!AP68,3)","v":""},{"$f":"LEFT(BDD!AQ68,3)","v":""},{"$f":"LEFT(BDD!AR68,3)","v":""},{"$f":"LEFT(BDD!AS68,3)","v":""},{"$f":"LEFT(BDD!AT68,3)","v":""},{"$f":"LEFT(BDD!AU68,3)","v":""},{"$f":"LEFT(BDD!AV68,3)","v":""},{"$f":"LEFT(BDD!AW68,3)","v":""},{"$f":"LEFT(BDD!AX69,3)","v":""},{"$f":"LEFT(BDD!AY68,3)","v":""},{"$f":"LEFT(BDD!AZ68,3)","v":""},{"$f":"LEFT(BDD!BA68,3)","v":""},{"$f":"LEFT(BDD!BB68,3)","v":""},{"$f":"LEFT(BDD!BC68,3)","v":""},{"$f":"LEFT(BDD!BD68,3)","v":""},{"$f":"LEFT(BDD!BE68,3)","v":""},{"$f":"LEFT(BDD!BF68,3)","v":""},{"$f":"LEFT(BDD!BG68,3)","v":""},{"$f":"LEFT(BDD!BH68,3)","v":""},{"$f":"LEFT(BDD!BI68,3)","v":""},{"$f":"LEFT(BDD!BJ68,3)","v":""},{"$f":"LEFT(BDD!BK68,3)","v":""},{"$f":"LEFT(BDD!#REF!,3)","v":{"$error":"#REF!"}},{"$f":"LEFT(BDD!BL68,3)","v":""},{"$f":"LEFT(BDD!BM68,3)","v":""},{"$f":"LEFT(BDD!BN68,3)","v":""},{"$f":"LEFT(BDD!BO68,3)","v":""},{"$f":"LEFT(BDD!BP68,3)","v":""},{"$f":"LEFT(BDD!BQ69,3)","v":""},{"$f":"LEFT(BDD!BR69,3)","v":""},{"$f":"LEFT(BDD!BS69,3)","v":""},{"$f":"LEFT(BDD!BT69,3)","v":""},{"$f":"LEFT(BDD!BU69,3)","v":""},{"$f":"LEFT(BDD!BV69,3)","v":""},{"$f":"LEFT(BDD!BW69,3)","v":""},{"$f":"LEFT(BDD!BX69,3)","v":""},{"$f":"LEFT(BDD!BY69,3)","v":""},{"$f":"LEFT(BDD!BZ69,3)","v":""},{"$f":"LEFT(BDD!CA69,3)","v":""},{"$f":"LEFT(BDD!CB69,3)","v":""},{"$f":"LEFT(BDD!CC69,3)","v":""},{"$f":"LEFT(BDD!CD69,3)","v":""},{"$f":"LEFT(BDD!CE69,3)","v":""}]
[{"$f":"LEFT(BDD!A71,3)","v":""},{"$f":"BDD!B71","v":0},{"$f":"LEFT(BDD!C69,3)","v":""},{"$f":"LEFT(BDD!D69,3)","v":""},{"$f":"LEFT(BDD!E69,3)","v":""},{"$f":"LEFT(BDD!F69,3)","v":""},{"$f":"LEFT(BDD!G69,3)","v":""},{"$f":"LEFT(BDD!H69,3)","v":""},{"$f":"LEFT(BDD!J69,3)","v":""},{"$f":"LEFT(BDD!K69,3)","v":""},{"$f":"LEFT(BDD!M69,3)","v":""},{"$f":"LEFT(BDD!O69,3)","v":""},{"$f":"LEFT(BDD!P69,3)","v":""},{"$f":"LEFT(BDD!R69,3)","v":""},{"$f":"LEFT(BDD!S69,3)","v":""},{"$f":"LEFT(BDD!T69,3)","v":""},{"$f":"LEFT(BDD!U69,3)","v":""},{"$f":"LEFT(BDD!V69,3)","v":""},{"$f":"LEFT(BDD!W69,3)","v":""},{"$f":"LEFT(BDD!X69,3)","v":""},{"$f":"LEFT(BDD!Y69,3)","v":""},{"$f":"LEFT(BDD!Z69,3)","v":""},{"$f":"LEFT(BDD!AA69,3)","v":""},{"$f":"LEFT(BDD!AB69,3)","v":""},{"$f":"LEFT(BDD!AC69,3)","v":""},{"$f":"LEFT(BDD!AD70,3)","v":""},{"$f":"LEFT(BDD!AE69,3)","v":""},{"$f":"LEFT(BDD!AF69,3)","v":""},{"$f":"LEFT(BDD!AG69,3)","v":""},{"$f":"LEFT(BDD!AI69,3)","v":""},{"$f":"LEFT(BDD!AJ69,3)","v":""},{"$f":"LEFT(BDD!AK69,3)","v":""},{"$f":"LEFT(BDD!AL69,3)","v":""},{"$f":"LEFT(BDD!AM69,3)","v":""},{"$f":"LEFT(BDD!AN69,3)","v":""},{"$f":"LEFT(BDD!AP69,3)","v":""},{"$f":"LEFT(BDD!AQ69,3)","v":""},{"$f":"LEFT(BDD!AR69,3)","v":""},{"$f":"LEFT(BDD!AS69,3)","v":""},{"$f":"LEFT(BDD!AT69,3)","v":""},{"$f":"LEFT(BDD!AU69,3)","v":""},{"$f":"LEFT(BDD!AV69,3)","v":""},{"$f":"LEFT(BDD!AW69,3)","v":""},{"$f":"LEFT(BDD!AX70,3)","v":""},{"$f":"LEFT(BDD!AY69,3)","v":""},{"$f":"LEFT(BDD!AZ69,3)","v":""},{"$f":"LEFT(BDD!BA69,3)","v":""},{"$f":"LEFT(BDD!BB69,3)","v":""},{"$f":"LEFT(BDD!BC69,3)","v":""},{"$f":"LEFT(BDD!BD69,3)","v":""},{"$f":"LEFT(BDD!BE69,3)","v":""},{"$f":"LEFT(BDD!BF69,3)","v":""},{"$f":"LEFT(BDD!BG69,3)","v":""},{"$f":"LEFT(BDD!BH69,3)","v":""},{"$f":"LEFT(BDD!BI69,3)","v":""},{"$f":"LEFT(BDD!BJ69,3)","v":""},{"$f":"LEFT(BDD!BK69,3)","v":""},{"$f":"LEFT(BDD!#REF!,3)","v":{"$error":"#REF!"}},{"$f":"LEFT(BDD!BL69,3)","v":""},{"$f":"LEFT(BDD!BM69,3)","v":""},{"$f":"LEFT(BDD!BN69,3)","v":""},{"$f":"LEFT(BDD!BO69,3)","v":""},{"$f":"LEFT(BDD!BP69,3)","v":""},{"$f":"LEFT(BDD!BQ70,3)","v":""},{"$f":"LEFT(BDD!BR70,3)","v":""},{"$f":"LEFT(BDD!BS70,3)","v":""},{"$f":"LEFT(BDD!BT70,3)","v":""},{"$f":"LEFT(BDD!BU70,3)","v":""},{"$f":"LEFT(BDD!BV70,3)","v":""},{"$f":"LEFT(BDD!BW70,3)","v":""},{"$f":"LEFT(BDD!BX70,3)","v":""},{"$f":"LEFT(BDD!BY70,3)","v":""},{"$f":"LEFT(BDD!BZ70,3)","v":""},{"$f":"LEFT(BDD!CA70,3)","v":""},{"$f":"LEFT(BDD!CB70,3)","v":""},{"$f":"LEFT(BDD!CC70,3)","v":""},{"$f":"LEFT(BDD!CD70,3)","v":""},{"$f":"LEFT(BDD!CE70,3)","v":""}]
[{"$f":"LEFT(BDD!A72,3)","v":""},{"$f":"BDD!B72","v":0},{"$f":"LEFT(BDD!C70,3)","v":""},{"$f":"LEFT(BDD!D70,3)","v":""},{"$f":"LEFT(BDD!E70,3)","v":""},{"$f":"LEFT(BDD!F70,3)","v":""},{"$f":"LEFT(BDD!G70,3)","v":""},{"$f":"LEFT(BDD!H70,3)","v":""},{"$f":"LEFT(BDD!J70,3)","v":""},{"$f":"LEFT(BDD!K70,3)","v":""},{"$f":"LEFT(BDD!M70,3)","v":""},{"$f":"LEFT(BDD!O70,3)","v":""},{"$f":"LEFT(BDD!P70,3)","v":""},{"$f":"LEFT(BDD!R70,3)","v":""},{"$f":"LEFT(BDD!S70,3)","v":""},{"$f":"LEFT(BDD!T70,3)","v":""},{"$f":"LEFT(BDD!U70,3)","v":""},{"$f":"LEFT(BDD!V70,3)","v":""},{"$f":"LEFT(BDD!W70,3)","v":""},{"$f":"LEFT(BDD!X70,3)","v":""},{"$f":"LEFT(BDD!Y70,3)","v":""},{"$f":"LEFT(BDD!Z70,3)","v":""},{"$f":"LEFT(BDD!AA70,3)","v":""},{"$f":"LEFT(BDD!AB70,3)","v":""},{"$f":"LEFT(BDD!AC70,3)","v":""},{"$f":"LEFT(BDD!AD71,3)","v":""},{"$f":"LEFT(BDD!AE70,3)","v":""},{"$f":"LEFT(BDD!AF70,3)","v":""},{"$f":"LEFT(BDD!AG70,3)","v":""},{"$f":"LEFT(BDD!AI70,3)","v":""},{"$f":"LEFT(BDD!AJ70,3)","v":""},{"$f":"LEFT(BDD!AK70,3)","v":""},{"$f":"LEFT(BDD!AL70,3)","v":""},{"$f":"LEFT(BDD!AM70,3)","v":""},{"$f":"LEFT(BDD!AN70,3)","v":""},{"$f":"LEFT(BDD!AP70,3)","v":""},{"$f":"LEFT(BDD!AQ70,3)","v":""},{"$f":"LEFT(BDD!AR70,3)","v":""},{"$f":"LEFT(BDD!AS70,3)","v":""},{"$f":"LEFT(BDD!AT70,3)","v":""},{"$f":"LEFT(BDD!AU70,3)","v":""},{"$f":"LEFT(BDD!AV70,3)","v":""},{"$f":"LEFT(BDD!AW70,3)","v":""},{"$f":"LEFT(BDD!AX71,3)","v":""},{"$f":"LEFT(BDD!AY70,3)","v":""},{"$f":"LEFT(BDD!AZ70,3)","v":""},{"$f":"LEFT(BDD!BA70,3)","v":""},{"$f":"LEFT(BDD!BB70,3)","v":""},{"$f":"LEFT(BDD!BC70,3)","v":""},{"$f":"LEFT(BDD!BD70,3)","v":""},{"$f":"LEFT(BDD!BE70,3)","v":""},{"$f":"LEFT(BDD!BF70,3)","v":""},{"$f":"LEFT(BDD!BG70,3)","v":""},{"$f":"LEFT(BDD!BH70,3)","v":""},{"$f":"LEFT(BDD!BI70,3)","v":""},{"$f":"LEFT(BDD!BJ70,3)","v":""},{"$f":"LEFT(BDD!BK70,3)","v":""},{"$f":"LEFT(BDD!#REF!,3)","v":{"$error":"#REF!"}},{"$f":"LEFT(BDD!BL70,3)","v":""},{"$f":"LEFT(BDD!BM70,3)","v":""},{"$f":"LEFT(BDD!BN70,3)","v":""},{"$f":"LEFT(BDD!BO70,3)","v":""},{"$f":"LEFT(BDD!BP70,3)","v":""},{"$f":"LEFT(BDD!BQ71,3)","v":""},{"$f":"LEFT(BDD!BR71,3)","v":""},{"$f":"LEFT(BDD!BS71,3)","v":""},{"$f":"LEFT(BDD!BT71,3)","v":""},{"$f":"LEFT(BDD!BU71,3)","v":""},{"$f":"LEFT(BDD!BV71,3)","v":""},{"$f":"LEFT(BDD!BW71,3)","v":""},{"$f":"LEFT(BDD!BX71,3)","v":""},{"$f":"LEFT(BDD!BY71,3)","v":""},{"$f":"LEFT(BDD!BZ71,3)","v":""},{"$f":"LEFT(BDD!CA71,3)","v":""},{"$f":"LEFT(BDD!CB71,3)","v":""},{"$f":"LEFT(BDD!CC71,3)","v":""},{"$f":"LEFT(BDD!CD71,3)","v":""},{"$f":"LEFT(BDD!CE71,3)","v":""}]
[{"$f":"LEFT(BDD!A73,3)","v":""},{"$f":"BDD!B73","v":0},{"$f":"LEFT(BDD!C71,3)","v":""},{"$f":"LEFT(BDD!D71,3)","v":""},{"$f":"LEFT(BDD!E71,3)","v":""},{"$f":"LEFT(BDD!F71,3)","v":""},{"$f":"LEFT(BDD!G71,3)","v":""},{"$f":"LEFT(BDD!H71,3)","v":""},{"$f":"LEFT(BDD!J71,3)","v":""},{"$f":"LEFT(BDD!K71,3)","v":""},{"$f":"LEFT(BDD!M71,3)","v":""},{"$f":"LEFT(BDD!O71,3)","v":""},{"$f":"LEFT(BDD!P71,3)","v":""},{"$f":"LEFT(BDD!R71,3)","v":""},{"$f":"LEFT(BDD!S71,3)","v":""},{"$f":"LEFT(BDD!T71,3)","v":""},{"$f":"LEFT(BDD!U71,3)","v":""},{"$f":"LEFT(BDD!V71,3)","v":""},{"$f":"LEFT(BDD!W71,3)","v":""},{"$f":"LEFT(BDD!X71,3)","v":""},{"$f":"LEFT(BDD!Y71,3)","v":""},{"$f":"LEFT(BDD!Z71,3)","v":""},{"$f":"LEFT(BDD!AA71,3)","v":""},{"$f":"LEFT(BDD!AB71,3)","v":""},{"$f":"LEFT(BDD!AC71,3)","v":""},{"$f":"LEFT(BDD!AD72,3)","v":""},{"$f":"LEFT(BDD!AE71,3)","v":""},{"$f":"LEFT(BDD!AF71,3)","v":""},{"$f":"LEFT(BDD!AG71,3)","v":""},{"$f":"LEFT(BDD!AI71,3)","v":""},{"$f":"LEFT(BDD!AJ71,3)","v":""},{"$f":"LEFT(BDD!AK71,3)","v":""},{"$f":"LEFT(BDD!AL71,3)","v":""},{"$f":"LEFT(BDD!AM71,3)","v":""},{"$f":"LEFT(BDD!AN71,3)","v":""},{"$f":"LEFT(BDD!AP71,3)","v":""},{"$f":"LEFT(BDD!AQ71,3)","v":""},{"$f":"LEFT(BDD!AR71,3)","v":""},{"$f":"LEFT(BDD!AS71,3)","v":""},{"$f":"LEFT(BDD!AT71,3)","v":""},{"$f":"LEFT(BDD!AU71,3)","v":""},{"$f":"LEFT(BDD!AV71,3)","v":""},{"$f":"LEFT(BDD!AW71,3)","v":""},{"$f":"LEFT(BDD!AX72,3)","v":""},{"$f":"LEFT(BDD!AY71,3)","v":""},{"$f":"LEFT(BDD!AZ71,3)","v":""},{"$f":"LEFT(BDD!BA71,3)","v":""},{"$f":"LEFT(BDD!BB71,3)","v":""},{"$f":"LEFT(BDD!BC71,3)","v":""},{"$f":"LEFT(BDD!BD71,3)","v":""},{"$f":"LEFT(BDD!BE71,3)","v":""},{"$f":"LEFT(BDD!BF71,3)","v":""},{"$f":"LEFT(BDD!BG71,3)","v":""},{"$f":"LEFT(BDD!BH71,3)","v":""},{"$f":"LEFT(BDD!BI71,3)","v":""},{"$f":"LEFT(BDD!BJ71,3)","v":""},{"$f":"LEFT(BDD!BK71,3)","v":""},{"$f":"LEFT(BDD!#REF!,3)","v":{"$error":"#REF!"}},{"$f":"LEFT(BDD!BL71,3)","v":""},{"$f":"LEFT(BDD!BM71,3)","v":""},{"$f":"LEFT(BDD!BN71,3)","v":""},{"$f":"LEFT(BDD!BO71,3)","v":""},{"$f":"LEFT(BDD!BP71,3)","v":""},{"$f":"LEFT(BDD!BQ72,3)","v":""},{"$f":"LEFT(BDD!BR72,3)","v":""},{"$f":"LEFT(BDD!BS72,3)","v":""},{"$f":"LEFT(BDD!BT72,3)","v":""},{"$f":"LEFT(BDD!BU72,3)","v":""},{"$f":"LEFT(BDD!BV72,3)","v":""},{"$f":"LEFT(BDD!BW72,3)","v":""},{"$f":"LEFT(BDD!BX72,3)","v":""},{"$f":"LEFT(BDD!BY72,3)","v":""},{"$f":"LEFT(BDD!BZ72,3)","v":""},{"$f":"LEFT(BDD!CA72,3)","v":""},{"$f":"LEFT(BDD!CB72,3)","v":""},{"$f":"LEFT(BDD!CC72,3)","v":""},{"$f":"LEFT(BDD!CD72,3)","v":""},{"$f":"LEFT(BDD!CE72,3)","v":""}]
[{"$f":"LEFT(BDD!A74,3)","v":""},{"$f":"BDD!B74","v":0},{"$f":"LEFT(BDD!C72,3)","v":""},{"$f":"LEFT(BDD!D72,3)","v":""},{"$f":"LEFT(BDD!E72,3)","v":""},{"$f":"LEFT(BDD!F72,3)","v":""},{"$f":"LEFT(BDD!G72,3)","v":""},{"$f":"LEFT(BDD!H72,3)","v":""},{"$f":"LEFT(BDD!J72,3)","v":""},{"$f":"LEFT(BDD!K72,3)","v":""},{"$f":"LEFT(BDD!M72,3)","v":""},{"$f":"LEFT(BDD!O72,3)","v":""},{"$f":"LEFT(BDD!P72,3)","v":""},{"$f":"LEFT(BDD!R72,3)","v":""},{"$f":"LEFT(BDD!S72,3)","v":""},{"$f":"LEFT(BDD!T72,3)","v":""},{"$f":"LEFT(BDD!U72,3)","v":""},{"$f":"LEFT(BDD!V72,3)","v":""},{"$f":"LEFT(BDD!W72,3)","v":""},{"$f":"LEFT(BDD!X72,3)","v":""},{"$f":"LEFT(BDD!Y72,3)","v":""},{"$f":"LEFT(BDD!Z72,3)","v":""},{"$f":"LEFT(BDD!AA72,3)","v":""},{"$f":"LEFT(BDD!AB72,3)","v":""},{"$f":"LEFT(BDD!AC72,3)","v":""},{"$f":"LEFT(BDD!AD73,3)","v":""},{"$f":"LEFT(BDD!AE72,3)","v":""},{"$f":"LEFT(BDD!AF72,3)","v":""},{"$f":"LEFT(BDD!AG72,3)","v":""},{"$f":"LEFT(BDD!AI72,3)","v":""},{"$f":"LEFT(BDD!AJ72,3)","v":""},{"$f":"LEFT(BDD!AK72,3)","v":""},{"$f":"LEFT(BDD!AL72,3)","v":""},{"$f":"LEFT(BDD!AM72,3)","v":""},{"$f":"LEFT(BDD!AN72,3)","v":""},{"$f":"LEFT(BDD!AP72,3)","v":""},{"$f":"LEFT(BDD!AQ72,3)","v":""},{"$f":"LEFT(BDD!AR72,3)","v":""},{"$f":"LEFT(BDD!AS72,3)","v":""},{"$f":"LEFT(BDD!AT72,3)","v":""},{"$f":"LEFT(BDD!AU72,3)","v":""},{"$f":"LEFT(BDD!AV72,3)","v":""},{"$f":"LEFT(BDD!AW72,3)","v":""},{"$f":"LEFT(BDD!AX73,3)","v":""},{"$f":"LEFT(BDD!AY72,3)","v":""},{"$f":"LEFT(BDD!AZ72,3)","v":""},{"$f":"LEFT(BDD!BA72,3)","v":""},{"$f":"LEFT(BDD!BB72,3)","v":""},{"$f":"LEFT(BDD!BC72,3)","v":""},{"$f":"LEFT(BDD!BD72,3)","v":""},{"$f":"LEFT(BDD!BE72,3)","v":""},{"$f":"LEFT(BDD!BF72,3)","v":""},{"$f":"LEFT(BDD!BG72,3)","v":""},{"$f":"LEFT(BDD!BH72,3)","v":""},{"$f":"LEFT(BDD!BI72,3)","v":""},{"$f":"LEFT(BDD!BJ72,3)","v":""},{"$f":"LEFT(BDD!BK72,3)","v":""},{"$f":"LEFT(BDD!#REF!,3)","v":{"$error":"#REF!"}},{"$f":"LEFT(BDD!BL72,3)","v":""},{"$f":"LEFT(BDD!BM72,3)","v":""},{"$f":"LEFT(BDD!BN72,3)","v":""},{"$f":"LEFT(BDD!BO72,3)","v":""},{"$f":"LEFT(BDD!BP72,3)","v":""},{"$f":"LEFT(BDD!BQ73,3)","v":""},{"$f":"LEFT(BDD!BR73,3)","v":""},{"$f":"LEFT(BDD!BS73,3)","v":""},{"$f":"LEFT(BDD!BT73,3)","v":""},{"$f":"LEFT(BDD!BU73,3)","v":""},{"$f":"LEFT(BDD!BV73,3)","v":""},{"$f":"LEFT(BDD!BW73,3)","v":""},{"$f":"LEFT(BDD!BX73,3)","v":""},{"$f":"LEFT(BDD!BY73,3)","v":""},{"$f":"LEFT(BDD!BZ73,3)","v":""},{"$f":"LEFT(BDD!CA73,3)","v":""},{"$f":"LEFT(BDD!CB73,3)","v":""},{"$f":"LEFT(BDD!CC73,3)","v":""},{"$f":"LEFT(BDD!CD73,3)","v":""},{"$f":"LEFT(BDD!CE73,3)","v":""}]
[{"$f":"LEFT(BDD!A75,3)","v":""},{"$f":"BDD!B75","v":0},{"$f":"LEFT(BDD!C73,3)","v":""},{"$f":"LEFT(BDD!D73,3)","v":""},{"$f":"LEFT(BDD!E73,3)","v":""},{"$f":"LEFT(BDD!F73,3)","v":""},{"$f":"LEFT(BDD!G73,3)","v":""},{"$f":"LEFT(BDD!H73,3)","v":""},{"$f":"LEFT(BDD!J73,3)","v":""},{"$f":"LEFT(BDD!K73,3)","v":""},{"$f":"LEFT(BDD!M73,3)","v":""},{"$f":"LEFT(BDD!O73,3)","v":""},{"$f":"LEFT(BDD!P73,3)","v":""},{"$f":"LEFT(BDD!R73,3)","v":""},{"$f":"LEFT(BDD!S73,3)","v":""},{"$f":"LEFT(BDD!T73,3)","v":""},{"$f":"LEFT(BDD!U73,3)","v":""},{"$f":"LEFT(BDD!V73,3)","v":""},{"$f":"LEFT(BDD!W73,3)","v":""},{"$f":"LEFT(BDD!X73,3)","v":""},{"$f":"LEFT(BDD!Y73,3)","v":""},{"$f":"LEFT(BDD!Z73,3)","v":""},{"$f":"LEFT(BDD!AA73,3)","v":""},{"$f":"LEFT(BDD!AB74,3)","v":""},{"$f":"LEFT(BDD!AC73,3)","v":""},{"$f":"LEFT(BDD!AD74,3)","v":""},{"$f":"LEFT(BDD!AE73,3)","v":""},{"$f":"LEFT(BDD!AF73,3)","v":""},{"$f":"LEFT(BDD!AG73,3)","v":""},{"$f":"LEFT(BDD!AI73,3)","v":""},{"$f":"LEFT(BDD!AJ73,3)","v":""},{"$f":"LEFT(BDD!AK73,3)","v":""},{"$f":"LEFT(BDD!AL73,3)","v":""},{"$f":"LEFT(BDD!AM73,3)","v":""},{"$f":"LEFT(BDD!AN73,3)","v":""},{"$f":"LEFT(BDD!AP73,3)","v":""},{"$f":"LEFT(BDD!AQ73,3)","v":""},{"$f":"LEFT(BDD!AR73,3)","v":""},{"$f":"LEFT(BDD!AS73,3)","v":""},{"$f":"LEFT(BDD!AT73,3)","v":""},{"$f":"LEFT(BDD!AU73,3)","v":""},{"$f":"LEFT(BDD!AV73,3)","v":""},{"$f":"LEFT(BDD!AW73,3)","v":""},{"$f":"LEFT(BDD!AX74,3)","v":""},{"$f":"LEFT(BDD!AY73,3)","v":""},{"$f":"LEFT(BDD!AZ73,3)","v":""},{"$f":"LEFT(BDD!BA73,3)","v":""},{"$f":"LEFT(BDD!BB73,3)","v":""},{"$f":"LEFT(BDD!BC73,3)","v":""},{"$f":"LEFT(BDD!BD73,3)","v":""},{"$f":"LEFT(BDD!BE73,3)","v":""},{"$f":"LEFT(BDD!BF73,3)","v":""},{"$f":"LEFT(BDD!BG73,3)","v":""},{"$f":"LEFT(BDD!BH73,3)","v":""},{"$f":"LEFT(BDD!BI73,3)","v":""},{"$f":"LEFT(BDD!BJ73,3)","v":""},{"$f":"LEFT(BDD!BK73,3)","v":""},{"$f":"LEFT(BDD!#REF!,3)","v":{"$error":"#REF!"}},{"$f":"LEFT(BDD!BL73,3)","v":""},{"$f":"LEFT(BDD!BM73,3)","v":""},{"$f":"LEFT(BDD!BN73,3)","v":""},{"$f":"LEFT(BDD!BO73,3)","v":""},{"$f":"LEFT(BDD!BP73,3)","v":""},{"$f":"LEFT(BDD!BQ74,3)","v":""},{"$f":"LEFT(BDD!BR74,3)","v":""},{"$f":"LEFT(BDD!BS74,3)","v":""},{"$f":"LEFT(BDD!BT74,3)","v":""},{"$f":"LEFT(BDD!BU74,3)","v":""},{"$f":"LEFT(BDD!BV74,3)","v":""},{"$f":"LEFT(BDD!BW74,3)","v":""},{"$f":"LEFT(BDD!BX74,3)","v":""},{"$f":"LEFT(BDD!BY74,3)","v":""},{"$f":"LEFT(BDD!BZ74,3)","v":""},{"$f":"LEFT(BDD!CA74,3)","v":""},{"$f":"LEFT(BDD!CB74,3)","v":""},{"$f":"LEFT(BDD!CC74,3)","v":""},{"$f":"LEFT(BDD!CD74,3)","v":""},{"$f":"LEFT(BDD!CE74,3)","v":""}]
[{"$f":"LEFT(BDD!A76,3)","v":""},{"$f":"BDD!B76","v":0},{"$f":"LEFT(BDD!C74,3)","v":""},{"$f":"LEFT(BDD!D74,3)","v":""},{"$f":"LEFT(BDD!E74,3)","v":""},{"$f":"LEFT(BDD!F74,3)","v":""},{"$f":"LEFT(BDD!G74,3)","v":""},{"$f":"LEFT(BDD!H74,3)","v":""},{"$f":"LEFT(BDD!J74,3)","v":""},{"$f":"LEFT(BDD!K74,3)","v":""},{"$f":"LEFT(BDD!M74,3)","v":""},{"$f":"LEFT(BDD!O74,3)","v":""},{"$f":"LEFT(BDD!P74,3)","v":""},{"$f":"LEFT(BDD!R74,3)","v":""},{"$f":"LEFT(BDD!S74,3)","v":""},{"$f":"LEFT(BDD!T74,3)","v":""},{"$f":"LEFT(BDD!U74,3)","v":""},{"$f":"LEFT(BDD!V74,3)","v":""},{"$f":"LEFT(BDD!W74,3)","v":""},{"$f":"LEFT(BDD!X74,3)","v":""},{"$f":"LEFT(BDD!Y74,3)","v":""},{"$f":"LEFT(BDD!Z74,3)","v":""},{"$f":"LEFT(BDD!AA74,3)","v":""},{"$f":"LEFT(BDD!AB75,3)","v":""},{"$f":"LEFT(BDD!AC74,3)","v":""},{"$f":"LEFT(BDD!AD75,3)","v":""},{"$f":"LEFT(BDD!AE74,3)","v":""},{"$f":"LEFT(BDD!AF74,3)","v":""},{"$f":"LEFT(BDD!AG74,3)","v":""},{"$f":"LEFT(BDD!AI74,3)","v":""},{"$f":"LEFT(BDD!AJ74,3)","v":""},{"$f":"LEFT(BDD!AK74,3)","v":""},{"$f":"LEFT(BDD!AL74,3)","v":""},{"$f":"LEFT(BDD!AM74,3)","v":""},{"$f":"LEFT(BDD!AN74,3)","v":""},{"$f":"LEFT(BDD!AP74,3)","v":""},{"$f":"LEFT(BDD!AQ74,3)","v":""},{"$f":"LEFT(BDD!AR74,3)","v":""},{"$f":"LEFT(BDD!AS74,3)","v":""},{"$f":"LEFT(BDD!AT74,3)","v":""},{"$f":"LEFT(BDD!AU74,3)","v":""},{"$f":"LEFT(BDD!AV74,3)","v":""},{"$f":"LEFT(BDD!AW74,3)","v":""},{"$f":"LEFT(BDD!AX75,3)","v":""},{"$f":"LEFT(BDD!AY74,3)","v":""},{"$f":"LEFT(BDD!AZ74,3)","v":""},{"$f":"LEFT(BDD!BA74,3)","v":""},{"$f":"LEFT(BDD!BB74,3)","v":""},{"$f":"LEFT(BDD!BC74,3)","v":""},{"$f":"LEFT(BDD!BD74,3)","v":""},{"$f":"LEFT(BDD!BE74,3)","v":""},{"$f":"LEFT(BDD!BF74,3)","v":""},{"$f":"LEFT(BDD!BG74,3)","v":""},{"$f":"LEFT(BDD!BH74,3)","v":""},{"$f":"LEFT(BDD!BI74,3)","v":""},{"$f":"LEFT(BDD!BJ74,3)","v":""},{"$f":"LEFT(BDD!BK74,3)","v":""},{"$f":"LEFT(BDD!#REF!,3)","v":{"$error":"#REF!"}},{"$f":"LEFT(BDD!BL74,3)","v":""},{"$f":"LEFT(BDD!BM74,3)","v":""},{"$f":"LEFT(BDD!BN74,3)","v":""},{"$f":"LEFT(BDD!BO74,3)","v":""},{"$f":"LEFT(BDD!BP74,3)","v":""},{"$f":"LEFT(BDD!BQ75,3)","v":""},{"$f":"LEFT(BDD!BR75,3)","v":""},{"$f":"LEFT(BDD!BS75,3)","v":""},{"$f":"LEFT(BDD!BT75,3)","v":""},{"$f":"LEFT(BDD!BU75,3)","v":""},{"$f":"LEFT(BDD!BV75,3)","v":""},{"$f":"LEFT(BDD!BW75,3)","v":""},{"$f":"LEFT(BDD!BX75,3)","v":""},{"$f":"LEFT(BDD!BY75,3)","v":""},{"$f":"LEFT(BDD!BZ75,3)","v":""},{"$f":"LEFT(BDD!CA75,3)","v":""},{"$f":"LEFT(BDD!CB75,3)","v":""},{"$f":"LEFT(BDD!CC75,3)","v":""},{"$f":"LEFT(BDD!CD75,3)","v":""},{"$f":"LEFT(BDD!CE75,3)","v":""}]
[{"$f":"LEFT(BDD!A77,3)","v":""},{"$f":"BDD!B77","v":0},{"$f":"LEFT(BDD!C75,3)","v":""},{"$f":"LEFT(BDD!D75,3)","v":""},{"$f":"LEFT(BDD!E75,3)","v":""},{"$f":"LEFT(BDD!F75,3)","v":""},{"$f":"LEFT(BDD!G75,3)","v":""},{"$f":"LEFT(BDD!H75,3)","v":""},{"$f":"LEFT(BDD!J75,3)","v":""},{"$f":"LEFT(BDD!K75,3)","v":""},{"$f":"LEFT(BDD!M75,3)","v":""},{"$f":"LEFT(BDD!O75,3)","v":""},{"$f":"LEFT(BDD!P75,3)","v":""},{"$f":"LEFT(BDD!R75,3)","v":""},{"$f":"LEFT(BDD!S75,3)","v":""},{"$f":"LEFT(BDD!T75,3)","v":""},{"$f":"LEFT(BDD!U75,3)","v":""},{"$f":"LEFT(BDD!V75,3)","v":""},{"$f":"LEFT(BDD!W75,3)","v":""},{"$f":"LEFT(BDD!X75,3)","v":""},{"$f":"LEFT(BDD!Y75,3)","v":""},{"$f":"LEFT(BDD!Z75,3)","v":""},{"$f":"LEFT(BDD!AA75,3)","v":""},{"$f":"LEFT(BDD!AB76,3)","v":""},{"$f":"LEFT(BDD!AC75,3)","v":""},{"$f":"LEFT(BDD!AD76,3)","v":""},{"$f":"LEFT(BDD!AE75,3)","v":""},{"$f":"LEFT(BDD!AF75,3)","v":""},{"$f":"LEFT(BDD!AG75,3)","v":""},{"$f":"LEFT(BDD!AI75,3)","v":""},{"$f":"LEFT(BDD!AJ75,3)","v":""},{"$f":"LEFT(BDD!AK75,3)","v":""},{"$f":"LEFT(BDD!AL75,3)","v":""},{"$f":"LEFT(BDD!AM75,3)","v":""},{"$f":"LEFT(BDD!AN75,3)","v":""},{"$f":"LEFT(BDD!AP75,3)","v":""},{"$f":"LEFT(BDD!AQ75,3)","v":""},{"$f":"LEFT(BDD!AR75,3)","v":""},{"$f":"LEFT(BDD!AS75,3)","v":""},{"$f":"LEFT(BDD!AT75,3)","v":""},{"$f":"LEFT(BDD!AU75,3)","v":""},{"$f":"LEFT(BDD!AV75,3)","v":""},{"$f":"LEFT(BDD!AW75,3)","v":""},{"$f":"LEFT(BDD!AX76,3)","v":""},{"$f":"LEFT(BDD!AY75,3)","v":""},{"$f":"LEFT(BDD!AZ75,3)","v":""},{"$f":"LEFT(BDD!BA75,3)","v":""},{"$f":"LEFT(BDD!BB75,3)","v":""},{"$f":"LEFT(BDD!BC75,3)","v":""},{"$f":"LEFT(BDD!BD75,3)","v":""},{"$f":"LEFT(BDD!BE75,3)","v":""},{"$f":"LEFT(BDD!BF75,3)","v":""},{"$f":"LEFT(BDD!BG75,3)","v":""},{"$f":"LEFT(BDD!BH75,3)","v":""},{"$f":"LEFT(BDD!BI75,3)","v":""},{"$f":"LEFT(BDD!BJ75,3)","v":""},{"$f":"LEFT(BDD!BK75,3)","v":""},{"$f":"LEFT(BDD!#REF!,3)","v":{"$error":"#REF!"}},{"$f":"LEFT(BDD!BL75,3)","v":""},{"$f":"LEFT(BDD!BM75,3)","v":""},{"$f":"LEFT(BDD!BN75,3)","v":""},{"$f":"LEFT(BDD!BO75,3)","v":""},{"$f":"LEFT(BDD!BP75,3)","v":""},{"$f":"LEFT(BDD!BQ76,3)","v":""},{"$f":"LEFT(BDD!BR76,3)","v":""},{"$f":"LEFT(BDD!BS76,3)","v":""},{"$f":"LEFT(BDD!BT76,3)","v":""},{"$f":"LEFT(BDD!BU76,3)","v":""},{"$f":"LEFT(BDD!BV76,3)","v":""},{"$f":"LEFT(BDD!BW76,3)","v":""},{"$f":"LEFT(BDD!BX76,3)","v":""},{"$f":"LEFT(BDD!BY76,3)","v":""},{"$f":"LEFT(BDD!BZ76,3)","v":""},{"$f":"LEFT(BDD!CA76,3)","v":""},{"$f":"LEFT(BDD!CB76,3)","v":""},{"$f":"LEFT(BDD!CC76,3)","v":""},{"$f":"LEFT(BDD!CD76,3)","v":""},{"$f":"LEFT(BDD!CE76,3)","v":""}]
[{"$f":"LEFT(BDD!A78,3)","v":""},{"$f":"BDD!B78","v":0},{"$f":"LEFT(BDD!C76,3)","v":""},{"$f":"LEFT(BDD!D76,3)","v":""},{"$f":"LEFT(BDD!E76,3)","v":""},{"$f":"LEFT(BDD!F76,3)","v":""},{"$f":"LEFT(BDD!G76,3)","v":""},{"$f":"LEFT(BDD!H76,3)","v":""},{"$f":"LEFT(BDD!J76,3)","v":""},{"$f":"LEFT(BDD!K76,3)","v":""},{"$f":"LEFT(BDD!M76,3)","v":""},{"$f":"LEFT(BDD!O76,3)","v":""},{"$f":"LEFT(BDD!P76,3)","v":""},{"$f":"LEFT(BDD!R76,3)","v":""},{"$f":"LEFT(BDD!S76,3)","v":""},{"$f":"LEFT(BDD!T76,3)","v":""},{"$f":"LEFT(BDD!U76,3)","v":""},{"$f":"LEFT(BDD!V76,3)","v":""},{"$f":"LEFT(BDD!W76,3)","v":""},{"$f":"LEFT(BDD!X76,3)","v":""},{"$f":"LEFT(BDD!Y76,3)","v":""},{"$f":"LEFT(BDD!Z76,3)","v":""},{"$f":"LEFT(BDD!AA76,3)","v":""},{"$f":"LEFT(BDD!AB77,3)","v":""},{"$f":"LEFT(BDD!AC76,3)","v":""},{"$f":"LEFT(BDD!AD77,3)","v":""},{"$f":"LEFT(BDD!AE76,3)","v":""},{"$f":"LEFT(BDD!AF76,3)","v":""},{"$f":"LEFT(BDD!AG76,3)","v":""},{"$f":"LEFT(BDD!AI76,3)","v":""},{"$f":"LEFT(BDD!AJ76,3)","v":""},{"$f":"LEFT(BDD!AK76,3)","v":""},{"$f":"LEFT(BDD!AL76,3)","v":""},{"$f":"LEFT(BDD!AM76,3)","v":""},{"$f":"LEFT(BDD!AN76,3)","v":""},{"$f":"LEFT(BDD!AP76,3)","v":""},{"$f":"LEFT(BDD!AQ76,3)","v":""},{"$f":"LEFT(BDD!AR76,3)","v":""},{"$f":"LEFT(BDD!AS76,3)","v":""},{"$f":"LEFT(BDD!AT76,3)","v":""},{"$f":"LEFT(BDD!AU76,3)","v":""},{"$f":"LEFT(BDD!AV76,3)","v":""},{"$f":"LEFT(BDD!AW76,3)","v":""},{"$f":"LEFT(BDD!AX77,3)","v":""},{"$f":"LEFT(BDD!AY76,3)","v":""},{"$f":"LEFT(BDD!AZ76,3)","v":""},{"$f":"LEFT(BDD!BA76,3)","v":""},{"$f":"LEFT(BDD!BB76,3)","v":""},{"$f":"LEFT(BDD!BC76,3)","v":""},{"$f":"LEFT(BDD!BD76,3)","v":""},{"$f":"LEFT(BDD!BE76,3)","v":""},{"$f":"LEFT(BDD!BF76,3)","v":""},{"$f":"LEFT(BDD!BG76,3)","v":""},{"$f":"LEFT(BDD!BH76,3)","v":""},{"$f":"LEFT(BDD!BI76,3)","v":""},{"$f":"LEFT(BDD!BJ76,3)","v":""},{"$f":"LEFT(BDD!BK76,3)","v":""},{"$f":"LEFT(BDD!#REF!,3)","v":{"$error":"#REF!"}},{"$f":"LEFT(BDD!BL76,3)","v":""},{"$f":"LEFT(BDD!BM76,3)","v":""},{"$f":"LEFT(BDD!BN76,3)","v":""},{"$f":"LEFT(BDD!BO76,3)","v":""},{"$f":"LEFT(BDD!BP76,3)","v":""},{"$f":"LEFT(BDD!BQ77,3)","v":""},{"$f":"LEFT(BDD!BR77,3)","v":""},{"$f":"LEFT(BDD!BS77,3)","v":""},{"$f":"LEFT(BDD!BT77,3)","v":""},{"$f":"LEFT(BDD!BU77,3)","v":""},{"$f":"LEFT(BDD!BV77,3)","v":""},{"$f":"LEFT(BDD!BW77,3)","v":""},{"$f":"LEFT(BDD!BX77,3)","v":""},{"$f":"LEFT(BDD!BY77,3)","v":""},{"$f":"LEFT(BDD!BZ77,3)","v":""},{"$f":"LEFT(BDD!CA77,3)","v":""},{"$f":"LEFT(BDD!CB77,3)","v":""},{"$f":"LEFT(BDD!CC77,3)","v":""},{"$f":"LEFT(BDD!CD77,3)","v":""},{"$f":"LEFT(BDD!CE77,3)","v":""}]
[{"$f":"LEFT(BDD!A79,3)","v":""},{"$f":"BDD!B79","v":0},{"$f":"LEFT(BDD!C77,3)","v":""},{"$f":"LEFT(BDD!D77,3)","v":""},{"$f":"LEFT(BDD!E77,3)","v":""},{"$f":"LEFT(BDD!F77,3)","v":""},{"$f":"LEFT(BDD!G77,3)","v":""},{"$f":"LEFT(BDD!H77,3)","v":""},{"$f":"LEFT(BDD!J77,3)","v":""},{"$f":"LEFT(BDD!K77,3)","v":""},{"$f":"LEFT(BDD!M77,3)","v":""},{"$f":"LEFT(BDD!O77,3)","v":""},{"$f":"LEFT(BDD!P77,3)","v":""},{"$f":"LEFT(BDD!R77,3)","v":""},{"$f":"LEFT(BDD!S77,3)","v":""},{"$f":"LEFT(BDD!T77,3)","v":""},{"$f":"LEFT(BDD!U77,3)","v":""},{"$f":"LEFT(BDD!V77,3)","v":""},{"$f":"LEFT(BDD!W77,3)","v":""},{"$f":"LEFT(BDD!X77,3)","v":""},{"$f":"LEFT(BDD!Y77,3)","v":""},{"$f":"LEFT(BDD!Z77,3)","v":""},{"$f":"LEFT(BDD!AA77,3)","v":""},{"$f":"LEFT(BDD!AB78,3)","v":""},{"$f":"LEFT(BDD!AC77,3)","v":""},{"$f":"LEFT(BDD!AD78,3)","v":""},{"$f":"LEFT(BDD!AE77,3)","v":""},{"$f":"LEFT(BDD!AF77,3)","v":""},{"$f":"LEFT(BDD!AG77,3)","v":""},{"$f":"LEFT(BDD!AI77,3)","v":""},{"$f":"LEFT(BDD!AJ77,3)","v":""},{"$f":"LEFT(BDD!AK77,3)","v":""},{"$f":"LEFT(BDD!AL77,3)","v":""},{"$f":"LEFT(BDD!AM77,3)","v":""},{"$f":"LEFT(BDD!AN77,3)","v":""},{"$f":"LEFT(BDD!AP77,3)","v":""},{"$f":"LEFT(BDD!AQ77,3)","v":""},{"$f":"LEFT(BDD!AR77,3)","v":""},{"$f":"LEFT(BDD!AS77,3)","v":""},{"$f":"LEFT(BDD!AT77,3)","v":""},{"$f":"LEFT(BDD!AU77,3)","v":""},{"$f":"LEFT(BDD!AV77,3)","v":""},{"$f":"LEFT(BDD!AW77,3)","v":""},{"$f":"LEFT(BDD!AX78,3)","v":""},{"$f":"LEFT(BDD!AY77,3)","v":""},{"$f":"LEFT(BDD!AZ77,3)","v":""},{"$f":"LEFT(BDD!BA77,3)","v":""},{"$f":"LEFT(BDD!BB77,3)","v":""},{"$f":"LEFT(BDD!BC77,3)","v":""},{"$f":"LEFT(BDD!BD77,3)","v":""},{"$f":"LEFT(BDD!BE77,3)","v":""},{"$f":"LEFT(BDD!BF77,3)","v":""},{"$f":"LEFT(BDD!BG77,3)","v":""},{"$f":"LEFT(BDD!BH77,3)","v":""},{"$f":"LEFT(BDD!BI77,3)","v":""},{"$f":"LEFT(BDD!BJ77,3)","v":""},{"$f":"LEFT(BDD!BK77,3)","v":""},{"$f":"LEFT(BDD!#REF!,3)","v":{"$error":"#REF!"}},{"$f":"LEFT(BDD!BL77,3)","v":""},{"$f":"LEFT(BDD!BM77,3)","v":""},{"$f":"LEFT(BDD!BN77,3)","v":""},{"$f":"LEFT(BDD!BO77,3)","v":""},{"$f":"LEFT(BDD!BP77,3)","v":""},{"$f":"LEFT(BDD!BQ78,3)","v":""},{"$f":"LEFT(BDD!BR78,3)","v":""},{"$f":"LEFT(BDD!BS78,3)","v":""},{"$f":"LEFT(BDD!BT78,3)","v":""},{"$f":"LEFT(BDD!BU78,3)","v":""},{"$f":"LEFT(BDD!BV78,3)","v":""},{"$f":"LEFT(BDD!BW78,3)","v":""},{"$f":"LEFT(BDD!BX78,3)","v":""},{"$f":"LEFT(BDD!BY78,3)","v":""},{"$f":"LEFT(BDD!BZ78,3)","v":""},{"$f":"LEFT(BDD!CA78,3)","v":""},{"$f":"LEFT(BDD!CB78,3)","v":""},{"$f":"LEFT(BDD!CC78,3)","v":""},{"$f":"LEFT(BDD!CD78,3)","v":""},{"$f":"LEFT(BDD!CE78,3)","v":""}]
[{"$f":"LEFT(BDD!A80,3)","v":""},{"$f":"BDD!B80","v":0},{"$f":"LEFT(BDD!C78,3)","v":""},{"$f":"LEFT(BDD!D78,3)","v":""},{"$f":"LEFT(BDD!E78,3)","v":""},{"$f":"LEFT(BDD!F78,3)","v":""},{"$f":"LEFT(BDD!G78,3)","v":""},{"$f":"LEFT(BDD!H78,3)","v":""},{"$f":"LEFT(BDD!J78,3)","v":""},{"$f":"LEFT(BDD!K78,3)","v":""},{"$f":"LEFT(BDD!M78,3)","v":""},{"$f":"LEFT(BDD!O78,3)","v":""},{"$f":"LEFT(BDD!P78,3)","v":""},{"$f":"LEFT(BDD!R78,3)","v":""},{"$f":"LEFT(BDD!S78,3)","v":""},{"$f":"LEFT(BDD!T78,3)","v":""},{"$f":"LEFT(BDD!U78,3)","v":""},{"$f":"LEFT(BDD!V78,3)","v":""},{"$f":"LEFT(BDD!W78,3)","v":""},{"$f":"LEFT(BDD!X78,3)","v":""},{"$f":"LEFT(BDD!Y78,3)","v":""},{"$f":"LEFT(BDD!Z78,3)","v":""},{"$f":"LEFT(BDD!AA78,3)","v":""},{"$f":"LEFT(BDD!AB79,3)","v":""},{"$f":"LEFT(BDD!AC78,3)","v":""},{"$f":"LEFT(BDD!AD79,3)","v":""},{"$f":"LEFT(BDD!AE78,3)","v":""},{"$f":"LEFT(BDD!AF78,3)","v":""},{"$f":"LEFT(BDD!AG78,3)","v":""},{"$f":"LEFT(BDD!AI78,3)","v":""},{"$f":"LEFT(BDD!AJ78,3)","v":""},{"$f":"LEFT(BDD!AK78,3)","v":""},{"$f":"LEFT(BDD!AL78,3)","v":""},{"$f":"LEFT(BDD!AM78,3)","v":""},{"$f":"LEFT(BDD!AN78,3)","v":""},{"$f":"LEFT(BDD!AP78,3)","v":""},{"$f":"LEFT(BDD!AQ78,3)","v":""},{"$f":"LEFT(BDD!AR78,3)","v":""},{"$f":"LEFT(BDD!AS78,3)","v":""},{"$f":"LEFT(BDD!AT78,3)","v":""},{"$f":"LEFT(BDD!AU78,3)","v":""},{"$f":"LEFT(BDD!AV78,3)","v":""},{"$f":"LEFT(BDD!AW78,3)","v":""},{"$f":"LEFT(BDD!AX79,3)","v":""},{"$f":"LEFT(BDD!AY78,3)","v":""},{"$f":"LEFT(BDD!AZ78,3)","v":""},{"$f":"LEFT(BDD!BA78,3)","v":""},{"$f":"LEFT(BDD!BB78,3)","v":""},{"$f":"LEFT(BDD!BC78,3)","v":""},{"$f":"LEFT(BDD!BD78,3)","v":""},{"$f":"LEFT(BDD!BE78,3)","v":""},{"$f":"LEFT(BDD!BF78,3)","v":""},{"$f":"LEFT(BDD!BG78,3)","v":""},{"$f":"LEFT(BDD!BH78,3)","v":""},{"$f":"LEFT(BDD!BI78,3)","v":""},{"$f":"LEFT(BDD!BJ78,3)","v":""},{"$f":"LEFT(BDD!BK78,3)","v":""},{"$f":"LEFT(BDD!#REF!,3)","v":{"$error":"#REF!"}},{"$f":"LEFT(BDD!BL78,3)","v":""},{"$f":"LEFT(BDD!BM78,3)","v":""},{"$f":"LEFT(BDD!BN78,3)","v":""},{"$f":"LEFT(BDD!BO78,3)","v":""},{"$f":"LEFT(BDD!BP78,3)","v":""},{"$f":"LEFT(BDD!BQ79,3)","v":""},{"$f":"LEFT(BDD!BR79,3)","v":""},{"$f":"LEFT(BDD!BS79,3)","v":""},{"$f":"LEFT(BDD!BT79,3)","v":""},{"$f":"LEFT(BDD!BU79,3)","v":""},{"$f":"LEFT(BDD!BV79,3)","v":""},{"$f":"LEFT(BDD!BW79,3)","v":""},{"$f":"LEFT(BDD!BX79,3)","v":""},{"$f":"LEFT(BDD!BY79,3)","v":""},{"$f":"LEFT(BDD!BZ79,3)","v":""},{"$f":"LEFT(BDD!CA79,3)","v":""},{"$f":"LEFT(BDD!CB79,3)","v":""},{"$f":"LEFT(BDD!CC79,3)","v":""},{"$f":"LEFT(BDD!CD79,3)","v":""},{"$f":"LEFT(BDD!CE79,3)","v":""}]
[{"$f":"LEFT(BDD!A81,3)","v":""},{"$f":"BDD!B81","v":0},{"$f":"LEFT(BDD!C79,3)","v":""},{"$f":"LEFT(BDD!D79,3)","v":""},{"$f":"LEFT(BDD!E79,3)","v":""},{"$f":"LEFT(BDD!F79,3)","v":""},{"$f":"LEFT(BDD!G79,3)","v":""},{"$f":"LEFT(BDD!H79,3)","v":""},{"$f":"LEFT(BDD!J79,3)","v":""},{"$f":"LEFT(BDD!K79,3)","v":""},{"$f":"LEFT(BDD!M79,3)","v":""},{"$f":"LEFT(BDD!O79,3)","v":""},{"$f":"LEFT(BDD!P79,3)","v":""},{"$f":"LEFT(BDD!R79,3)","v":""},{"$f":"LEFT(BDD!S79,3)","v":""},{"$f":"LEFT(BDD!T79,3)","v":""},{"$f":"LEFT(BDD!U79,3)","v":""},{"$f":"LEFT(BDD!V79,3)","v":""},{"$f":"LEFT(BDD!W79,3)","v":""},{"$f":"LEFT(BDD!X79,3)","v":""},{"$f":"LEFT(BDD!Y79,3)","v":""},{"$f":"LEFT(BDD!Z79,3)","v":""},{"$f":"LEFT(BDD!AA79,3)","v":""},{"$f":"LEFT(BDD!AB80,3)","v":""},{"$f":"LEFT(BDD!AC79,3)","v":""},{"$f":"LEFT(BDD!AD80,3)","v":""},{"$f":"LEFT(BDD!AE79,3)","v":""},{"$f":"LEFT(BDD!AF79,3)","v":""},{"$f":"LEFT(BDD!AG79,3)","v":""},{"$f":"LEFT(BDD!AI79,3)","v":""},{"$f":"LEFT(BDD!AJ79,3)","v":""},{"$f":"LEFT(BDD!AK79,3)","v":""},{"$f":"LEFT(BDD!AL79,3)","v":""},{"$f":"LEFT(BDD!AM79,3)","v":""},{"$f":"LEFT(BDD!AN79,3)","v":""},{"$f":"LEFT(BDD!AP79,3)","v":""},{"$f":"LEFT(BDD!AQ79,3)","v":""},{"$f":"LEFT(BDD!AR79,3)","v":""},{"$f":"LEFT(BDD!AS79,3)","v":""},{"$f":"LEFT(BDD!AT79,3)","v":""},{"$f":"LEFT(BDD!AU79,3)","v":""},{"$f":"LEFT(BDD!AV79,3)","v":""},{"$f":"LEFT(BDD!AW79,3)","v":""},{"$f":"LEFT(BDD!AX80,3)","v":""},{"$f":"LEFT(BDD!AY79,3)","v":""},{"$f":"LEFT(BDD!AZ79,3)","v":""},{"$f":"LEFT(BDD!BA79,3)","v":""},{"$f":"LEFT(BDD!BB79,3)","v":""},{"$f":"LEFT(BDD!BC79,3)","v":""},{"$f":"LEFT(BDD!BD79,3)","v":""},{"$f":"LEFT(BDD!BE79,3)","v":""},{"$f":"LEFT(BDD!BF79,3)","v":""},{"$f":"LEFT(BDD!BG79,3)","v":""},{"$f":"LEFT(BDD!BH79,3)","v":""},{"$f":"LEFT(BDD!BI79,3)","v":""},{"$f":"LEFT(BDD!BJ79,3)","v":""},{"$f":"LEFT(BDD!BK79,3)","v":""},{"$f":"LEFT(BDD!#REF!,3)","v":{"$error":"#REF!"}},{"$f":"LEFT(BDD!BL79,3)","v":""},{"$f":"LEFT(BDD!BM79,3)","v":""},{"$f":"LEFT(BDD!BN79,3)","v":""},{"$f":"LEFT(BDD!BO79,3)","v":""},{"$f":"LEFT(BDD!BP79,3)","v":""},{"$f":"LEFT(BDD!BQ80,3)","v":""},{"$f":"LEFT(BDD!BR80,3)","v":""},{"$f":"LEFT(BDD!BS80,3)","v":""},{"$f":"LEFT(BDD!BT80,3)","v":""},{"$f":"LEFT(BDD!BU80,3)","v":""},{"$f":"LEFT(BDD!BV80,3)","v":""},{"$f":"LEFT(BDD!BW80,3)","v":""},{"$f":"LEFT(BDD!BX80,3)","v":""},{"$f":"LEFT(BDD!BY80,3)","v":""},{"$f":"LEFT(BDD!BZ80,3)","v":""},{"$f":"LEFT(BDD!CA80,3)","v":""},{"$f":"LEFT(BDD!CB80,3)","v":""},{"$f":"LEFT(BDD!CC80,3)","v":""},{"$f":"LEFT(BDD!CD80,3)","v":""},{"$f":"LEFT(BDD!CE80,3)","v":""}]
[{"$f":"LEFT(BDD!A82,3)","v":""},{"$f":"BDD!B82","v":0},{"$f":"LEFT(BDD!C80,3)","v":""},{"$f":"LEFT(BDD!D80,3)","v":""},{"$f":"LEFT(BDD!E80,3)","v":""},{"$f":"LEFT(BDD!F80,3)","v":""},{"$f":"LEFT(BDD!G80,3)","v":""},{"$f":"LEFT(BDD!H80,3)","v":""},{"$f":"LEFT(BDD!J80,3)","v":""},{"$f":"LEFT(BDD!K80,3)","v":""},{"$f":"LEFT(BDD!M80,3)","v":""},{"$f":"LEFT(BDD!O80,3)","v":""},{"$f":"LEFT(BDD!P80,3)","v":""},{"$f":"LEFT(BDD!R80,3)","v":""},{"$f":"LEFT(BDD!S80,3)","v":""},{"$f":"LEFT(BDD!T80,3)","v":""},{"$f":"LEFT(BDD!U80,3)","v":""},{"$f":"LEFT(BDD!V80,3)","v":""},{"$f":"LEFT(BDD!W80,3)","v":""},{"$f":"LEFT(BDD!X80,3)","v":""},{"$f":"LEFT(BDD!Y80,3)","v":""},{"$f":"LEFT(BDD!Z80,3)","v":""},{"$f":"LEFT(BDD!AA80,3)","v":""},{"$f":"LEFT(BDD!AB80,3)","v":""},{"$f":"LEFT(BDD!AC80,3)","v":""},{"$f":"LEFT(BDD!AD81,3)","v":""},{"$f":"LEFT(BDD!AE80,3)","v":""},{"$f":"LEFT(BDD!AF80,3)","v":""},{"$f":"LEFT(BDD!AG80,3)","v":""},{"$f":"LEFT(BDD!AI80,3)","v":""},{"$f":"LEFT(BDD!AJ80,3)","v":""},{"$f":"LEFT(BDD!AK80,3)","v":""},{"$f":"LEFT(BDD!AL80,3)","v":""},{"$f":"LEFT(BDD!AM80,3)","v":""},{"$f":"LEFT(BDD!AN80,3)","v":""},{"$f":"LEFT(BDD!AP80,3)","v":""},{"$f":"LEFT(BDD!AQ80,3)","v":""},{"$f":"LEFT(BDD!AR80,3)","v":""},{"$f":"LEFT(BDD!AS80,3)","v":""},{"$f":"LEFT(BDD!AT80,3)","v":""},{"$f":"LEFT(BDD!AU80,3)","v":""},{"$f":"LEFT(BDD!AV80,3)","v":""},{"$f":"LEFT(BDD!AW80,3)","v":""},{"$f":"LEFT(BDD!AX81,3)","v":""},{"$f":"LEFT(BDD!AY80,3)","v":""},{"$f":"LEFT(BDD!AZ80,3)","v":""},{"$f":"LEFT(BDD!BA80,3)","v":""},{"$f":"LEFT(BDD!BB80,3)","v":""},{"$f":"LEFT(BDD!BC80,3)","v":""},{"$f":"LEFT(BDD!BD80,3)","v":""},{"$f":"LEFT(BDD!BE80,3)","v":""},{"$f":"LEFT(BDD!BF80,3)","v":""},{"$f":"LEFT(BDD!BG80,3)","v":""},{"$f":"LEFT(BDD!BH80,3)","v":""},{"$f":"LEFT(BDD!BI80,3)","v":""},{"$f":"LEFT(BDD!BJ80,3)","v":""},{"$f":"LEFT(BDD!BK80,3)","v":""},{"$f":"LEFT(BDD!#REF!,3)","v":{"$error":"#REF!"}},{"$f":"LEFT(BDD!BL80,3)","v":""},{"$f":"LEFT(BDD!BM80,3)","v":""},{"$f":"LEFT(BDD!BN80,3)","v":""},{"$f":"LEFT(BDD!BO80,3)","v":""},{"$f":"LEFT(BDD!BP80,3)","v":""},{"$f":"LEFT(BDD!BQ81,3)","v":""},{"$f":"LEFT(BDD!BR81,3)","v":""},{"$f":"LEFT(BDD!BS81,3)","v":""},{"$f":"LEFT(BDD!BT81,3)","v":""},{"$f":"LEFT(BDD!BU81,3)","v":""},{"$f":"LEFT(BDD!BV81,3)","v":""},{"$f":"LEFT(BDD!BW81,3)","v":""},{"$f":"LEFT(BDD!BX81,3)","v":""},{"$f":"LEFT(BDD!BY81,3)","v":""},{"$f":"LEFT(BDD!BZ81,3)","v":""},{"$f":"LEFT(BDD!CA81,3)","v":""},{"$f":"LEFT(BDD!CB81,3)","v":""},{"$f":"LEFT(BDD!CC81,3)","v":""},{"$f":"LEFT(BDD!CD81,3)","v":""},{"$f":"LEFT(BDD!CE81,3)","v":""}]
[{"$f":"LEFT(BDD!A83,3)","v":""},{"$f":"BDD!B83","v":0},{"$f":"LEFT(BDD!C81,3)","v":""},{"$f":"LEFT(BDD!D81,3)","v":""},{"$f":"LEFT(BDD!E81,3)","v":""},{"$f":"LEFT(BDD!F81,3)","v":""},{"$f":"LEFT(BDD!G81,3)","v":""},{"$f":"LEFT(BDD!H81,3)","v":""},{"$f":"LEFT(BDD!J81,3)","v":""},{"$f":"LEFT(BDD!K81,3)","v":""},{"$f":"LEFT(BDD!M81,3)","v":""},{"$f":"LEFT(BDD!O81,3)","v":""},{"$f":"LEFT(BDD!P81,3)","v":""},{"$f":"LEFT(BDD!R81,3)","v":""},{"$f":"LEFT(BDD!S81,3)","v":""},{"$f":"LEFT(BDD!T81,3)","v":""},{"$f":"LEFT(BDD!U81,3)","v":""},{"$f":"LEFT(BDD!V81,3)","v":""},{"$f":"LEFT(BDD!W81,3)","v":""},{"$f":"LEFT(BDD!X81,3)","v":""},{"$f":"LEFT(BDD!Y81,3)","v":""},{"$f":"LEFT(BDD!Z81,3)","v":""},{"$f":"LEFT(BDD!AA81,3)","v":""},{"$f":"LEFT(BDD!AB81,3)","v":""},{"$f":"LEFT(BDD!AC81,3)","v":""},{"$f":"LEFT(BDD!AD82,3)","v":""},{"$f":"LEFT(BDD!AE81,3)","v":""},{"$f":"LEFT(BDD!AF81,3)","v":""},{"$f":"LEFT(BDD!AG81,3)","v":""},{"$f":"LEFT(BDD!AI81,3)","v":""},{"$f":"LEFT(BDD!AJ81,3)","v":""},{"$f":"LEFT(BDD!AK81,3)","v":""},{"$f":"LEFT(BDD!AL81,3)","v":""},{"$f":"LEFT(BDD!AM81,3)","v":""},{"$f":"LEFT(BDD!AN81,3)","v":""},{"$f":"LEFT(BDD!AP81,3)","v":""},{"$f":"LEFT(BDD!AQ81,3)","v":""},{"$f":"LEFT(BDD!AR81,3)","v":""},{"$f":"LEFT(BDD!AS81,3)","v":""},{"$f":"LEFT(BDD!AT81,3)","v":""},{"$f":"LEFT(BDD!AU81,3)","v":""},{"$f":"LEFT(BDD!AV81,3)","v":""},{"$f":"LEFT(BDD!AW81,3)","v":""},{"$f":"LEFT(BDD!AX82,3)","v":""},{"$f":"LEFT(BDD!AY81,3)","v":""},{"$f":"LEFT(BDD!AZ81,3)","v":""},{"$f":"LEFT(BDD!BA81,3)","v":""},{"$f":"LEFT(BDD!BB81,3)","v":""},{"$f":"LEFT(BDD!BC81,3)","v":""},{"$f":"LEFT(BDD!BD81,3)","v":""},{"$f":"LEFT(BDD!BE81,3)","v":""},{"$f":"LEFT(BDD!BF81,3)","v":""},{"$f":"LEFT(BDD!BG81,3)","v":""},{"$f":"LEFT(BDD!BH81,3)","v":""},{"$f":"LEFT(BDD!BI81,3)","v":""},{"$f":"LEFT(BDD!BJ81,3)","v":""},{"$f":"LEFT(BDD!BK81,3)","v":""},{"$f":"LEFT(BDD!#REF!,3)","v":{"$error":"#REF!"}},{"$f":"LEFT(BDD!BL81,3)","v":""},{"$f":"LEFT(BDD!BM81,3)","v":""},{"$f":"LEFT(BDD!BN81,3)","v":""},{"$f":"LEFT(BDD!BO81,3)","v":""},{"$f":"LEFT(BDD!BP81,3)","v":""},{"$f":"LEFT(BDD!BQ82,3)","v":""},{"$f":"LEFT(BDD!BR82,3)","v":""},{"$f":"LEFT(BDD!BS82,3)","v":""},{"$f":"LEFT(BDD!BT82,3)","v":""},{"$f":"LEFT(BDD!BU82,3)","v":""},{"$f":"LEFT(BDD!BV82,3)","v":""},{"$f":"LEFT(BDD!BW82,3)","v":""},{"$f":"LEFT(BDD!BX82,3)","v":""},{"$f":"LEFT(BDD!BY82,3)","v":""},{"$f":"LEFT(BDD!BZ82,3)","v":""},{"$f":"LEFT(BDD!CA82,3)","v":""},{"$f":"LEFT(BDD!CB82,3)","v":""},{"$f":"LEFT(BDD!CC82,3)","v":""},{"$f":"LEFT(BDD!CD82,3)","v":""},{"$f":"LEFT(BDD!CE82,3)","v":""}]
[{"$f":"LEFT(BDD!A84,3)","v":""},{"$f":"BDD!B84","v":0},{"$f":"LEFT(BDD!C82,3)","v":""},{"$f":"LEFT(BDD!D82,3)","v":""},{"$f":"LEFT(BDD!E82,3)","v":""},{"$f":"LEFT(BDD!F82,3)","v":""},{"$f":"LEFT(BDD!G82,3)","v":""},{"$f":"LEFT(BDD!H82,3)","v":""},{"$f":"LEFT(BDD!J82,3)","v":""},{"$f":"LEFT(BDD!K82,3)","v":""},{"$f":"LEFT(BDD!M82,3)","v":""},{"$f":"LEFT(BDD!O82,3)","v":""},{"$f":"LEFT(BDD!P82,3)","v":""},{"$f":"LEFT(BDD!R82,3)","v":""},{"$f":"LEFT(BDD!S82,3)","v":""},{"$f":"LEFT(BDD!T82,3)","v":""},{"$f":"LEFT(BDD!U82,3)","v":""},{"$f":"LEFT(BDD!V82,3)","v":""},{"$f":"LEFT(BDD!W82,3)","v":""},{"$f":"LEFT(BDD!X82,3)","v":""},{"$f":"LEFT(BDD!Y82,3)","v":""},{"$f":"LEFT(BDD!Z82,3)","v":""},{"$f":"LEFT(BDD!AA82,3)","v":""},{"$f":"LEFT(BDD!AB82,3)","v":""},{"$f":"LEFT(BDD!AC82,3)","v":""},{"$f":"LEFT(BDD!AD83,3)","v":""},{"$f":"LEFT(BDD!AE82,3)","v":""},{"$f":"LEFT(BDD!AF82,3)","v":""},{"$f":"LEFT(BDD!AG82,3)","v":""},{"$f":"LEFT(BDD!AI82,3)","v":""},{"$f":"LEFT(BDD!AJ82,3)","v":""},{"$f":"LEFT(BDD!AK82,3)","v":""},{"$f":"LEFT(BDD!AL82,3)","v":""},{"$f":"LEFT(BDD!AM82,3)","v":""},{"$f":"LEFT(BDD!AN82,3)","v":""},{"$f":"LEFT(BDD!AP82,3)","v":""},{"$f":"LEFT(BDD!AQ82,3)","v":""},{"$f":"LEFT(BDD!AR82,3)","v":""},{"$f":"LEFT(BDD!AS82,3)","v":""},{"$f":"LEFT(BDD!AT82,3)","v":""},{"$f":"LEFT(BDD!AU82,3)","v":""},{"$f":"LEFT(BDD!AV82,3)","v":""},{"$f":"LEFT(BDD!AW82,3)","v":""},{"$f":"LEFT(BDD!AX83,3)","v":""},{"$f":"LEFT(BDD!AY82,3)","v":""},{"$f":"LEFT(BDD!AZ82,3)","v":""},{"$f":"LEFT(BDD!BA82,3)","v":""},{"$f":"LEFT(BDD!BB82,3)","v":""},{"$f":"LEFT(BDD!BC82,3)","v":""},{"$f":"LEFT(BDD!BD82,3)","v":""},{"$f":"LEFT(BDD!BE82,3)","v":""},{"$f":"LEFT(BDD!BF82,3)","v":""},{"$f":"LEFT(BDD!BG82,3)","v":""},{"$f":"LEFT(BDD!BH82,3)","v":""},{"$f":"LEFT(BDD!BI82,3)","v":""},{"$f":"LEFT(BDD!BJ82,3)","v":""},{"$f":"LEFT(BDD!BK82,3)","v":""},{"$f":"LEFT(BDD!#REF!,3)","v":{"$error":"#REF!"}},{"$f":"LEFT(BDD!BL82,3)","v":""},{"$f":"LEFT(BDD!BM82,3)","v":""},{"$f":"LEFT(BDD!BN82,3)","v":""},{"$f":"LEFT(BDD!BO82,3)","v":""},{"$f":"LEFT(BDD!BP82,3)","v":""},{"$f":"LEFT(BDD!BQ83,3)","v":""},{"$f":"LEFT(BDD!BR83,3)","v":""},{"$f":"LEFT(BDD!BS83,3)","v":""},{"$f":"LEFT(BDD!BT83,3)","v":""},{"$f":"LEFT(BDD!BU83,3)","v":""},{"$f":"LEFT(BDD!BV83,3)","v":""},{"$f":"LEFT(BDD!BW83,3)","v":""},{"$f":"LEFT(BDD!BX83,3)","v":""},{"$f":"LEFT(BDD!BY83,3)","v":""},{"$f":"LEFT(BDD!BZ83,3)","v":""},{"$f":"LEFT(BDD!CA83,3)","v":""},{"$f":"LEFT(BDD!CB83,3)","v":""},{"$f":"LEFT(BDD!CC83,3)","v":""},{"$f":"LEFT(BDD!CD83,3)","v":""},{"$f":"LEFT(BDD!CE83,3)","v":""}]
[{"$f":"LEFT(BDD!A85,3)","v":""},{"$f":"BDD!B85","v":0},{"$f":"LEFT(BDD!C83,3)","v":""},{"$f":"LEFT(BDD!D83,3)","v":""},{"$f":"LEFT(BDD!E83,3)","v":""},{"$f":"LEFT(BDD!F83,3)","v":""},{"$f":"LEFT(BDD!G83,3)","v":""},{"$f":"LEFT(BDD!H83,3)","v":""},{"$f":"LEFT(BDD!J83,3)","v":""},{"$f":"LEFT(BDD!K83,3)","v":""},{"$f":"LEFT(BDD!M83,3)","v":""},{"$f":"LEFT(BDD!O83,3)","v":""},{"$f":"LEFT(BDD!P83,3)","v":""},{"$f":"LEFT(BDD!R83,3)","v":""},{"$f":"LEFT(BDD!S83,3)","v":""},{"$f":"LEFT(BDD!T83,3)","v":""},{"$f":"LEFT(BDD!U83,3)","v":""},{"$f":"LEFT(BDD!V83,3)","v":""},{"$f":"LEFT(BDD!W83,3)","v":""},{"$f":"LEFT(BDD!X83,3)","v":""},{"$f":"LEFT(BDD!Y83,3)","v":""},{"$f":"LEFT(BDD!Z83,3)","v":""},{"$f":"LEFT(BDD!AA83,3)","v":""},{"$f":"LEFT(BDD!AB83,3)","v":""},{"$f":"LEFT(BDD!AC83,3)","v":""},{"$f":"LEFT(BDD!AD84,3)","v":""},{"$f":"LEFT(BDD!AE83,3)","v":""},{"$f":"LEFT(BDD!AF83,3)","v":""},{"$f":"LEFT(BDD!AG83,3)","v":""},{"$f":"LEFT(BDD!AI83,3)","v":""},{"$f":"LEFT(BDD!AJ83,3)","v":""},{"$f":"LEFT(BDD!AK83,3)","v":""},{"$f":"LEFT(BDD!AL83,3)","v":""},{"$f":"LEFT(BDD!AM83,3)","v":""},{"$f":"LEFT(BDD!AN83,3)","v":""},{"$f":"LEFT(BDD!AP83,3)","v":""},{"$f":"LEFT(BDD!AQ83,3)","v":""},{"$f":"LEFT(BDD!AR83,3)","v":""},{"$f":"LEFT(BDD!AS83,3)","v":""},{"$f":"LEFT(BDD!AT83,3)","v":""},{"$f":"LEFT(BDD!AU83,3)","v":""},{"$f":"LEFT(BDD!AV83,3)","v":""},{"$f":"LEFT(BDD!AW83,3)","v":""},{"$f":"LEFT(BDD!AX84,3)","v":""},{"$f":"LEFT(BDD!AY83,3)","v":""},{"$f":"LEFT(BDD!AZ83,3)","v":""},{"$f":"LEFT(BDD!BA83,3)","v":""},{"$f":"LEFT(BDD!BB83,3)","v":""},{"$f":"LEFT(BDD!BC83,3)","v":""},{"$f":"LEFT(BDD!BD83,3)","v":""},{"$f":"LEFT(BDD!BE83,3)","v":""},{"$f":"LEFT(BDD!BF83,3)","v":""},{"$f":"LEFT(BDD!BG83,3)","v":""},{"$f":"LEFT(BDD!BH83,3)","v":""},{"$f":"LEFT(BDD!BI83,3)","v":""},{"$f":"LEFT(BDD!BJ83,3)","v":""},{"$f":"LEFT(BDD!BK83,3)","v":""},{"$f":"LEFT(BDD!#REF!,3)","v":{"$error":"#REF!"}},{"$f":"LEFT(BDD!BL83,3)","v":""},{"$f":"LEFT(BDD!BM83,3)","v":""},{"$f":"LEFT(BDD!BN83,3)","v":""},{"$f":"LEFT(BDD!BO83,3)","v":""},{"$f":"LEFT(BDD!BP83,3)","v":""},{"$f":"LEFT(BDD!BQ84,3)","v":""},{"$f":"LEFT(BDD!BR84,3)","v":""},{"$f":"LEFT(BDD!BS84,3)","v":""},{"$f":"LEFT(BDD!BT84,3)","v":""},{"$f":"LEFT(BDD!BU84,3)","v":""},{"$f":"LEFT(BDD!BV84,3)","v":""},{"$f":"LEFT(BDD!BW84,3)","v":""},{"$f":"LEFT(BDD!BX84,3)","v":""},{"$f":"LEFT(BDD!BY84,3)","v":""},{"$f":"LEFT(BDD!BZ84,3)","v":""},{"$f":"LEFT(BDD!CA84,3)","v":""},{"$f":"LEFT(BDD!CB84,3)","v":""},{"$f":"LEFT(BDD!CC84,3)","v":""},{"$f":"LEFT(BDD!CD84,3)","v":""},{"$f":"LEFT(BDD!CE84,3)","v":""}]
[{"$f":"LEFT(BDD!A86,3)","v":""},{"$f":"BDD!B86","v":0},{"$f":"LEFT(BDD!C84,3)","v":""},{"$f":"LEFT(BDD!D84,3)","v":""},{"$f":"LEFT(BDD!E84,3)","v":""},{"$f":"LEFT(BDD!F84,3)","v":""},{"$f":"LEFT(BDD!G84,3)","v":""},{"$f":"LEFT(BDD!H84,3)","v":""},{"$f":"LEFT(BDD!J84,3)","v":""},{"$f":"LEFT(BDD!K84,3)","v":""},{"$f":"LEFT(BDD!M84,3)","v":""},{"$f":"LEFT(BDD!O84,3)","v":""},{"$f":"LEFT(BDD!P84,3)","v":""},{"$f":"LEFT(BDD!R84,3)","v":""},{"$f":"LEFT(BDD!S84,3)","v":""},{"$f":"LEFT(BDD!T84,3)","v":""},{"$f":"LEFT(BDD!U84,3)","v":""},{"$f":"LEFT(BDD!V84,3)","v":""},{"$f":"LEFT(BDD!W84,3)","v":""},{"$f":"LEFT(BDD!X84,3)","v":""},{"$f":"LEFT(BDD!Y84,3)","v":""},{"$f":"LEFT(BDD!Z84,3)","v":""},{"$f":"LEFT(BDD!AA84,3)","v":""},{"$f":"LEFT(BDD!AB84,3)","v":""},{"$f":"LEFT(BDD!AC84,3)","v":""},{"$f":"LEFT(BDD!AD85,3)","v":""},{"$f":"LEFT(BDD!AE84,3)","v":""},{"$f":"LEFT(BDD!AF84,3)","v":""},{"$f":"LEFT(BDD!AG84,3)","v":""},{"$f":"LEFT(BDD!AI84,3)","v":""},{"$f":"LEFT(BDD!AJ84,3)","v":""},{"$f":"LEFT(BDD!AK84,3)","v":""},{"$f":"LEFT(BDD!AL84,3)","v":""},{"$f":"LEFT(BDD!AM84,3)","v":""},{"$f":"LEFT(BDD!AN84,3)","v":""},{"$f":"LEFT(BDD!AP84,3)","v":""},{"$f":"LEFT(BDD!AQ84,3)","v":""},{"$f":"LEFT(BDD!AR84,3)","v":""},{"$f":"LEFT(BDD!AS84,3)","v":""},{"$f":"LEFT(BDD!AT84,3)","v":""},{"$f":"LEFT(BDD!AU84,3)","v":""},{"$f":"LEFT(BDD!AV84,3)","v":""},{"$f":"LEFT(BDD!AW84,3)","v":""},{"$f":"LEFT(BDD!AX85,3)","v":""},{"$f":"LEFT(BDD!AY84,3)","v":""},{"$f":"LEFT(BDD!AZ84,3)","v":""},{"$f":"LEFT(BDD!BA84,3)","v":""},{"$f":"LEFT(BDD!BB84,3)","v":""},{"$f":"LEFT(BDD!BC84,3)","v":""},{"$f":"LEFT(BDD!BD84,3)","v":""},{"$f":"LEFT(BDD!BE84,3)","v":""},{"$f":"LEFT(BDD!BF84,3)","v":""},{"$f":"LEFT(BDD!BG84,3)","v":""},{"$f":"LEFT(BDD!BH84,3)","v":""},{"$f":"LEFT(BDD!BI84,3)","v":""},{"$f":"LEFT(BDD!BJ84,3)","v":""},{"$f":"LEFT(BDD!BK84,3)","v":""},{"$f":"LEFT(BDD!#REF!,3)","v":{"$error":"#REF!"}},{"$f":"LEFT(BDD!BL84,3)","v":""},{"$f":"LEFT(BDD!BM84,3)","v":""},{"$f":"LEFT(BDD!BN84,3)","v":""},{"$f":"LEFT(BDD!BO84,3)","v":""},{"$f":"LEFT(BDD!BP84,3)","v":""},{"$f":"LEFT(BDD!BQ85,3)","v":""},{"$f":"LEFT(BDD!BR85,3)","v":""},{"$f":"LEFT(BDD!BS85,3)","v":""},{"$f":"LEFT(BDD!BT85,3)","v":""},{"$f":"LEFT(BDD!BU85,3)","v":""},{"$f":"LEFT(BDD!BV85,3)","v":""},{"$f":"LEFT(BDD!BW85,3)","v":""},{"$f":"LEFT(BDD!BX85,3)","v":""},{"$f":"LEFT(BDD!BY85,3)","v":""},{"$f":"LEFT(BDD!BZ85,3)","v":""},{"$f":"LEFT(BDD!CA85,3)","v":""},{"$f":"LEFT(BDD!CB85,3)","v":""},{"$f":"LEFT(BDD!CC85,3)","v":""},{"$f":"LEFT(BDD!CD85,3)","v":""},{"$f":"LEFT(BDD!CE85,3)","v":""}]
[{"$f":"LEFT(BDD!A87,3)","v":""},{"$f":"BDD!B87","v":0},{"$f":"LEFT(BDD!C85,3)","v":""},{"$f":"LEFT(BDD!D85,3)","v":""},{"$f":"LEFT(BDD!E85,3)","v":""},{"$f":"LEFT(BDD!F85,3)","v":""},{"$f":"LEFT(BDD!G85,3)","v":""},{"$f":"LEFT(BDD!H85,3)","v":""},{"$f":"LEFT(BDD!J85,3)","v":""},{"$f":"LEFT(BDD!K85,3)","v":""},{"$f":"LEFT(BDD!M85,3)","v":""},{"$f":"LEFT(BDD!O85,3)","v":""},{"$f":"LEFT(BDD!P85,3)","v":""},{"$f":"LEFT(BDD!R85,3)","v":""},{"$f":"LEFT(BDD!S85,3)","v":""},{"$f":"LEFT(BDD!T85,3)","v":""},{"$f":"LEFT(BDD!U85,3)","v":""},{"$f":"LEFT(BDD!V85,3)","v":""},{"$f":"LEFT(BDD!W85,3)","v":""},{"$f":"LEFT(BDD!X85,3)","v":""},{"$f":"LEFT(BDD!Y85,3)","v":""},{"$f":"LEFT(BDD!Z85,3)","v":""},{"$f":"LEFT(BDD!AA85,3)","v":""},{"$f":"LEFT(BDD!AB85,3)","v":""},{"$f":"LEFT(BDD!AC85,3)","v":""},{"$f":"LEFT(BDD!AD86,3)","v":""},{"$f":"LEFT(BDD!AE85,3)","v":""},{"$f":"LEFT(BDD!AF85,3)","v":""},{"$f":"LEFT(BDD!AG85,3)","v":""},{"$f":"LEFT(BDD!AI85,3)","v":""},{"$f":"LEFT(BDD!AJ85,3)","v":""},{"$f":"LEFT(BDD!AK85,3)","v":""},{"$f":"LEFT(BDD!AL85,3)","v":""},{"$f":"LEFT(BDD!AM85,3)","v":""},{"$f":"LEFT(BDD!AN85,3)","v":""},{"$f":"LEFT(BDD!AP85,3)","v":""},{"$f":"LEFT(BDD!AQ85,3)","v":""},{"$f":"LEFT(BDD!AR85,3)","v":""},{"$f":"LEFT(BDD!AS85,3)","v":""},{"$f":"LEFT(BDD!AT85,3)","v":""},{"$f":"LEFT(BDD!AU85,3)","v":""},{"$f":"LEFT(BDD!AV85,3)","v":""},{"$f":"LEFT(BDD!AW85,3)","v":""},{"$f":"LEFT(BDD!AX86,3)","v":""},{"$f":"LEFT(BDD!AY85,3)","v":""},{"$f":"LEFT(BDD!AZ85,3)","v":""},{"$f":"LEFT(BDD!BA85,3)","v":""},{"$f":"LEFT(BDD!BB85,3)","v":""},{"$f":"LEFT(BDD!BC85,3)","v":""},{"$f":"LEFT(BDD!BD85,3)","v":""},{"$f":"LEFT(BDD!BE85,3)","v":""},{"$f":"LEFT(BDD!BF85,3)","v":""},{"$f":"LEFT(BDD!BG85,3)","v":""},{"$f":"LEFT(BDD!BH85,3)","v":""},{"$f":"LEFT(BDD!BI85,3)","v":""},{"$f":"LEFT(BDD!BJ85,3)","v":""},{"$f":"LEFT(BDD!BK85,3)","v":""},{"$f":"LEFT(BDD!#REF!,3)","v":{"$error":"#REF!"}},{"$f":"LEFT(BDD!BL85,3)","v":""},{"$f":"LEFT(BDD!BM85,3)","v":""},{"$f":"LEFT(BDD!BN85,3)","v":""},{"$f":"LEFT(BDD!BO85,3)","v":""},{"$f":"LEFT(BDD!BP85,3)","v":""},{"$f":"LEFT(BDD!BQ86,3)","v":""},{"$f":"LEFT(BDD!BR86,3)","v":""},{"$f":"LEFT(BDD!BS86,3)","v":""},{"$f":"LEFT(BDD!BT86,3)","v":""},{"$f":"LEFT(BDD!BU86,3)","v":""},{"$f":"LEFT(BDD!BV86,3)","v":""},{"$f":"LEFT(BDD!BW86,3)","v":""},{"$f":"LEFT(BDD!BX86,3)","v":""},{"$f":"LEFT(BDD!BY86,3)","v":""},{"$f":"LEFT(BDD!BZ86,3)","v":""},{"$f":"LEFT(BDD!CA86,3)","v":""},{"$f":"LEFT(BDD!CB86,3)","v":""},{"$f":"LEFT(BDD!CC86,3)","v":""},{"$f":"LEFT(BDD!CD86,3)","v":""},{"$f":"LEFT(BDD!CE86,3)","v":""}]
[{"$f":"LEFT(BDD!A88,3)","v":""},{"$f":"BDD!B88","v":0},{"$f":"LEFT(BDD!C86,3)","v":""},{"$f":"LEFT(BDD!D86,3)","v":""},{"$f":"LEFT(BDD!E86,3)","v":""},{"$f":"LEFT(BDD!F86,3)","v":""},{"$f":"LEFT(BDD!G86,3)","v":""},{"$f":"LEFT(BDD!H86,3)","v":""},{"$f":"LEFT(BDD!J86,3)","v":""},{"$f":"LEFT(BDD!K86,3)","v":""},{"$f":"LEFT(BDD!M86,3)","v":""},{"$f":"LEFT(BDD!O86,3)","v":""},{"$f":"LEFT(BDD!P86,3)","v":""},{"$f":"LEFT(BDD!R86,3)","v":""},{"$f":"LEFT(BDD!S86,3)","v":""},{"$f":"LEFT(BDD!T86,3)","v":""},{"$f":"LEFT(BDD!U86,3)","v":""},{"$f":"LEFT(BDD!V86,3)","v":""},{"$f":"LEFT(BDD!W86,3)","v":""},{"$f":"LEFT(BDD!X86,3)","v":""},{"$f":"LEFT(BDD!Y86,3)","v":""},{"$f":"LEFT(BDD!Z86,3)","v":""},{"$f":"LEFT(BDD!AA86,3)","v":""},{"$f":"LEFT(BDD!AB86,3)","v":""},{"$f":"LEFT(BDD!AC86,3)","v":""},{"$f":"LEFT(BDD!AD87,3)","v":""},{"$f":"LEFT(BDD!AE86,3)","v":""},{"$f":"LEFT(BDD!AF86,3)","v":""},{"$f":"LEFT(BDD!AG86,3)","v":""},{"$f":"LEFT(BDD!AI86,3)","v":""},{"$f":"LEFT(BDD!AJ86,3)","v":""},{"$f":"LEFT(BDD!AK86,3)","v":""},{"$f":"LEFT(BDD!AL86,3)","v":""},{"$f":"LEFT(BDD!AM86,3)","v":""},{"$f":"LEFT(BDD!AN86,3)","v":""},{"$f":"LEFT(BDD!AP86,3)","v":""},{"$f":"LEFT(BDD!AQ86,3)","v":""},{"$f":"LEFT(BDD!AR86,3)","v":""},{"$f":"LEFT(BDD!AS86,3)","v":""},{"$f":"LEFT(BDD!AT86,3)","v":""},{"$f":"LEFT(BDD!AU86,3)","v":""},{"$f":"LEFT(BDD!AV86,3)","v":""},{"$f":"LEFT(BDD!AW86,3)","v":""},{"$f":"LEFT(BDD!AX87,3)","v":""},{"$f":"LEFT(BDD!AY86,3)","v":""},{"$f":"LEFT(BDD!AZ86,3)","v":""},{"$f":"LEFT(BDD!BA86,3)","v":""},{"$f":"LEFT(BDD!BB86,3)","v":""},{"$f":"LEFT(BDD!BC86,3)","v":""},{"$f":"LEFT(BDD!BD86,3)","v":""},{"$f":"LEFT(BDD!BE86,3)","v":""},{"$f":"LEFT(BDD!BF86,3)","v":""},{"$f":"LEFT(BDD!BG86,3)","v":""},{"$f":"LEFT(BDD!BH86,3)","v":""},{"$f":"LEFT(BDD!BI86,3)","v":""},{"$f":"LEFT(BDD!BJ86,3)","v":""},{"$f":"LEFT(BDD!BK86,3)","v":""},{"$f":"LEFT(BDD!#REF!,3)","v":{"$error":"#REF!"}},{"$f":"LEFT(BDD!BL86,3)","v":""},{"$f":"LEFT(BDD!BM86,3)","v":""},{"$f":"LEFT(BDD!BN86,3)","v":""},{"$f":"LEFT(BDD!BO86,3)","v":""},{"$f":"LEFT(BDD!BP86,3)","v":""},{"$f":"LEFT(BDD!BQ87,3)","v":""},{"$f":"LEFT(BDD!BR87,3)","v":""},{"$f":"LEFT(BDD!BS87,3)","v":""},{"$f":"LEFT(BDD!BT87,3)","v":""},{"$f":"LEFT(BDD!BU87,3)","v":""},{"$f":"LEFT(BDD!BV87,3)","v":""},{"$f":"LEFT(BDD!BW87,3)","v":""},{"$f":"LEFT(BDD!BX87,3)","v":""},{"$f":"LEFT(BDD!BY87,3)","v":""},{"$f":"LEFT(BDD!BZ87,3)","v":""},{"$f":"LEFT(BDD!CA87,3)","v":""},{"$f":"LEFT(BDD!CB87,3)","v":""},{"$f":"LEFT(BDD!CC87,3)","v":""},{"$f":"LEFT(BDD!CD87,3)","v":""},{"$f":"LEFT(BDD!CE87,3)","v":""}]
[{"$f":"LEFT(BDD!A89,3)","v":""},{"$f":"BDD!B89","v":0},{"$f":"LEFT(BDD!C87,3)","v":""},{"$f":"LEFT(BDD!D87,3)","v":""},{"$f":"LEFT(BDD!E87,3)","v":""},{"$f":"LEFT(BDD!F87,3)","v":""},{"$f":"LEFT(BDD!G87,3)","v":""},{"$f":"LEFT(BDD!H87,3)","v":""},{"$f":"LEFT(BDD!J87,3)","v":""},{"$f":"LEFT(BDD!K87,3)","v":""},{"$f":"LEFT(BDD!M87,3)","v":""},{"$f":"LEFT(BDD!O87,3)","v":""},{"$f":"LEFT(BDD!P87,3)","v":""},{"$f":"LEFT(BDD!R87,3)","v":""},{"$f":"LEFT(BDD!S87,3)","v":""},{"$f":"LEFT(BDD!T87,3)","v":""},{"$f":"LEFT(BDD!U87,3)","v":""},{"$f":"LEFT(BDD!V87,3)","v":""},{"$f":"LEFT(BDD!W87,3)","v":""},{"$f":"LEFT(BDD!X87,3)","v":""},{"$f":"LEFT(BDD!Y87,3)","v":""},{"$f":"LEFT(BDD!Z87,3)","v":""},{"$f":"LEFT(BDD!AA87,3)","v":""},{"$f":"LEFT(BDD!AB87,3)","v":""},{"$f":"LEFT(BDD!AC87,3)","v":""},{"$f":"LEFT(BDD!AD88,3)","v":""},{"$f":"LEFT(BDD!AE87,3)","v":""},{"$f":"LEFT(BDD!AF87,3)","v":""},{"$f":"LEFT(BDD!AG87,3)","v":""},{"$f":"LEFT(BDD!AI87,3)","v":""},{"$f":"LEFT(BDD!AJ87,3)","v":""},{"$f":"LEFT(BDD!AK87,3)","v":""},{"$f":"LEFT(BDD!AL87,3)","v":""},{"$f":"LEFT(BDD!AM87,3)","v":""},{"$f":"LEFT(BDD!AN87,3)","v":""},{"$f":"LEFT(BDD!AP87,3)","v":""},{"$f":"LEFT(BDD!AQ87,3)","v":""},{"$f":"LEFT(BDD!AR87,3)","v":""},{"$f":"LEFT(BDD!AS87,3)","v":""},{"$f":"LEFT(BDD!AT87,3)","v":""},{"$f":"LEFT(BDD!AU87,3)","v":""},{"$f":"LEFT(BDD!AV87,3)","v":""},{"$f":"LEFT(BDD!AW87,3)","v":""},{"$f":"LEFT(BDD!AX88,3)","v":""},{"$f":"LEFT(BDD!AY87,3)","v":""},{"$f":"LEFT(BDD!AZ87,3)","v":""},{"$f":"LEFT(BDD!BA87,3)","v":""},{"$f":"LEFT(BDD!BB87,3)","v":""},{"$f":"LEFT(BDD!BC87,3)","v":""},{"$f":"LEFT(BDD!BD87,3)","v":""},{"$f":"LEFT(BDD!BE87,3)","v":""},{"$f":"LEFT(BDD!BF87,3)","v":""},{"$f":"LEFT(BDD!BG87,3)","v":""},{"$f":"LEFT(BDD!BH87,3)","v":""},{"$f":"LEFT(BDD!BI87,3)","v":""},{"$f":"LEFT(BDD!BJ87,3)","v":""},{"$f":"LEFT(BDD!BK87,3)","v":""},{"$f":"LEFT(BDD!#REF!,3)","v":{"$error":"#REF!"}},{"$f":"LEFT(BDD!BL87,3)","v":""},{"$f":"LEFT(BDD!BM87,3)","v":""},{"$f":"LEFT(BDD!BN87,3)","v":""},{"$f":"LEFT(BDD!BO87,3)","v":""},{"$f":"LEFT(BDD!BP87,3)","v":""},{"$f":"LEFT(BDD!BQ88,3)","v":""},{"$f":"LEFT(BDD!BR88,3)","v":""},{"$f":"LEFT(BDD!BS88,3)","v":""},{"$f":"LEFT(BDD!BT88,3)","v":""},{"$f":"LEFT(BDD!BU88,3)","v":""},{"$f":"LEFT(BDD!BV88,3)","v":""},{"$f":"LEFT(BDD!BW88,3)","v":""},{"$f":"LEFT(BDD!BX88,3)","v":""},{"$f":"LEFT(BDD!BY88,3)","v":""},{"$f":"LEFT(BDD!BZ88,3)","v":""},{"$f":"LEFT(BDD!CA88,3)","v":""},{"$f":"LEFT(BDD!CB88,3)","v":""},{"$f":"LEFT(BDD!CC88,3)","v":""},{"$f":"LEFT(BDD!CD88,3)","v":""},{"$f":"LEFT(BDD!CE88,3)","v":""}]
[{"$f":"LEFT(BDD!A90,3)","v":""},{"$f":"BDD!B90","v":0},{"$f":"LEFT(BDD!C88,3)","v":""},{"$f":"LEFT(BDD!D88,3)","v":""},{"$f":"LEFT(BDD!E88,3)","v":""},{"$f":"LEFT(BDD!F88,3)","v":""},{"$f":"LEFT(BDD!G88,3)","v":""},{"$f":"LEFT(BDD!H88,3)","v":""},{"$f":"LEFT(BDD!J88,3)","v":""},{"$f":"LEFT(BDD!K88,3)","v":""},{"$f":"LEFT(BDD!M88,3)","v":""},{"$f":"LEFT(BDD!O88,3)","v":""},{"$f":"LEFT(BDD!P88,3)","v":""},{"$f":"LEFT(BDD!R88,3)","v":""},{"$f":"LEFT(BDD!S88,3)","v":""},{"$f":"LEFT(BDD!T88,3)","v":""},{"$f":"LEFT(BDD!U88,3)","v":""},{"$f":"LEFT(BDD!V88,3)","v":""},{"$f":"LEFT(BDD!W88,3)","v":""},{"$f":"LEFT(BDD!X88,3)","v":""},{"$f":"LEFT(BDD!Y88,3)","v":""},{"$f":"LEFT(BDD!Z88,3)","v":""},{"$f":"LEFT(BDD!AA88,3)","v":""},{"$f":"LEFT(BDD!AB88,3)","v":""},{"$f":"LEFT(BDD!AC88,3)","v":""},{"$f":"LEFT(BDD!AD89,3)","v":""},{"$f":"LEFT(BDD!AE88,3)","v":""},{"$f":"LEFT(BDD!AF88,3)","v":""},{"$f":"LEFT(BDD!AG88,3)","v":""},{"$f":"LEFT(BDD!AI88,3)","v":""},{"$f":"LEFT(BDD!AJ88,3)","v":""},{"$f":"LEFT(BDD!AK88,3)","v":""},{"$f":"LEFT(BDD!AL88,3)","v":""},{"$f":"LEFT(BDD!AM88,3)","v":""},{"$f":"LEFT(BDD!AN88,3)","v":""},{"$f":"LEFT(BDD!AP88,3)","v":""},{"$f":"LEFT(BDD!AQ88,3)","v":""},{"$f":"LEFT(BDD!AR88,3)","v":""},{"$f":"LEFT(BDD!AS88,3)","v":""},{"$f":"LEFT(BDD!AT88,3)","v":""},{"$f":"LEFT(BDD!AU88,3)","v":""},{"$f":"LEFT(BDD!AV88,3)","v":""},{"$f":"LEFT(BDD!AW88,3)","v":""},{"$f":"LEFT(BDD!AX89,3)","v":""},{"$f":"LEFT(BDD!AY88,3)","v":""},{"$f":"LEFT(BDD!AZ88,3)","v":""},{"$f":"LEFT(BDD!BA88,3)","v":""},{"$f":"LEFT(BDD!BB88,3)","v":""},{"$f":"LEFT(BDD!BC88,3)","v":""},{"$f":"LEFT(BDD!BD88,3)","v":""},{"$f":"LEFT(BDD!BE88,3)","v":""},{"$f":"LEFT(BDD!BF88,3)","v":""},{"$f":"LEFT(BDD!BG88,3)","v":""},{"$f":"LEFT(BDD!BH88,3)","v":""},{"$f":"LEFT(BDD!BI88,3)","v":""},{"$f":"LEFT(BDD!BJ88,3)","v":""},{"$f":"LEFT(BDD!BK88,3)","v":""},{"$f":"LEFT(BDD!#REF!,3)","v":{"$error":"#REF!"}},{"$f":"LEFT(BDD!BL88,3)","v":""},{"$f":"LEFT(BDD!BM88,3)","v":""},{"$f":"LEFT(BDD!BN88,3)","v":""},{"$f":"LEFT(BDD!BO88,3)","v":""},{"$f":"LEFT(BDD!BP88,3)","v":""},{"$f":"LEFT(BDD!BQ89,3)","v":""},{"$f":"LEFT(BDD!BR89,3)","v":""},{"$f":"LEFT(BDD!BS89,3)","v":""},{"$f":"LEFT(BDD!BT89,3)","v":""},{"$f":"LEFT(BDD!BU89,3)","v":""},{"$f":"LEFT(BDD!BV89,3)","v":""},{"$f":"LEFT(BDD!BW89,3)","v":""},{"$f":"LEFT(BDD!BX89,3)","v":""},{"$f":"LEFT(BDD!BY89,3)","v":""},{"$f":"LEFT(BDD!BZ89,3)","v":""},{"$f":"LEFT(BDD!CA89,3)","v":""},{"$f":"LEFT(BDD!CB89,3)","v":""},{"$f":"LEFT(BDD!CC89,3)","v":""},{"$f":"LEFT(BDD!CD89,3)","v":""},{"$f":"LEFT(BDD!CE89,3)","v":""}]
[{"$f":"LEFT(BDD!A91,3)","v":""},{"$f":"BDD!B91","v":0},{"$f":"LEFT(BDD!C89,3)","v":""},{"$f":"LEFT(BDD!D89,3)","v":""},{"$f":"LEFT(BDD!E89,3)","v":""},{"$f":"LEFT(BDD!F89,3)","v":""},{"$f":"LEFT(BDD!G89,3)","v":""},{"$f":"LEFT(BDD!H89,3)","v":""},{"$f":"LEFT(BDD!J89,3)","v":""},{"$f":"LEFT(BDD!K89,3)","v":""},{"$f":"LEFT(BDD!M89,3)","v":""},{"$f":"LEFT(BDD!O89,3)","v":""},{"$f":"LEFT(BDD!P89,3)","v":""},{"$f":"LEFT(BDD!R89,3)","v":""},{"$f":"LEFT(BDD!S89,3)","v":""},{"$f":"LEFT(BDD!T89,3)","v":""},{"$f":"LEFT(BDD!U89,3)","v":""},{"$f":"LEFT(BDD!V89,3)","v":""},{"$f":"LEFT(BDD!W89,3)","v":""},{"$f":"LEFT(BDD!X89,3)","v":""},{"$f":"LEFT(BDD!Y89,3)","v":""},{"$f":"LEFT(BDD!Z89,3)","v":""},{"$f":"LEFT(BDD!AA89,3)","v":""},{"$f":"LEFT(BDD!AB90,3)","v":""},{"$f":"LEFT(BDD!AC89,3)","v":""},{"$f":"LEFT(BDD!AD90,3)","v":""},{"$f":"LEFT(BDD!AE89,3)","v":""},{"$f":"LEFT(BDD!AF89,3)","v":""},{"$f":"LEFT(BDD!AG89,3)","v":""},{"$f":"LEFT(BDD!AI89,3)","v":""},{"$f":"LEFT(BDD!AJ89,3)","v":""},{"$f":"LEFT(BDD!AK89,3)","v":""},{"$f":"LEFT(BDD!AL89,3)","v":""},{"$f":"LEFT(BDD!AM89,3)","v":""},{"$f":"LEFT(BDD!AN89,3)","v":""},{"$f":"LEFT(BDD!AP89,3)","v":""},{"$f":"LEFT(BDD!AQ89,3)","v":""},{"$f":"LEFT(BDD!AR89,3)","v":""},{"$f":"LEFT(BDD!AS89,3)","v":""},{"$f":"LEFT(BDD!AT89,3)","v":""},{"$f":"LEFT(BDD!AU89,3)","v":""},{"$f":"LEFT(BDD!AV89,3)","v":""},{"$f":"LEFT(BDD!AW89,3)","v":""},{"$f":"LEFT(BDD!AX90,3)","v":""},{"$f":"LEFT(BDD!AY89,3)","v":""},{"$f":"LEFT(BDD!AZ89,3)","v":""},{"$f":"LEFT(BDD!BA89,3)","v":""},{"$f":"LEFT(BDD!BB89,3)","v":""},{"$f":"LEFT(BDD!BC89,3)","v":""},{"$f":"LEFT(BDD!BD89,3)","v":""},{"$f":"LEFT(BDD!BE89,3)","v":""},{"$f":"LEFT(BDD!BF89,3)","v":""},{"$f":"LEFT(BDD!BG89,3)","v":""},{"$f":"LEFT(BDD!BH89,3)","v":""},{"$f":"LEFT(BDD!BI89,3)","v":""},{"$f":"LEFT(BDD!BJ89,3)","v":""},{"$f":"LEFT(BDD!BK89,3)","v":""},{"$f":"LEFT(BDD!#REF!,3)","v":{"$error":"#REF!"}},{"$f":"LEFT(BDD!BL89,3)","v":""},{"$f":"LEFT(BDD!BM89,3)","v":""},{"$f":"LEFT(BDD!BN89,3)","v":""},{"$f":"LEFT(BDD!BO89,3)","v":""},{"$f":"LEFT(BDD!BP89,3)","v":""},{"$f":"LEFT(BDD!BQ90,3)","v":""},{"$f":"LEFT(BDD!BR90,3)","v":""},{"$f":"LEFT(BDD!BS90,3)","v":""},{"$f":"LEFT(BDD!BT90,3)","v":""},{"$f":"LEFT(BDD!BU90,3)","v":""},{"$f":"LEFT(BDD!BV90,3)","v":""},{"$f":"LEFT(BDD!BW90,3)","v":""},{"$f":"LEFT(BDD!BX90,3)","v":""},{"$f":"LEFT(BDD!BY90,3)","v":""},{"$f":"LEFT(BDD!BZ90,3)","v":""},{"$f":"LEFT(BDD!CA90,3)","v":""},{"$f":"LEFT(BDD!CB90,3)","v":""},{"$f":"LEFT(BDD!CC90,3)","v":""},{"$f":"LEFT(BDD!CD90,3)","v":""},{"$f":"LEFT(BDD!CE90,3)","v":""}]
[{"$f":"LEFT(BDD!A92,3)","v":""},{"$f":"BDD!B92","v":0},{"$f":"LEFT(BDD!C90,3)","v":""},{"$f":"LEFT(BDD!D90,3)","v":""},{"$f":"LEFT(BDD!E90,3)","v":""},{"$f":"LEFT(BDD!F90,3)","v":""},{"$f":"LEFT(BDD!G90,3)","v":""},{"$f":"LEFT(BDD!H90,3)","v":""},{"$f":"LEFT(BDD!J90,3)","v":""},{"$f":"LEFT(BDD!K90,3)","v":""},{"$f":"LEFT(BDD!M90,3)","v":""},{"$f":"LEFT(BDD!O90,3)","v":""},{"$f":"LEFT(BDD!P90,3)","v":""},{"$f":"LEFT(BDD!R90,3)","v":""},{"$f":"LEFT(BDD!S90,3)","v":""},{"$f":"LEFT(BDD!T90,3)","v":""},{"$f":"LEFT(BDD!U90,3)","v":""},{"$f":"LEFT(BDD!V90,3)","v":""},{"$f":"LEFT(BDD!W90,3)","v":""},{"$f":"LEFT(BDD!X90,3)","v":""},{"$f":"LEFT(BDD!Y90,3)","v":""},{"$f":"LEFT(BDD!Z90,3)","v":""},{"$f":"LEFT(BDD!AA90,3)","v":""},{"$f":"LEFT(BDD!AB91,3)","v":""},{"$f":"LEFT(BDD!AC90,3)","v":""},{"$f":"LEFT(BDD!AD91,3)","v":""},{"$f":"LEFT(BDD!AE90,3)","v":""},{"$f":"LEFT(BDD!AF90,3)","v":""},{"$f":"LEFT(BDD!AG90,3)","v":""},{"$f":"LEFT(BDD!AI90,3)","v":""},{"$f":"LEFT(BDD!AJ90,3)","v":""},{"$f":"LEFT(BDD!AK90,3)","v":""},{"$f":"LEFT(BDD!AL90,3)","v":""},{"$f":"LEFT(BDD!AM90,3)","v":""},{"$f":"LEFT(BDD!AN90,3)","v":""},{"$f":"LEFT(BDD!AP90,3)","v":""},{"$f":"LEFT(BDD!AQ90,3)","v":""},{"$f":"LEFT(BDD!AR90,3)","v":""},{"$f":"LEFT(BDD!AS90,3)","v":""},{"$f":"LEFT(BDD!AT90,3)","v":""},{"$f":"LEFT(BDD!AU90,3)","v":""},{"$f":"LEFT(BDD!AV90,3)","v":""},{"$f":"LEFT(BDD!AW90,3)","v":""},{"$f":"LEFT(BDD!AX91,3)","v":""},{"$f":"LEFT(BDD!AY90,3)","v":""},{"$f":"LEFT(BDD!AZ90,3)","v":""},{"$f":"LEFT(BDD!BA90,3)","v":""},{"$f":"LEFT(BDD!BB90,3)","v":""},{"$f":"LEFT(BDD!BC90,3)","v":""},{"$f":"LEFT(BDD!BD90,3)","v":""},{"$f":"LEFT(BDD!BE90,3)","v":""},{"$f":"LEFT(BDD!BF90,3)","v":""},{"$f":"LEFT(BDD!BG90,3)","v":""},{"$f":"LEFT(BDD!BH90,3)","v":""},{"$f":"LEFT(BDD!BI90,3)","v":""},{"$f":"LEFT(BDD!BJ90,3)","v":""},{"$f":"LEFT(BDD!BK90,3)","v":""},{"$f":"LEFT(BDD!#REF!,3)","v":{"$error":"#REF!"}},{"$f":"LEFT(BDD!BL90,3)","v":""},{"$f":"LEFT(BDD!BM90,3)","v":""},{"$f":"LEFT(BDD!BN90,3)","v":""},{"$f":"LEFT(BDD!BO90,3)","v":""},{"$f":"LEFT(BDD!BP90,3)","v":""},{"$f":"LEFT(BDD!BQ91,3)","v":""},{"$f":"LEFT(BDD!BR91,3)","v":""},{"$f":"LEFT(BDD!BS91,3)","v":""},{"$f":"LEFT(BDD!BT91,3)","v":""},{"$f":"LEFT(BDD!BU91,3)","v":""},{"$f":"LEFT(BDD!BV91,3)","v":""},{"$f":"LEFT(BDD!BW91,3)","v":""},{"$f":"LEFT(BDD!BX91,3)","v":""},{"$f":"LEFT(BDD!BY91,3)","v":""},{"$f":"LEFT(BDD!BZ91,3)","v":""},{"$f":"LEFT(BDD!CA91,3)","v":""},{"$f":"LEFT(BDD!CB91,3)","v":""},{"$f":"LEFT(BDD!CC91,3)","v":""},{"$f":"LEFT(BDD!CD91,3)","v":""},{"$f":"LEFT(BDD!CE91,3)","v":""}]
[{"$f":"LEFT(BDD!A93,3)","v":""},{"$f":"BDD!B93","v":0},{"$f":"LEFT(BDD!C91,3)","v":""},{"$f":"LEFT(BDD!D91,3)","v":""},{"$f":"LEFT(BDD!E91,3)","v":""},{"$f":"LEFT(BDD!F91,3)","v":""},{"$f":"LEFT(BDD!G91,3)","v":""},{"$f":"LEFT(BDD!H91,3)","v":""},{"$f":"LEFT(BDD!J91,3)","v":""},{"$f":"LEFT(BDD!K91,3)","v":""},{"$f":"LEFT(BDD!M91,3)","v":""},{"$f":"LEFT(BDD!O91,3)","v":""},{"$f":"LEFT(BDD!P91,3)","v":""},{"$f":"LEFT(BDD!R91,3)","v":""},{"$f":"LEFT(BDD!S91,3)","v":""},{"$f":"LEFT(BDD!T91,3)","v":""},{"$f":"LEFT(BDD!U91,3)","v":""},{"$f":"LEFT(BDD!V91,3)","v":""},{"$f":"LEFT(BDD!W91,3)","v":""},{"$f":"LEFT(BDD!X91,3)","v":""},{"$f":"LEFT(BDD!Y91,3)","v":""},{"$f":"LEFT(BDD!Z91,3)","v":""},{"$f":"LEFT(BDD!AA91,3)","v":""},{"$f":"LEFT(BDD!AB92,3)","v":""},{"$f":"LEFT(BDD!AC91,3)","v":""},{"$f":"LEFT(BDD!AD92,3)","v":""},{"$f":"LEFT(BDD!AE91,3)","v":""},{"$f":"LEFT(BDD!AF91,3)","v":""},{"$f":"LEFT(BDD!AG91,3)","v":""},{"$f":"LEFT(BDD!AI91,3)","v":""},{"$f":"LEFT(BDD!AJ91,3)","v":""},{"$f":"LEFT(BDD!AK91,3)","v":""},{"$f":"LEFT(BDD!AL91,3)","v":""},{"$f":"LEFT(BDD!AM91,3)","v":""},{"$f":"LEFT(BDD!AN91,3)","v":""},{"$f":"LEFT(BDD!AP91,3)","v":""},{"$f":"LEFT(BDD!AQ91,3)","v":""},{"$f":"LEFT(BDD!AR91,3)","v":""},{"$f":"LEFT(BDD!AS91,3)","v":""},{"$f":"LEFT(BDD!AT91,3)","v":""},{"$f":"LEFT(BDD!AU91,3)","v":""},{"$f":"LEFT(BDD!AV91,3)","v":""},{"$f":"LEFT(BDD!AW91,3)","v":""},{"$f":"LEFT(BDD!AX92,3)","v":""},{"$f":"LEFT(BDD!AY91,3)","v":""},{"$f":"LEFT(BDD!AZ91,3)","v":""},{"$f":"LEFT(BDD!BA91,3)","v":""},{"$f":"LEFT(BDD!BB91,3)","v":""},{"$f":"LEFT(BDD!BC91,3)","v":""},{"$f":"LEFT(BDD!BD91,3)","v":""},{"$f":"LEFT(BDD!BE91,3)","v":""},{"$f":"LEFT(BDD!BF91,3)","v":""},{"$f":"LEFT(BDD!BG91,3)","v":""},{"$f":"LEFT(BDD!BH91,3)","v":""},{"$f":"LEFT(BDD!BI91,3)","v":""},{"$f":"LEFT(BDD!BJ91,3)","v":""},{"$f":"LEFT(BDD!BK91,3)","v":""},{"$f":"LEFT(BDD!#REF!,3)","v":{"$error":"#REF!"}},{"$f":"LEFT(BDD!BL91,3)","v":""},{"$f":"LEFT(BDD!BM91,3)","v":""},{"$f":"LEFT(BDD!BN91,3)","v":""},{"$f":"LEFT(BDD!BO91,3)","v":""},{"$f":"LEFT(BDD!BP91,3)","v":""},{"$f":"LEFT(BDD!BQ92,3)","v":""},{"$f":"LEFT(BDD!BR92,3)","v":""},{"$f":"LEFT(BDD!BS92,3)","v":""},{"$f":"LEFT(BDD!BT92,3)","v":""},{"$f":"LEFT(BDD!BU92,3)","v":""},{"$f":"LEFT(BDD!BV92,3)","v":""},{"$f":"LEFT(BDD!BW92,3)","v":""},{"$f":"LEFT(BDD!BX92,3)","v":""},{"$f":"LEFT(BDD!BY92,3)","v":""},{"$f":"LEFT(BDD!BZ92,3)","v":""},{"$f":"LEFT(BDD!CA92,3)","v":""},{"$f":"LEFT(BDD!CB92,3)","v":""},{"$f":"LEFT(BDD!CC92,3)","v":""},{"$f":"LEFT(BDD!CD92,3)","v":""},{"$f":"LEFT(BDD!CE92,3)","v":""}]
[{"$f":"LEFT(BDD!A94,3)","v":""},{"$f":"BDD!B94","v":0},{"$f":"LEFT(BDD!C92,3)","v":""},{"$f":"LEFT(BDD!D92,3)","v":""},{"$f":"LEFT(BDD!E92,3)","v":""},{"$f":"LEFT(BDD!F92,3)","v":""},{"$f":"LEFT(BDD!G92,3)","v":""},{"$f":"LEFT(BDD!H92,3)","v":""},{"$f":"LEFT(BDD!J92,3)","v":""},{"$f":"LEFT(BDD!K92,3)","v":""},{"$f":"LEFT(BDD!M92,3)","v":""},{"$f":"LEFT(BDD!O92,3)","v":""},{"$f":"LEFT(BDD!P92,3)","v":""},{"$f":"LEFT(BDD!R92,3)","v":""},{"$f":"LEFT(BDD!S92,3)","v":""},{"$f":"LEFT(BDD!T92,3)","v":""},{"$f":"LEFT(BDD!U92,3)","v":""},{"$f":"LEFT(BDD!V92,3)","v":""},{"$f":"LEFT(BDD!W92,3)","v":""},{"$f":"LEFT(BDD!X92,3)","v":""},{"$f":"LEFT(BDD!Y92,3)","v":""},{"$f":"LEFT(BDD!Z92,3)","v":""},{"$f":"LEFT(BDD!AA92,3)","v":""},{"$f":"LEFT(BDD!AB93,3)","v":""},{"$f":"LEFT(BDD!AC92,3)","v":""},{"$f":"LEFT(BDD!AD93,3)","v":""},{"$f":"LEFT(BDD!AE92,3)","v":""},{"$f":"LEFT(BDD!AF92,3)","v":""},{"$f":"LEFT(BDD!AG92,3)","v":""},{"$f":"LEFT(BDD!AI92,3)","v":""},{"$f":"LEFT(BDD!AJ92,3)","v":""},{"$f":"LEFT(BDD!AK92,3)","v":""},{"$f":"LEFT(BDD!AL92,3)","v":""},{"$f":"LEFT(BDD!AM92,3)","v":""},{"$f":"LEFT(BDD!AN92,3)","v":""},{"$f":"LEFT(BDD!AP92,3)","v":""},{"$f":"LEFT(BDD!AQ92,3)","v":""},{"$f":"LEFT(BDD!AR92,3)","v":""},{"$f":"LEFT(BDD!AS92,3)","v":""},{"$f":"LEFT(BDD!AT92,3)","v":""},{"$f":"LEFT(BDD!AU92,3)","v":""},{"$f":"LEFT(BDD!AV92,3)","v":""},{"$f":"LEFT(BDD!AW92,3)","v":""},{"$f":"LEFT(BDD!AX93,3)","v":""},{"$f":"LEFT(BDD!AY92,3)","v":""},{"$f":"LEFT(BDD!AZ92,3)","v":""},{"$f":"LEFT(BDD!BA92,3)","v":""},{"$f":"LEFT(BDD!BB92,3)","v":""},{"$f":"LEFT(BDD!BC92,3)","v":""},{"$f":"LEFT(BDD!BD92,3)","v":""},{"$f":"LEFT(BDD!BE92,3)","v":""},{"$f":"LEFT(BDD!BF92,3)","v":""},{"$f":"LEFT(BDD!BG92,3)","v":""},{"$f":"LEFT(BDD!BH92,3)","v":""},{"$f":"LEFT(BDD!BI92,3)","v":""},{"$f":"LEFT(BDD!BJ92,3)","v":""},{"$f":"LEFT(BDD!BK92,3)","v":""},{"$f":"LEFT(BDD!#REF!,3)","v":{"$error":"#REF!"}},{"$f":"LEFT(BDD!BL92,3)","v":""},{"$f":"LEFT(BDD!BM92,3)","v":""},{"$f":"LEFT(BDD!BN92,3)","v":""},{"$f":"LEFT(BDD!BO92,3)","v":""},{"$f":"LEFT(BDD!BP92,3)","v":""},{"$f":"LEFT(BDD!BQ93,3)","v":""},{"$f":"LEFT(BDD!BR93,3)","v":""},{"$f":"LEFT(BDD!BS93,3)","v":""},{"$f":"LEFT(BDD!BT93,3)","v":""},{"$f":"LEFT(BDD!BU93,3)","v":""},{"$f":"LEFT(BDD!BV93,3)","v":""},{"$f":"LEFT(BDD!BW93,3)","v":""},{"$f":"LEFT(BDD!BX93,3)","v":""},{"$f":"LEFT(BDD!BY93,3)","v":""},{"$f":"LEFT(BDD!BZ93,3)","v":""},{"$f":"LEFT(BDD!CA93,3)","v":""},{"$f":"LEFT(BDD!CB93,3)","v":""},{"$f":"LEFT(BDD!CC93,3)","v":""},{"$f":"LEFT(BDD!CD93,3)","v":""},{"$f":"LEFT(BDD!CE93,3)","v":""}]
[{"$f":"LEFT(BDD!A95,3)","v":""},{"$f":"BDD!B95","v":0},{"$f":"LEFT(BDD!C93,3)","v":""},{"$f":"LEFT(BDD!D93,3)","v":""},{"$f":"LEFT(BDD!E93,3)","v":""},{"$f":"LEFT(BDD!F93,3)","v":""},{"$f":"LEFT(BDD!G93,3)","v":""},{"$f":"LEFT(BDD!H93,3)","v":""},{"$f":"LEFT(BDD!J93,3)","v":""},{"$f":"LEFT(BDD!K93,3)","v":""},{"$f":"LEFT(BDD!M93,3)","v":""},{"$f":"LEFT(BDD!O93,3)","v":""},{"$f":"LEFT(BDD!P93,3)","v":""},{"$f":"LEFT(BDD!R93,3)","v":""},{"$f":"LEFT(BDD!S93,3)","v":""},{"$f":"LEFT(BDD!T93,3)","v":""},{"$f":"LEFT(BDD!U93,3)","v":""},{"$f":"LEFT(BDD!V93,3)","v":""},{"$f":"LEFT(BDD!W93,3)","v":""},{"$f":"LEFT(BDD!X93,3)","v":""},{"$f":"LEFT(BDD!Y93,3)","v":""},{"$f":"LEFT(BDD!Z93,3)","v":""},{"$f":"LEFT(BDD!AA93,3)","v":""},{"$f":"LEFT(BDD!AB94,3)","v":""},{"$f":"LEFT(BDD!AC93,3)","v":""},{"$f":"LEFT(BDD!AD94,3)","v":""},{"$f":"LEFT(BDD!AE93,3)","v":""},{"$f":"LEFT(BDD!AF93,3)","v":""},{"$f":"LEFT(BDD!AG93,3)","v":""},{"$f":"LEFT(BDD!AI93,3)","v":""},{"$f":"LEFT(BDD!AJ93,3)","v":""},{"$f":"LEFT(BDD!AK93,3)","v":""},{"$f":"LEFT(BDD!AL93,3)","v":""},{"$f":"LEFT(BDD!AM93,3)","v":""},{"$f":"LEFT(BDD!AN93,3)","v":""},{"$f":"LEFT(BDD!AP93,3)","v":""},{"$f":"LEFT(BDD!AQ93,3)","v":""},{"$f":"LEFT(BDD!AR93,3)","v":""},{"$f":"LEFT(BDD!AS93,3)","v":""},{"$f":"LEFT(BDD!AT93,3)","v":""},{"$f":"LEFT(BDD!AU93,3)","v":""},{"$f":"LEFT(BDD!AV93,3)","v":""},{"$f":"LEFT(BDD!AW93,3)","v":""},{"$f":"LEFT(BDD!AX94,3)","v":""},{"$f":"LEFT(BDD!AY93,3)","v":""},{"$f":"LEFT(BDD!AZ93,3)","v":""},{"$f":"LEFT(BDD!BA93,3)","v":""},{"$f":"LEFT(BDD!BB93,3)","v":""},{"$f":"LEFT(BDD!BC93,3)","v":""},{"$f":"LEFT(BDD!BD93,3)","v":""},{"$f":"LEFT(BDD!BE93,3)","v":""},{"$f":"LEFT(BDD!BF93,3)","v":""},{"$f":"LEFT(BDD!BG93,3)","v":""},{"$f":"LEFT(BDD!BH93,3)","v":""},{"$f":"LEFT(BDD!BI93,3)","v":""},{"$f":"LEFT(BDD!BJ93,3)","v":""},{"$f":"LEFT(BDD!BK93,3)","v":""},{"$f":"LEFT(BDD!#REF!,3)","v":{"$error":"#REF!"}},{"$f":"LEFT(BDD!BL93,3)","v":""},{"$f":"LEFT(BDD!BM93,3)","v":""},{"$f":"LEFT(BDD!BN93,3)","v":""},{"$f":"LEFT(BDD!BO93,3)","v":""},{"$f":"LEFT(BDD!BP93,3)","v":""},{"$f":"LEFT(BDD!BQ94,3)","v":""},{"$f":"LEFT(BDD!BR94,3)","v":""},{"$f":"LEFT(BDD!BS94,3)","v":""},{"$f":"LEFT(BDD!BT94,3)","v":""},{"$f":"LEFT(BDD!BU94,3)","v":""},{"$f":"LEFT(BDD!BV94,3)","v":""},{"$f":"LEFT(BDD!BW94,3)","v":""},{"$f":"LEFT(BDD!BX94,3)","v":""},{"$f":"LEFT(BDD!BY94,3)","v":""},{"$f":"LEFT(BDD!BZ94,3)","v":""},{"$f":"LEFT(BDD!CA94,3)","v":""},{"$f":"LEFT(BDD!CB94,3)","v":""},{"$f":"LEFT(BDD!CC94,3)","v":""},{"$f":"LEFT(BDD!CD94,3)","v":""},{"$f":"LEFT(BDD!CE94,3)","v":""}]
[{"$f":"LEFT(BDD!A96,3)","v":""},{"$f":"BDD!B96","v":0},{"$f":"LEFT(BDD!C94,3)","v":""},{"$f":"LEFT(BDD!D94,3)","v":""},{"$f":"LEFT(BDD!E94,3)","v":""},{"$f":"LEFT(BDD!F94,3)","v":""},{"$f":"LEFT(BDD!G94,3)","v":""},{"$f":"LEFT(BDD!H94,3)","v":""},{"$f":"LEFT(BDD!J94,3)","v":""},{"$f":"LEFT(BDD!K94,3)","v":""},{"$f":"LEFT(BDD!M94,3)","v":""},{"$f":"LEFT(BDD!O94,3)","v":""},{"$f":"LEFT(BDD!P94,3)","v":""},{"$f":"LEFT(BDD!R94,3)","v":""},{"$f":"LEFT(BDD!S94,3)","v":""},{"$f":"LEFT(BDD!T94,3)","v":""},{"$f":"LEFT(BDD!U94,3)","v":""},{"$f":"LEFT(BDD!V94,3)","v":""},{"$f":"LEFT(BDD!W94,3)","v":""},{"$f":"LEFT(BDD!X94,3)","v":""},{"$f":"LEFT(BDD!Y94,3)","v":""},{"$f":"LEFT(BDD!Z94,3)","v":""},{"$f":"LEFT(BDD!AA94,3)","v":""},{"$f":"LEFT(BDD!AB95,3)","v":""},{"$f":"LEFT(BDD!AC94,3)","v":""},{"$f":"LEFT(BDD!AD95,3)","v":""},{"$f":"LEFT(BDD!AE94,3)","v":""},{"$f":"LEFT(BDD!AF94,3)","v":""},{"$f":"LEFT(BDD!AG94,3)","v":""},{"$f":"LEFT(BDD!AI94,3)","v":""},{"$f":"LEFT(BDD!AJ94,3)","v":""},{"$f":"LEFT(BDD!AK94,3)","v":""},{"$f":"LEFT(BDD!AL94,3)","v":""},{"$f":"LEFT(BDD!AM94,3)","v":""},{"$f":"LEFT(BDD!AN94,3)","v":""},{"$f":"LEFT(BDD!AP94,3)","v":""},{"$f":"LEFT(BDD!AQ94,3)","v":""},{"$f":"LEFT(BDD!AR94,3)","v":""},{"$f":"LEFT(BDD!AS94,3)","v":""},{"$f":"LEFT(BDD!AT94,3)","v":""},{"$f":"LEFT(BDD!AU94,3)","v":""},{"$f":"LEFT(BDD!AV94,3)","v":""},{"$f":"LEFT(BDD!AW94,3)","v":""},{"$f":"LEFT(BDD!AX95,3)","v":""},{"$f":"LEFT(BDD!AY94,3)","v":""},{"$f":"LEFT(BDD!AZ94,3)","v":""},{"$f":"LEFT(BDD!BA94,3)","v":""},{"$f":"LEFT(BDD!BB94,3)","v":""},{"$f":"LEFT(BDD!BC94,3)","v":""},{"$f":"LEFT(BDD!BD94,3)","v":""},{"$f":"LEFT(BDD!BE94,3)","v":""},{"$f":"LEFT(BDD!BF94,3)","v":""},{"$f":"LEFT(BDD!BG94,3)","v":""},{"$f":"LEFT(BDD!BH94,3)","v":""},{"$f":"LEFT(BDD!BI94,3)","v":""},{"$f":"LEFT(BDD!BJ94,3)","v":""},{"$f":"LEFT(BDD!BK94,3)","v":""},{"$f":"LEFT(BDD!#REF!,3)","v":{"$error":"#REF!"}},{"$f":"LEFT(BDD!BL94,3)","v":""},{"$f":"LEFT(BDD!BM94,3)","v":""},{"$f":"LEFT(BDD!BN94,3)","v":""},{"$f":"LEFT(BDD!BO94,3)","v":""},{"$f":"LEFT(BDD!BP94,3)","v":""},{"$f":"LEFT(BDD!BQ95,3)","v":""},{"$f":"LEFT(BDD!BR95,3)","v":""},{"$f":"LEFT(BDD!BS95,3)","v":""},{"$f":"LEFT(BDD!BT95,3)","v":""},{"$f":"LEFT(BDD!BU95,3)","v":""},{"$f":"LEFT(BDD!BV95,3)","v":""},{"$f":"LEFT(BDD!BW95,3)","v":""},{"$f":"LEFT(BDD!BX95,3)","v":""},{"$f":"LEFT(BDD!BY95,3)","v":""},{"$f":"LEFT(BDD!BZ95,3)","v":""},{"$f":"LEFT(BDD!CA95,3)","v":""},{"$f":"LEFT(BDD!CB95,3)","v":""},{"$f":"LEFT(BDD!CC95,3)","v":""},{"$f":"LEFT(BDD!CD95,3)","v":""},{"$f":"LEFT(BDD!CE95,3)","v":""}]
[{"$f":"LEFT(BDD!A97,3)","v":""},{"$f":"BDD!B97","v":0},{"$f":"LEFT(BDD!C95,3)","v":""},{"$f":"LEFT(BDD!D95,3)","v":""},{"$f":"LEFT(BDD!E95,3)","v":""},{"$f":"LEFT(BDD!F95,3)","v":""},{"$f":"LEFT(BDD!G95,3)","v":""},{"$f":"LEFT(BDD!H95,3)","v":""},{"$f":"LEFT(BDD!J95,3)","v":""},{"$f":"LEFT(BDD!K95,3)","v":""},{"$f":"LEFT(BDD!M95,3)","v":""},{"$f":"LEFT(BDD!O95,3)","v":""},{"$f":"LEFT(BDD!P95,3)","v":""},{"$f":"LEFT(BDD!R95,3)","v":""},{"$f":"LEFT(BDD!S95,3)","v":""},{"$f":"LEFT(BDD!T95,3)","v":""},{"$f":"LEFT(BDD!U95,3)","v":""},{"$f":"LEFT(BDD!V95,3)","v":""},{"$f":"LEFT(BDD!W95,3)","v":""},{"$f":"LEFT(BDD!X95,3)","v":""},{"$f":"LEFT(BDD!Y95,3)","v":""},{"$f":"LEFT(BDD!Z95,3)","v":""},{"$f":"LEFT(BDD!AA95,3)","v":""},{"$f":"LEFT(BDD!AB96,3)","v":""},{"$f":"LEFT(BDD!AC95,3)","v":""},{"$f":"LEFT(BDD!AD96,3)","v":""},{"$f":"LEFT(BDD!AE95,3)","v":""},{"$f":"LEFT(BDD!AF95,3)","v":""},{"$f":"LEFT(BDD!AG95,3)","v":""},{"$f":"LEFT(BDD!AI95,3)","v":""},{"$f":"LEFT(BDD!AJ95,3)","v":""},{"$f":"LEFT(BDD!AK95,3)","v":""},{"$f":"LEFT(BDD!AL95,3)","v":""},{"$f":"LEFT(BDD!AM95,3)","v":""},{"$f":"LEFT(BDD!AN95,3)","v":""},{"$f":"LEFT(BDD!AP95,3)","v":""},{"$f":"LEFT(BDD!AQ95,3)","v":""},{"$f":"LEFT(BDD!AR95,3)","v":""},{"$f":"LEFT(BDD!AS95,3)","v":""},{"$f":"LEFT(BDD!AT95,3)","v":""},{"$f":"LEFT(BDD!AU95,3)","v":""},{"$f":"LEFT(BDD!AV95,3)","v":""},{"$f":"LEFT(BDD!AW95,3)","v":""},{"$f":"LEFT(BDD!AX96,3)","v":""},{"$f":"LEFT(BDD!AY95,3)","v":""},{"$f":"LEFT(BDD!AZ95,3)","v":""},{"$f":"LEFT(BDD!BA95,3)","v":""},{"$f":"LEFT(BDD!BB95,3)","v":""},{"$f":"LEFT(BDD!BC95,3)","v":""},{"$f":"LEFT(BDD!BD95,3)","v":""},{"$f":"LEFT(BDD!BE95,3)","v":""},{"$f":"LEFT(BDD!BF95,3)","v":""},{"$f":"LEFT(BDD!BG95,3)","v":""},{"$f":"LEFT(BDD!BH95,3)","v":""},{"$f":"LEFT(BDD!BI95,3)","v":""},{"$f":"LEFT(BDD!BJ95,3)","v":""},{"$f":"LEFT(BDD!BK95,3)","v":""},{"$f":"LEFT(BDD!#REF!,3)","v":{"$error":"#REF!"}},{"$f":"LEFT(BDD!BL95,3)","v":""},{"$f":"LEFT(BDD!BM95,3)","v":""},{"$f":"LEFT(BDD!BN95,3)","v":""},{"$f":"LEFT(BDD!BO95,3)","v":""},{"$f":"LEFT(BDD!BP95,3)","v":""},{"$f":"LEFT(BDD!BQ96,3)","v":""},{"$f":"LEFT(BDD!BR96,3)","v":""},{"$f":"LEFT(BDD!BS96,3)","v":""},{"$f":"LEFT(BDD!BT96,3)","v":""},{"$f":"LEFT(BDD!BU96,3)","v":""},{"$f":"LEFT(BDD!BV96,3)","v":""},{"$f":"LEFT(BDD!BW96,3)","v":""},{"$f":"LEFT(BDD!BX96,3)","v":""},{"$f":"LEFT(BDD!BY96,3)","v":""},{"$f":"LEFT(BDD!BZ96,3)","v":""},{"$f":"LEFT(BDD!CA96,3)","v":""},{"$f":"LEFT(BDD!CB96,3)","v":""},{"$f":"LEFT(BDD!CC96,3)","v":""},{"$f":"LEFT(BDD!CD96,3)","v":""},{"$f":"LEFT(BDD!CE96,3)","v":""}]
[{"$f":"LEFT(BDD!A98,3)","v":""},{"$f":"BDD!B98","v":0},{"$f":"LEFT(BDD!C96,3)","v":""},{"$f":"LEFT(BDD!D96,3)","v":""},{"$f":"LEFT(BDD!E96,3)","v":""},{"$f":"LEFT(BDD!F96,3)","v":""},{"$f":"LEFT(BDD!G96,3)","v":""},{"$f":"LEFT(BDD!H96,3)","v":""},{"$f":"LEFT(BDD!J96,3)","v":""},{"$f":"LEFT(BDD!K96,3)","v":""},{"$f":"LEFT(BDD!M96,3)","v":""},{"$f":"LEFT(BDD!O96,3)","v":""},{"$f":"LEFT(BDD!P96,3)","v":""},{"$f":"LEFT(BDD!R96,3)","v":""},{"$f":"LEFT(BDD!S96,3)","v":""},{"$f":"LEFT(BDD!T96,3)","v":""},{"$f":"LEFT(BDD!U96,3)","v":""},{"$f":"LEFT(BDD!V96,3)","v":""},{"$f":"LEFT(BDD!W96,3)","v":""},{"$f":"LEFT(BDD!X96,3)","v":""},{"$f":"LEFT(BDD!Y96,3)","v":""},{"$f":"LEFT(BDD!Z96,3)","v":""},{"$f":"LEFT(BDD!AA96,3)","v":""},{"$f":"LEFT(BDD!AB96,3)","v":""},{"$f":"LEFT(BDD!AC96,3)","v":""},{"$f":"LEFT(BDD!AD97,3)","v":""},{"$f":"LEFT(BDD!AE96,3)","v":""},{"$f":"LEFT(BDD!AF96,3)","v":""},{"$f":"LEFT(BDD!AG96,3)","v":""},{"$f":"LEFT(BDD!AI96,3)","v":""},{"$f":"LEFT(BDD!AJ96,3)","v":""},{"$f":"LEFT(BDD!AK96,3)","v":""},{"$f":"LEFT(BDD!AL96,3)","v":""},{"$f":"LEFT(BDD!AM96,3)","v":""},{"$f":"LEFT(BDD!AN96,3)","v":""},{"$f":"LEFT(BDD!AP96,3)","v":""},{"$f":"LEFT(BDD!AQ96,3)","v":""},{"$f":"LEFT(BDD!AR96,3)","v":""},{"$f":"LEFT(BDD!AS96,3)","v":""},{"$f":"LEFT(BDD!AT96,3)","v":""},{"$f":"LEFT(BDD!AU96,3)","v":""},{"$f":"LEFT(BDD!AV96,3)","v":""},{"$f":"LEFT(BDD!AW96,3)","v":""},{"$f":"LEFT(BDD!AX97,3)","v":""},{"$f":"LEFT(BDD!AY96,3)","v":""},{"$f":"LEFT(BDD!AZ96,3)","v":""},{"$f":"LEFT(BDD!BA96,3)","v":""},{"$f":"LEFT(BDD!BB96,3)","v":""},{"$f":"LEFT(BDD!BC96,3)","v":""},{"$f":"LEFT(BDD!BD96,3)","v":""},{"$f":"LEFT(BDD!BE96,3)","v":""},{"$f":"LEFT(BDD!BF96,3)","v":""},{"$f":"LEFT(BDD!BG96,3)","v":""},{"$f":"LEFT(BDD!BH96,3)","v":""},{"$f":"LEFT(BDD!BI96,3)","v":""},{"$f":"LEFT(BDD!BJ96,3)","v":""},{"$f":"LEFT(BDD!BK96,3)","v":""},{"$f":"LEFT(BDD!#REF!,3)","v":{"$error":"#REF!"}},{"$f":"LEFT(BDD!BL96,3)","v":""},{"$f":"LEFT(BDD!BM96,3)","v":""},{"$f":"LEFT(BDD!BN96,3)","v":""},{"$f":"LEFT(BDD!BO96,3)","v":""},{"$f":"LEFT(BDD!BP96,3)","v":""},{"$f":"LEFT(BDD!BQ97,3)","v":""},{"$f":"LEFT(BDD!BR97,3)","v":""},{"$f":"LEFT(BDD!BS97,3)","v":""},{"$f":"LEFT(BDD!BT97,3)","v":""},{"$f":"LEFT(BDD!BU97,3)","v":""},{"$f":"LEFT(BDD!BV97,3)","v":""},{"$f":"LEFT(BDD!BW97,3)","v":""},{"$f":"LEFT(BDD!BX97,3)","v":""},{"$f":"LEFT(BDD!BY97,3)","v":""},{"$f":"LEFT(BDD!BZ97,3)","v":""},{"$f":"LEFT(BDD!CA97,3)","v":""},{"$f":"LEFT(BDD!CB97,3)","v":""},{"$f":"LEFT(BDD!CC97,3)","v":""},{"$f":"LEFT(BDD!CD97,3)","v":""},{"$f":"LEFT(BDD!CE97,3)","v":""}]
[{"$f":"LEFT(BDD!A99,3)","v":""},{"$f":"BDD!B99","v":0},{"$f":"LEFT(BDD!C97,3)","v":""},{"$f":"LEFT(BDD!D97,3)","v":""},{"$f":"LEFT(BDD!E97,3)","v":""},{"$f":"LEFT(BDD!F97,3)","v":""},{"$f":"LEFT(BDD!G97,3)","v":""},{"$f":"LEFT(BDD!H97,3)","v":""},{"$f":"LEFT(BDD!J97,3)","v":""},{"$f":"LEFT(BDD!K97,3)","v":""},{"$f":"LEFT(BDD!M97,3)","v":""},{"$f":"LEFT(BDD!O97,3)","v":""},{"$f":"LEFT(BDD!P97,3)","v":""},{"$f":"LEFT(BDD!R97,3)","v":""},{"$f":"LEFT(BDD!S97,3)","v":""},{"$f":"LEFT(BDD!T97,3)","v":""},{"$f":"LEFT(BDD!U97,3)","v":""},{"$f":"LEFT(BDD!V97,3)","v":""},{"$f":"LEFT(BDD!W97,3)","v":""},{"$f":"LEFT(BDD!X97,3)","v":""},{"$f":"LEFT(BDD!Y97,3)","v":""},{"$f":"LEFT(BDD!Z97,3)","v":""},{"$f":"LEFT(BDD!AA97,3)","v":""},{"$f":"LEFT(BDD!AB97,3)","v":""},{"$f":"LEFT(BDD!AC97,3)","v":""},{"$f":"LEFT(BDD!AD98,3)","v":""},{"$f":"LEFT(BDD!AE97,3)","v":""},{"$f":"LEFT(BDD!AF97,3)","v":""},{"$f":"LEFT(BDD!AG97,3)","v":""},{"$f":"LEFT(BDD!AI97,3)","v":""},{"$f":"LEFT(BDD!AJ97,3)","v":""},{"$f":"LEFT(BDD!AK97,3)","v":""},{"$f":"LEFT(BDD!AL97,3)","v":""},{"$f":"LEFT(BDD!AM97,3)","v":""},{"$f":"LEFT(BDD!AN97,3)","v":""},{"$f":"LEFT(BDD!AP97,3)","v":""},{"$f":"LEFT(BDD!AQ97,3)","v":""},{"$f":"LEFT(BDD!AR97,3)","v":""},{"$f":"LEFT(BDD!AS97,3)","v":""},{"$f":"LEFT(BDD!AT97,3)","v":""},{"$f":"LEFT(BDD!AU97,3)","v":""},{"$f":"LEFT(BDD!AV97,3)","v":""},{"$f":"LEFT(BDD!AW97,3)","v":""},{"$f":"LEFT(BDD!AX98,3)","v":""},{"$f":"LEFT(BDD!AY97,3)","v":""},{"$f":"LEFT(BDD!AZ97,3)","v":""},{"$f":"LEFT(BDD!BA97,3)","v":""},{"$f":"LEFT(BDD!BB97,3)","v":""},{"$f":"LEFT(BDD!BC97,3)","v":""},{"$f":"LEFT(BDD!BD97,3)","v":""},{"$f":"LEFT(BDD!BE97,3)","v":""},{"$f":"LEFT(BDD!BF97,3)","v":""},{"$f":"LEFT(BDD!BG97,3)","v":""},{"$f":"LEFT(BDD!BH97,3)","v":""},{"$f":"LEFT(BDD!BI97,3)","v":""},{"$f":"LEFT(BDD!BJ97,3)","v":""},{"$f":"LEFT(BDD!BK97,3)","v":""},{"$f":"LEFT(BDD!#REF!,3)","v":{"$error":"#REF!"}},{"$f":"LEFT(BDD!BL97,3)","v":""},{"$f":"LEFT(BDD!BM97,3)","v":""},{"$f":"LEFT(BDD!BN97,3)","v":""},{"$f":"LEFT(BDD!BO97,3)","v":""},{"$f":"LEFT(BDD!BP97,3)","v":""},{"$f":"LEFT(BDD!BQ98,3)","v":""},{"$f":"LEFT(BDD!BR98,3)","v":""},{"$f":"LEFT(BDD!BS98,3)","v":""},{"$f":"LEFT(BDD!BT98,3)","v":""},{"$f":"LEFT(BDD!BU98,3)","v":""},{"$f":"LEFT(BDD!BV98,3)","v":""},{"$f":"LEFT(BDD!BW98,3)","v":""},{"$f":"LEFT(BDD!BX98,3)","v":""},{"$f":"LEFT(BDD!BY98,3)","v":""},{"$f":"LEFT(BDD!BZ98,3)","v":""},{"$f":"LEFT(BDD!CA98,3)","v":""},{"$f":"LEFT(BDD!CB98,3)","v":""},{"$f":"LEFT(BDD!CC98,3)","v":""},{"$f":"LEFT(BDD!CD98,3)","v":""},{"$f":"LEFT(BDD!CE98,3)","v":""}]
[{"$f":"LEFT(BDD!A100,3)","v":""},{"$f":"BDD!B100","v":0},{"$f":"LEFT(BDD!C98,3)","v":""},{"$f":"LEFT(BDD!D98,3)","v":""},{"$f":"LEFT(BDD!E98,3)","v":""},{"$f":"LEFT(BDD!F98,3)","v":""},{"$f":"LEFT(BDD!G98,3)","v":""},{"$f":"LEFT(BDD!H98,3)","v":""},{"$f":"LEFT(BDD!J98,3)","v":""},{"$f":"LEFT(BDD!K98,3)","v":""},{"$f":"LEFT(BDD!M98,3)","v":""},{"$f":"LEFT(BDD!O98,3)","v":""},{"$f":"LEFT(BDD!P98,3)","v":""},{"$f":"LEFT(BDD!R98,3)","v":""},{"$f":"LEFT(BDD!S98,3)","v":""},{"$f":"LEFT(BDD!T98,3)","v":""},{"$f":"LEFT(BDD!U98,3)","v":""},{"$f":"LEFT(BDD!V98,3)","v":""},{"$f":"LEFT(BDD!W98,3)","v":""},{"$f":"LEFT(BDD!X98,3)","v":""},{"$f":"LEFT(BDD!Y98,3)","v":""},{"$f":"LEFT(BDD!Z98,3)","v":""},{"$f":"LEFT(BDD!AA98,3)","v":""},{"$f":"LEFT(BDD!AB98,3)","v":""},{"$f":"LEFT(BDD!AC98,3)","v":""},{"$f":"LEFT(BDD!AD99,3)","v":""},{"$f":"LEFT(BDD!AE98,3)","v":""},{"$f":"LEFT(BDD!AF98,3)","v":""},{"$f":"LEFT(BDD!AG98,3)","v":""},{"$f":"LEFT(BDD!AI98,3)","v":""},{"$f":"LEFT(BDD!AJ98,3)","v":""},{"$f":"LEFT(BDD!AK98,3)","v":""},{"$f":"LEFT(BDD!AL98,3)","v":""},{"$f":"LEFT(BDD!AM98,3)","v":""},{"$f":"LEFT(BDD!AN98,3)","v":""},{"$f":"LEFT(BDD!AP98,3)","v":""},{"$f":"LEFT(BDD!AQ98,3)","v":""},{"$f":"LEFT(BDD!AR98,3)","v":""},{"$f":"LEFT(BDD!AS98,3)","v":""},{"$f":"LEFT(BDD!AT98,3)","v":""},{"$f":"LEFT(BDD!AU98,3)","v":""},{"$f":"LEFT(BDD!AV98,3)","v":""},{"$f":"LEFT(BDD!AW98,3)","v":""},{"$f":"LEFT(BDD!AX99,3)","v":""},{"$f":"LEFT(BDD!AY98,3)","v":""},{"$f":"LEFT(BDD!AZ98,3)","v":""},{"$f":"LEFT(BDD!BA98,3)","v":""},{"$f":"LEFT(BDD!BB98,3)","v":""},{"$f":"LEFT(BDD!BC98,3)","v":""},{"$f":"LEFT(BDD!BD98,3)","v":""},{"$f":"LEFT(BDD!BE98,3)","v":""},{"$f":"LEFT(BDD!BF98,3)","v":""},{"$f":"LEFT(BDD!BG98,3)","v":""},{"$f":"LEFT(BDD!BH98,3)","v":""},{"$f":"LEFT(BDD!BI98,3)","v":""},{"$f":"LEFT(BDD!BJ98,3)","v":""},{"$f":"LEFT(BDD!BK98,3)","v":""},{"$f":"LEFT(BDD!#REF!,3)","v":{"$error":"#REF!"}},{"$f":"LEFT(BDD!BL98,3)","v":""},{"$f":"LEFT(BDD!BM98,3)","v":""},{"$f":"LEFT(BDD!BN98,3)","v":""},{"$f":"LEFT(BDD!BO98,3)","v":""},{"$f":"LEFT(BDD!BP98,3)","v":""},{"$f":"LEFT(BDD!BQ99,3)","v":""},{"$f":"LEFT(BDD!BR99,3)","v":""},{"$f":"LEFT(BDD!BS99,3)","v":""},{"$f":"LEFT(BDD!BT99,3)","v":""},{"$f":"LEFT(BDD!BU99,3)","v":""},{"$f":"LEFT(BDD!BV99,3)","v":""},{"$f":"LEFT(BDD!BW99,3)","v":""},{"$f":"LEFT(BDD!BX99,3)","v":""},{"$f":"LEFT(BDD!BY99,3)","v":""},{"$f":"LEFT(BDD!BZ99,3)","v":""},{"$f":"LEFT(BDD!CA99,3)","v":""},{"$f":"LEFT(BDD!CB99,3)","v":""},{"$f":"LEFT(BDD!CC99,3)","v":""},{"$f":"LEFT(BDD!CD99,3)","v":""},{"$f":"LEFT(BDD!CE99,3)","v":""}]
[{"$f":"LEFT(BDD!A101,3)","v":""},{"$f":"BDD!B101","v":0},{"$f":"LEFT(BDD!C99,3)","v":""},{"$f":"LEFT(BDD!D99,3)","v":""},{"$f":"LEFT(BDD!E99,3)","v":""},{"$f":"LEFT(BDD!F99,3)","v":""},{"$f":"LEFT(BDD!G99,3)","v":""},{"$f":"LEFT(BDD!H99,3)","v":""},{"$f":"LEFT(BDD!J99,3)","v":""},{"$f":"LEFT(BDD!K99,3)","v":""},{"$f":"LEFT(BDD!M99,3)","v":""},{"$f":"LEFT(BDD!O99,3)","v":""},{"$f":"LEFT(BDD!P99,3)","v":""},{"$f":"LEFT(BDD!R99,3)","v":""},{"$f":"LEFT(BDD!S99,3)","v":""},{"$f":"LEFT(BDD!T99,3)","v":""},{"$f":"LEFT(BDD!U99,3)","v":""},{"$f":"LEFT(BDD!V99,3)","v":""},{"$f":"LEFT(BDD!W99,3)","v":""},{"$f":"LEFT(BDD!X99,3)","v":""},{"$f":"LEFT(BDD!Y99,3)","v":""},{"$f":"LEFT(BDD!Z99,3)","v":""},{"$f":"LEFT(BDD!AA99,3)","v":""},{"$f":"LEFT(BDD!AB99,3)","v":""},{"$f":"LEFT(BDD!AC99,3)","v":""},{"$f":"LEFT(BDD!AD100,3)","v":""},{"$f":"LEFT(BDD!AE99,3)","v":""},{"$f":"LEFT(BDD!AF99,3)","v":""},{"$f":"LEFT(BDD!AG99,3)","v":""},{"$f":"LEFT(BDD!AI99,3)","v":""},{"$f":"LEFT(BDD!AJ99,3)","v":""},{"$f":"LEFT(BDD!AK99,3)","v":""},{"$f":"LEFT(BDD!AL99,3)","v":""},{"$f":"LEFT(BDD!AM99,3)","v":""},{"$f":"LEFT(BDD!AN99,3)","v":""},{"$f":"LEFT(BDD!AP99,3)","v":""},{"$f":"LEFT(BDD!AQ99,3)","v":""},{"$f":"LEFT(BDD!AR99,3)","v":""},{"$f":"LEFT(BDD!AS99,3)","v":""},{"$f":"LEFT(BDD!AT99,3)","v":""},{"$f":"LEFT(BDD!AU99,3)","v":""},{"$f":"LEFT(BDD!AV99,3)","v":""},{"$f":"LEFT(BDD!AW99,3)","v":""},{"$f":"LEFT(BDD!AX100,3)","v":""},{"$f":"LEFT(BDD!AY99,3)","v":""},{"$f":"LEFT(BDD!AZ99,3)","v":""},{"$f":"LEFT(BDD!BA99,3)","v":""},{"$f":"LEFT(BDD!BB99,3)","v":""},{"$f":"LEFT(BDD!BC99,3)","v":""},{"$f":"LEFT(BDD!BD99,3)","v":""},{"$f":"LEFT(BDD!BE99,3)","v":""},{"$f":"LEFT(BDD!BF99,3)","v":""},{"$f":"LEFT(BDD!BG99,3)","v":""},{"$f":"LEFT(BDD!BH99,3)","v":""},{"$f":"LEFT(BDD!BI99,3)","v":""},{"$f":"LEFT(BDD!BJ99,3)","v":""},{"$f":"LEFT(BDD!BK99,3)","v":""},{"$f":"LEFT(BDD!#REF!,3)","v":{"$error":"#REF!"}},{"$f":"LEFT(BDD!BL99,3)","v":""},{"$f":"LEFT(BDD!BM99,3)","v":""},{"$f":"LEFT(BDD!BN99,3)","v":""},{"$f":"LEFT(BDD!BO99,3)","v":""},{"$f":"LEFT(BDD!BP99,3)","v":""},{"$f":"LEFT(BDD!BQ100,3)","v":""},{"$f":"LEFT(BDD!BR100,3)","v":""},{"$f":"LEFT(BDD!BS100,3)","v":""},{"$f":"LEFT(BDD!BT100,3)","v":""},{"$f":"LEFT(BDD!BU100,3)","v":""},{"$f":"LEFT(BDD!BV100,3)","v":""},{"$f":"LEFT(BDD!BW100,3)","v":""},{"$f":"LEFT(BDD!BX100,3)","v":""},{"$f":"LEFT(BDD!BY100,3)","v":""},{"$f":"LEFT(BDD!BZ100,3)","v":""},{"$f":"LEFT(BDD!CA100,3)","v":""},{"$f":"LEFT(BDD!CB100,3)","v":""},{"$f":"LEFT(BDD!CC100,3)","v":""},{"$f":"LEFT(BDD!CD100,3)","v":""},{"$f":"LEFT(BDD!CE100,3)","v":""}]
[{"$f":"LEFT(BDD!A102,3)","v":""},{"$f":"BDD!B102","v":0},{"$f":"LEFT(BDD!C100,3)","v":""},{"$f":"LEFT(BDD!D100,3)","v":""},{"$f":"LEFT(BDD!E100,3)","v":""},{"$f":"LEFT(BDD!F100,3)","v":""},{"$f":"LEFT(BDD!G100,3)","v":""},{"$f":"LEFT(BDD!H100,3)","v":""},{"$f":"LEFT(BDD!J100,3)","v":""},{"$f":"LEFT(BDD!K100,3)","v":""},{"$f":"LEFT(BDD!M100,3)","v":""},{"$f":"LEFT(BDD!O100,3)","v":""},{"$f":"LEFT(BDD!P100,3)","v":""},{"$f":"LEFT(BDD!R100,3)","v":""},{"$f":"LEFT(BDD!S100,3)","v":""},{"$f":"LEFT(BDD!T100,3)","v":""},{"$f":"LEFT(BDD!U100,3)","v":""},{"$f":"LEFT(BDD!V100,3)","v":""},{"$f":"LEFT(BDD!W100,3)","v":""},{"$f":"LEFT(BDD!X100,3)","v":""},{"$f":"LEFT(BDD!Y100,3)","v":""},{"$f":"LEFT(BDD!Z100,3)","v":""},{"$f":"LEFT(BDD!AA100,3)","v":""},{"$f":"LEFT(BDD!AB100,3)","v":""},{"$f":"LEFT(BDD!AC100,3)","v":""},{"$f":"LEFT(BDD!AD101,3)","v":""},{"$f":"LEFT(BDD!AE100,3)","v":""},{"$f":"LEFT(BDD!AF100,3)","v":""},{"$f":"LEFT(BDD!AG100,3)","v":""},{"$f":"LEFT(BDD!AI100,3)","v":""},{"$f":"LEFT(BDD!AJ100,3)","v":""},{"$f":"LEFT(BDD!AK100,3)","v":""},{"$f":"LEFT(BDD!AL100,3)","v":""},{"$f":"LEFT(BDD!AM100,3)","v":""},{"$f":"LEFT(BDD!AN100,3)","v":""},{"$f":"LEFT(BDD!AP100,3)","v":""},{"$f":"LEFT(BDD!AQ100,3)","v":""},{"$f":"LEFT(BDD!AR100,3)","v":""},{"$f":"LEFT(BDD!AS100,3)","v":""},{"$f":"LEFT(BDD!AT100,3)","v":""},{"$f":"LEFT(BDD!AU100,3)","v":""},{"$f":"LEFT(BDD!AV100,3)","v":""},{"$f":"LEFT(BDD!AW100,3)","v":""},{"$f":"LEFT(BDD!AX101,3)","v":""},{"$f":"LEFT(BDD!AY100,3)","v":""},{"$f":"LEFT(BDD!AZ100,3)","v":""},{"$f":"LEFT(BDD!BA100,3)","v":""},{"$f":"LEFT(BDD!BB100,3)","v":""},{"$f":"LEFT(BDD!BC100,3)","v":""},{"$f":"LEFT(BDD!BD100,3)","v":""},{"$f":"LEFT(BDD!BE100,3)","v":""},{"$f":"LEFT(BDD!BF100,3)","v":""},{"$f":"LEFT(BDD!BG100,3)","v":""},{"$f":"LEFT(BDD!BH100,3)","v":""},{"$f":"LEFT(BDD!BI100,3)","v":""},{"$f":"LEFT(BDD!BJ100,3)","v":""},{"$f":"LEFT(BDD!BK100,3)","v":""},{"$f":"LEFT(BDD!#REF!,3)","v":{"$error":"#REF!"}},{"$f":"LEFT(BDD!BL100,3)","v":""},{"$f":"LEFT(BDD!BM100,3)","v":""},{"$f":"LEFT(BDD!BN100,3)","v":""},{"$f":"LEFT(BDD!BO100,3)","v":""},{"$f":"LEFT(BDD!BP100,3)","v":""},{"$f":"LEFT(BDD!BQ101,3)","v":""},{"$f":"LEFT(BDD!BR101,3)","v":""},{"$f":"LEFT(BDD!BS101,3)","v":""},{"$f":"LEFT(BDD!BT101,3)","v":""},{"$f":"LEFT(BDD!BU101,3)","v":""},{"$f":"LEFT(BDD!BV101,3)","v":""},{"$f":"LEFT(BDD!BW101,3)","v":""},{"$f":"LEFT(BDD!BX101,3)","v":""},{"$f":"LEFT(BDD!BY101,3)","v":""},{"$f":"LEFT(BDD!BZ101,3)","v":""},{"$f":"LEFT(BDD!CA101,3)","v":""},{"$f":"LEFT(BDD!CB101,3)","v":""},{"$f":"LEFT(BDD!CC101,3)","v":""},{"$f":"LEFT(BDD!CD101,3)","v":""},{"$f":"LEFT(BDD!CE101,3)","v":""}]
[{"$f":"LEFT(BDD!A103,3)","v":""},{"$f":"BDD!B103","v":0},{"$f":"LEFT(BDD!C101,3)","v":""},{"$f":"LEFT(BDD!D101,3)","v":""},{"$f":"LEFT(BDD!E101,3)","v":""},{"$f":"LEFT(BDD!F101,3)","v":""},{"$f":"LEFT(BDD!G101,3)","v":""},{"$f":"LEFT(BDD!H101,3)","v":""},{"$f":"LEFT(BDD!J101,3)","v":""},{"$f":"LEFT(BDD!K101,3)","v":""},{"$f":"LEFT(BDD!M101,3)","v":""},{"$f":"LEFT(BDD!O101,3)","v":""},{"$f":"LEFT(BDD!P101,3)","v":""},{"$f":"LEFT(BDD!R101,3)","v":""},{"$f":"LEFT(BDD!S101,3)","v":""},{"$f":"LEFT(BDD!T101,3)","v":""},{"$f":"LEFT(BDD!U101,3)","v":""},{"$f":"LEFT(BDD!V101,3)","v":""},{"$f":"LEFT(BDD!W101,3)","v":""},{"$f":"LEFT(BDD!X101,3)","v":""},{"$f":"LEFT(BDD!Y101,3)","v":""},{"$f":"LEFT(BDD!Z101,3)","v":""},{"$f":"LEFT(BDD!AA101,3)","v":""},{"$f":"LEFT(BDD!AB101,3)","v":""},{"$f":"LEFT(BDD!AC101,3)","v":""},{"$f":"LEFT(BDD!AD102,3)","v":""},{"$f":"LEFT(BDD!AE101,3)","v":""},{"$f":"LEFT(BDD!AF101,3)","v":""},{"$f":"LEFT(BDD!AG101,3)","v":""},{"$f":"LEFT(BDD!AI101,3)","v":""},{"$f":"LEFT(BDD!AJ101,3)","v":""},{"$f":"LEFT(BDD!AK101,3)","v":""},{"$f":"LEFT(BDD!AL101,3)","v":""},{"$f":"LEFT(BDD!AM101,3)","v":""},{"$f":"LEFT(BDD!AN101,3)","v":""},{"$f":"LEFT(BDD!AP101,3)","v":""},{"$f":"LEFT(BDD!AQ101,3)","v":""},{"$f":"LEFT(BDD!AR101,3)","v":""},{"$f":"LEFT(BDD!AS101,3)","v":""},{"$f":"LEFT(BDD!AT101,3)","v":""},{"$f":"LEFT(BDD!AU101,3)","v":""},{"$f":"LEFT(BDD!AV101,3)","v":""},{"$f":"LEFT(BDD!AW101,3)","v":""},{"$f":"LEFT(BDD!AX102,3)","v":""},{"$f":"LEFT(BDD!AY101,3)","v":""},{"$f":"LEFT(BDD!AZ101,3)","v":""},{"$f":"LEFT(BDD!BA101,3)","v":""},{"$f":"LEFT(BDD!BB101,3)","v":""},{"$f":"LEFT(BDD!BC101,3)","v":""},{"$f":"LEFT(BDD!BD101,3)","v":""},{"$f":"LEFT(BDD!BE101,3)","v":""},{"$f":"LEFT(BDD!BF101,3)","v":""},{"$f":"LEFT(BDD!BG101,3)","v":""},{"$f":"LEFT(BDD!BH101,3)","v":""},{"$f":"LEFT(BDD!BI101,3)","v":""},{"$f":"LEFT(BDD!BJ101,3)","v":""},{"$f":"LEFT(BDD!BK101,3)","v":""},{"$f":"LEFT(BDD!#REF!,3)","v":{"$error":"#REF!"}},{"$f":"LEFT(BDD!BL101,3)","v":""},{"$f":"LEFT(BDD!BM101,3)","v":""},{"$f":"LEFT(BDD!BN101,3)","v":""},{"$f":"LEFT(BDD!BO101,3)","v":""},{"$f":"LEFT(BDD!BP101,3)","v":""},{"$f":"LEFT(BDD!BQ102,3)","v":""},{"$f":"LEFT(BDD!BR102,3)","v":""},{"$f":"LEFT(BDD!BS102,3)","v":""},{"$f":"LEFT(BDD!BT102,3)","v":""},{"$f":"LEFT(BDD!BU102,3)","v":""},{"$f":"LEFT(BDD!BV102,3)","v":""},{"$f":"LEFT(BDD!BW102,3)","v":""},{"$f":"LEFT(BDD!BX102,3)","v":""},{"$f":"LEFT(BDD!BY102,3)","v":""},{"$f":"LEFT(BDD!BZ102,3)","v":""},{"$f":"LEFT(BDD!CA102,3)","v":""},{"$f":"LEFT(BDD!CB102,3)","v":""},{"$f":"LEFT(BDD!CC102,3)","v":""},{"$f":"LEFT(BDD!CD102,3)","v":""},{"$f":"LEFT(BDD!CE102,3)","v":""}]
[{"$f":"LEFT(BDD!A104,3)","v":""},{"$f":"BDD!B104","v":0},{"$f":"LEFT(BDD!C102,3)","v":""},{"$f":"LEFT(BDD!D102,3)","v":""},{"$f":"LEFT(BDD!E102,3)","v":""},{"$f":"LEFT(BDD!F102,3)","v":""},{"$f":"LEFT(BDD!G102,3)","v":""},{"$f":"LEFT(BDD!H102,3)","v":""},{"$f":"LEFT(BDD!J102,3)","v":""},{"$f":"LEFT(BDD!K102,3)","v":""},{"$f":"LEFT(BDD!M102,3)","v":""},{"$f":"LEFT(BDD!O102,3)","v":""},{"$f":"LEFT(BDD!P102,3)","v":""},{"$f":"LEFT(BDD!R102,3)","v":""},{"$f":"LEFT(BDD!S102,3)","v":""},{"$f":"LEFT(BDD!T102,3)","v":""},{"$f":"LEFT(BDD!U102,3)","v":""},{"$f":"LEFT(BDD!V102,3)","v":""},{"$f":"LEFT(BDD!W102,3)","v":""},{"$f":"LEFT(BDD!X102,3)","v":""},{"$f":"LEFT(BDD!Y102,3)","v":""},{"$f":"LEFT(BDD!Z102,3)","v":""},{"$f":"LEFT(BDD!AA102,3)","v":""},{"$f":"LEFT(BDD!AB102,3)","v":""},{"$f":"LEFT(BDD!AC102,3)","v":""},{"$f":"LEFT(BDD!AD103,3)","v":""},{"$f":"LEFT(BDD!AE102,3)","v":""},{"$f":"LEFT(BDD!AF102,3)","v":""},{"$f":"LEFT(BDD!AG102,3)","v":""},{"$f":"LEFT(BDD!AI102,3)","v":""},{"$f":"LEFT(BDD!AJ102,3)","v":""},{"$f":"LEFT(BDD!AK102,3)","v":""},{"$f":"LEFT(BDD!AL102,3)","v":""},{"$f":"LEFT(BDD!AM102,3)","v":""},{"$f":"LEFT(BDD!AN102,3)","v":""},{"$f":"LEFT(BDD!AP102,3)","v":""},{"$f":"LEFT(BDD!AQ102,3)","v":""},{"$f":"LEFT(BDD!AR102,3)","v":""},{"$f":"LEFT(BDD!AS102,3)","v":""},{"$f":"LEFT(BDD!AT102,3)","v":""},{"$f":"LEFT(BDD!AU102,3)","v":""},{"$f":"LEFT(BDD!AV102,3)","v":""},{"$f":"LEFT(BDD!AW102,3)","v":""},{"$f":"LEFT(BDD!AX103,3)","v":""},{"$f":"LEFT(BDD!AY102,3)","v":""},{"$f":"LEFT(BDD!AZ102,3)","v":""},{"$f":"LEFT(BDD!BA102,3)","v":""},{"$f":"LEFT(BDD!BB102,3)","v":""},{"$f":"LEFT(BDD!BC102,3)","v":""},{"$f":"LEFT(BDD!BD102,3)","v":""},{"$f":"LEFT(BDD!BE102,3)","v":""},{"$f":"LEFT(BDD!BF102,3)","v":""},{"$f":"LEFT(BDD!BG102,3)","v":""},{"$f":"LEFT(BDD!BH102,3)","v":""},{"$f":"LEFT(BDD!BI102,3)","v":""},{"$f":"LEFT(BDD!BJ102,3)","v":""},{"$f":"LEFT(BDD!BK102,3)","v":""},{"$f":"LEFT(BDD!#REF!,3)","v":{"$error":"#REF!"}},{"$f":"LEFT(BDD!BL102,3)","v":""},{"$f":"LEFT(BDD!BM102,3)","v":""},{"$f":"LEFT(BDD!BN102,3)","v":""},{"$f":"LEFT(BDD!BO102,3)","v":""},{"$f":"LEFT(BDD!BP102,3)","v":""},{"$f":"LEFT(BDD!BQ103,3)","v":""},{"$f":"LEFT(BDD!BR103,3)","v":""},{"$f":"LEFT(BDD!BS103,3)","v":""},{"$f":"LEFT(BDD!BT103,3)","v":""},{"$f":"LEFT(BDD!BU103,3)","v":""},{"$f":"LEFT(BDD!BV103,3)","v":""},{"$f":"LEFT(BDD!BW103,3)","v":""},{"$f":"LEFT(BDD!BX103,3)","v":""},{"$f":"LEFT(BDD!BY103,3)","v":""},{"$f":"LEFT(BDD!BZ103,3)","v":""},{"$f":"LEFT(BDD!CA103,3)","v":""},{"$f":"LEFT(BDD!CB103,3)","v":""},{"$f":"LEFT(BDD!CC103,3)","v":""},{"$f":"LEFT(BDD!CD103,3)","v":""},{"$f":"LEFT(BDD!CE103,3)","v":""}]
[{"$f":"LEFT(BDD!A105,3)","v":""},{"$f":"BDD!B105","v":0},{"$f":"LEFT(BDD!C103,3)","v":""},{"$f":"LEFT(BDD!D103,3)","v":""},{"$f":"LEFT(BDD!E103,3)","v":""},{"$f":"LEFT(BDD!F103,3)","v":""},{"$f":"LEFT(BDD!G103,3)","v":""},{"$f":"LEFT(BDD!H103,3)","v":""},{"$f":"LEFT(BDD!J103,3)","v":""},{"$f":"LEFT(BDD!K103,3)","v":""},{"$f":"LEFT(BDD!M103,3)","v":""},{"$f":"LEFT(BDD!O103,3)","v":""},{"$f":"LEFT(BDD!P103,3)","v":""},{"$f":"LEFT(BDD!R103,3)","v":""},{"$f":"LEFT(BDD!S103,3)","v":""},{"$f":"LEFT(BDD!T103,3)","v":""},{"$f":"LEFT(BDD!U103,3)","v":""},{"$f":"LEFT(BDD!V103,3)","v":""},{"$f":"LEFT(BDD!W103,3)","v":""},{"$f":"LEFT(BDD!X103,3)","v":""},{"$f":"LEFT(BDD!Y103,3)","v":""},{"$f":"LEFT(BDD!Z103,3)","v":""},{"$f":"LEFT(BDD!AA103,3)","v":""},null,{"$f":"LEFT(BDD!AC103,3)","v":""},{"$f":"LEFT(BDD!AD104,3)","v":""},{"$f":"LEFT(BDD!AE103,3)","v":""},{"$f":"LEFT(BDD!AF103,3)","v":""},{"$f":"LEFT(BDD!AG103,3)","v":""},{"$f":"LEFT(BDD!AI103,3)","v":""},{"$f":"LEFT(BDD!AJ103,3)","v":""},{"$f":"LEFT(BDD!AK103,3)","v":""},{"$f":"LEFT(BDD!AL103,3)","v":""},{"$f":"LEFT(BDD!AM103,3)","v":""},{"$f":"LEFT(BDD!AN103,3)","v":""},{"$f":"LEFT(BDD!AP103,3)","v":""},{"$f":"LEFT(BDD!AQ103,3)","v":""},{"$f":"LEFT(BDD!AR103,3)","v":""},{"$f":"LEFT(BDD!AS103,3)","v":""},{"$f":"LEFT(BDD!AT103,3)","v":""},{"$f":"LEFT(BDD!AU103,3)","v":""},{"$f":"LEFT(BDD!AV103,3)","v":""},{"$f":"LEFT(BDD!AW103,3)","v":""},{"$f":"LEFT(BDD!AX104,3)","v":""},null,{"$f":"LEFT(BDD!AZ103,3)","v":""},{"$f":"LEFT(BDD!BA103,3)","v":""},{"$f":"LEFT(BDD!BB103,3)","v":""},{"$f":"LEFT(BDD!BC103,3)","v":""},{"$f":"LEFT(BDD!BD103,3)","v":""},{"$f":"LEFT(BDD!BE103,3)","v":""},{"$f":"LEFT(BDD!BF103,3)","v":""},{"$f":"LEFT(BDD!BG103,3)","v":""},{"$f":"LEFT(BDD!BH103,3)","v":""},{"$f":"LEFT(BDD!BI103,3)","v":""},{"$f":"LEFT(BDD!BJ103,3)","v":""},{"$f":"LEFT(BDD!BK103,3)","v":""},{"$f":"LEFT(BDD!#REF!,3)","v":{"$error":"#REF!"}},{"$f":"LEFT(BDD!BL103,3)","v":""},{"$f":"LEFT(BDD!BM103,3)","v":""},{"$f":"LEFT(BDD!BN103,3)","v":""},{"$f":"LEFT(BDD!BO103,3)","v":""},{"$f":"LEFT(BDD!BP103,3)","v":""},{"$f":"LEFT(BDD!BQ104,3)","v":""},{"$f":"LEFT(BDD!BR104,3)","v":""},{"$f":"LEFT(BDD!BS104,3)","v":""},{"$f":"LEFT(BDD!BT104,3)","v":""},{"$f":"LEFT(BDD!BU104,3)","v":""},{"$f":"LEFT(BDD!BV104,3)","v":""},{"$f":"LEFT(BDD!BW104,3)","v":""},{"$f":"LEFT(BDD!BX104,3)","v":""},{"$f":"LEFT(BDD!BY104,3)","v":""},{"$f":"LEFT(BDD!BZ104,3)","v":""},{"$f":"LEFT(BDD!CA104,3)","v":""},{"$f":"LEFT(BDD!CB104,3)","v":""},{"$f":"LEFT(BDD!CC104,3)","v":""},{"$f":"LEFT(BDD!CD104,3)","v":""},{"$f":"LEFT(BDD!CE104,3)","v":""}]
[{"$f":"LEFT(BDD!A106,3)","v":""},{"$f":"BDD!B106","v":0},{"$f":"LEFT(BDD!C104,3)","v":""},{"$f":"LEFT(BDD!D104,3)","v":""},{"$f":"LEFT(BDD!E104,3)","v":""},{"$f":"LEFT(BDD!F104,3)","v":""},{"$f":"LEFT(BDD!G104,3)","v":""},{"$f":"LEFT(BDD!H104,3)","v":""},{"$f":"LEFT(BDD!J104,3)","v":""},{"$f":"LEFT(BDD!K104,3)","v":""},{"$f":"LEFT(BDD!M104,3)","v":""},{"$f":"LEFT(BDD!O104,3)","v":""},{"$f":"LEFT(BDD!P104,3)","v":""},{"$f":"LEFT(BDD!R104,3)","v":""},{"$f":"LEFT(BDD!S104,3)","v":""},{"$f":"LEFT(BDD!T104,3)","v":""},{"$f":"LEFT(BDD!U104,3)","v":""},{"$f":"LEFT(BDD!V104,3)","v":""},{"$f":"LEFT(BDD!W104,3)","v":""},{"$f":"LEFT(BDD!X104,3)","v":""},{"$f":"LEFT(BDD!Y104,3)","v":""},{"$f":"LEFT(BDD!Z104,3)","v":""},{"$f":"LEFT(BDD!AA104,3)","v":""},null,{"$f":"LEFT(BDD!AC104,3)","v":""},{"$f":"LEFT(BDD!AD105,3)","v":""},{"$f":"LEFT(BDD!AE104,3)","v":""},{"$f":"LEFT(BDD!AF104,3)","v":""},{"$f":"LEFT(BDD!AG104,3)","v":""},{"$f":"LEFT(BDD!AI104,3)","v":""},{"$f":"LEFT(BDD!AJ104,3)","v":""},{"$f":"LEFT(BDD!AK104,3)","v":""},{"$f":"LEFT(BDD!AL104,3)","v":""},{"$f":"LEFT(BDD!AM104,3)","v":""},{"$f":"LEFT(BDD!AN104,3)","v":""},{"$f":"LEFT(BDD!AP104,3)","v":""},{"$f":"LEFT(BDD!AQ104,3)","v":""},{"$f":"LEFT(BDD!AR104,3)","v":""},{"$f":"LEFT(BDD!AS104,3)","v":""},{"$f":"LEFT(BDD!AT104,3)","v":""},{"$f":"LEFT(BDD!AU104,3)","v":""},{"$f":"LEFT(BDD!AV104,3)","v":""},{"$f":"LEFT(BDD!AW104,3)","v":""},{"$f":"LEFT(BDD!AX105,3)","v":""},null,{"$f":"LEFT(BDD!AZ104,3)","v":""},{"$f":"LEFT(BDD!BA104,3)","v":""},{"$f":"LEFT(BDD!BB104,3)","v":""},{"$f":"LEFT(BDD!BC104,3)","v":""},{"$f":"LEFT(BDD!BD104,3)","v":""},{"$f":"LEFT(BDD!BE104,3)","v":""},{"$f":"LEFT(BDD!BF104,3)","v":""},{"$f":"LEFT(BDD!BG104,3)","v":""},{"$f":"LEFT(BDD!BH104,3)","v":""},{"$f":"LEFT(BDD!BI104,3)","v":""},{"$f":"LEFT(BDD!BJ104,3)","v":""},{"$f":"LEFT(BDD!BK104,3)","v":""},{"$f":"LEFT(BDD!#REF!,3)","v":{"$error":"#REF!"}},{"$f":"LEFT(BDD!BL104,3)","v":""},{"$f":"LEFT(BDD!BM104,3)","v":""},{"$f":"LEFT(BDD!BN104,3)","v":""},{"$f":"LEFT(BDD!BO104,3)","v":""},{"$f":"LEFT(BDD!BP104,3)","v":""},{"$f":"LEFT(BDD!BQ105,3)","v":""},{"$f":"LEFT(BDD!BR105,3)","v":""},{"$f":"LEFT(BDD!BS105,3)","v":""},{"$f":"LEFT(BDD!BT105,3)","v":""},{"$f":"LEFT(BDD!BU105,3)","v":""},{"$f":"LEFT(BDD!BV105,3)","v":""},{"$f":"LEFT(BDD!BW105,3)","v":""},{"$f":"LEFT(BDD!BX105,3)","v":""},{"$f":"LEFT(BDD!BY105,3)","v":""},{"$f":"LEFT(BDD!BZ105,3)","v":""},{"$f":"LEFT(BDD!CA105,3)","v":""},{"$f":"LEFT(BDD!CB105,3)","v":""},{"$f":"LEFT(BDD!CC105,3)","v":""},{"$f":"LEFT(BDD!CD105,3)","v":""},{"$f":"LEFT(BDD!CE105,3)","v":""}]
[{"$f":"LEFT(BDD!A107,3)","v":""},{"$f":"BDD!B107","v":0},null,{"$f":"LEFT(BDD!D105,3)","v":""},{"$f":"LEFT(BDD!E105,3)","v":""},{"$f":"LEFT(BDD!F105,3)","v":""},{"$f":"LEFT(BDD!G105,3)","v":""},{"$f":"LEFT(BDD!H105,3)","v":""},{"$f":"LEFT(BDD!J105,3)","v":""},{"$f":"LEFT(BDD!K105,3)","v":""},{"$f":"LEFT(BDD!M105,3)","v":""},{"$f":"LEFT(BDD!O105,3)","v":""},{"$f":"LEFT(BDD!P105,3)","v":""},{"$f":"LEFT(BDD!R105,3)","v":""},{"$f":"LEFT(BDD!S105,3)","v":""},{"$f":"LEFT(BDD!T105,3)","v":""},{"$f":"LEFT(BDD!U105,3)","v":""},{"$f":"LEFT(BDD!V105,3)","v":""},{"$f":"LEFT(BDD!W105,3)","v":""},{"$f":"LEFT(BDD!X105,3)","v":""},{"$f":"LEFT(BDD!Y105,3)","v":""},{"$f":"LEFT(BDD!Z105,3)","v":""},{"$f":"LEFT(BDD!AA105,3)","v":""},null,{"$f":"LEFT(BDD!AC105,3)","v":""},{"$f":"LEFT(BDD!AD106,3)","v":""},{"$f":"LEFT(BDD!AE105,3)","v":""},{"$f":"LEFT(BDD!AF105,3)","v":""},{"$f":"LEFT(BDD!AG105,3)","v":""},{"$f":"LEFT(BDD!AI105,3)","v":""},{"$f":"LEFT(BDD!AJ105,3)","v":""},{"$f":"LEFT(BDD!AK105,3)","v":""},{"$f":"LEFT(BDD!AL105,3)","v":""},{"$f":"LEFT(BDD!AM105,3)","v":""},{"$f":"LEFT(BDD!AN105,3)","v":""},{"$f":"LEFT(BDD!AP105,3)","v":""},{"$f":"LEFT(BDD!AQ105,3)","v":""},{"$f":"LEFT(BDD!AR105,3)","v":""},{"$f":"LEFT(BDD!AS105,3)","v":""},{"$f":"LEFT(BDD!AT105,3)","v":""},{"$f":"LEFT(BDD!AU105,3)","v":""},{"$f":"LEFT(BDD!AV105,3)","v":""},{"$f":"LEFT(BDD!AW105,3)","v":""},{"$f":"LEFT(BDD!AX106,3)","v":""},null,{"$f":"LEFT(BDD!AZ105,3)","v":""},{"$f":"LEFT(BDD!BA105,3)","v":""},{"$f":"LEFT(BDD!BB105,3)","v":""},{"$f":"LEFT(BDD!BC105,3)","v":""},{"$f":"LEFT(BDD!BD105,3)","v":""},{"$f":"LEFT(BDD!BE105,3)","v":""},{"$f":"LEFT(BDD!BF105,3)","v":""},{"$f":"LEFT(BDD!BG105,3)","v":""},{"$f":"LEFT(BDD!BH105,3)","v":""},{"$f":"LEFT(BDD!BI105,3)","v":""},{"$f":"LEFT(BDD!BJ105,3)","v":""},{"$f":"LEFT(BDD!BK105,3)","v":""},{"$f":"LEFT(BDD!#REF!,3)","v":{"$error":"#REF!"}},{"$f":"LEFT(BDD!BL105,3)","v":""},{"$f":"LEFT(BDD!BM105,3)","v":""},{"$f":"LEFT(BDD!BN105,3)","v":""},{"$f":"LEFT(BDD!BO105,3)","v":""},{"$f":"LEFT(BDD!BP105,3)","v":""},{"$f":"LEFT(BDD!BQ106,3)","v":""},{"$f":"LEFT(BDD!BR106,3)","v":""},{"$f":"LEFT(BDD!BS106,3)","v":""},{"$f":"LEFT(BDD!BT106,3)","v":""},{"$f":"LEFT(BDD!BU106,3)","v":""},{"$f":"LEFT(BDD!BV106,3)","v":""},{"$f":"LEFT(BDD!BW106,3)","v":""},{"$f":"LEFT(BDD!BX106,3)","v":""},{"$f":"LEFT(BDD!BY106,3)","v":""},{"$f":"LEFT(BDD!BZ106,3)","v":""},{"$f":"LEFT(BDD!CA106,3)","v":""},{"$f":"LEFT(BDD!CB106,3)","v":""},{"$f":"LEFT(BDD!CC106,3)","v":""},{"$f":"LEFT(BDD!CD106,3)","v":""},{"$f":"LEFT(BDD!CE106,3)","v":""}]
[{"$f":"LEFT(BDD!A108,3)","v":""},{"$f":"BDD!B108","v":0},null,null,null,null,null,null,null,null,null,null,null,null,null,null,null,null,null,null,null,null,null,null,null,null,null,null,null,null,null,null,{"$f":"LEFT(BDD!AL106,3)","v":""}]
[{"$f":"LEFT(BDD!A109,3)","v":""},{"$f":"BDD!B109","v":0}]

{"sheet":"DataChoix","index":12,"n_rows":58,"n_cols":10,"rows_kept":58,"cut":false,"hidden":true,"merged":[[14,0,14,6]]}
["Numéro Ministère",{"$f":"LEFT(choix,3)","v":"010"}]
["Nombre sous-ministère max",{"$f":"VLOOKUP(choix,BDD!A:B,2,FALSE)","v":1}]
["Bolean sous-ministère #1","#2","#3","#4","#5","#6","#7","#8","#9"]
[false,false,false,false,false,false,true,true,true]
["No. sous-ministère #1","#2","#3","#4","#5","#6","#7","#8","#9"]
[{"$f":"IF(B2<1,\"\",IF(A4=TRUE,Formulaire!D31,\"\"))","v":""},{"$f":"IF($B$2<2,\"\",IF(B4=TRUE,Formulaire!E31,\"\"))","v":""},{"$f":"IF($B$2<3,\"\",IF(C4=TRUE,Formulaire!F31,\"\"))","v":""},{"$f":"IF($B$2<4,\"\",IF(D4=TRUE,Formulaire!G31,\"\"))","v":""},{"$f":"IF($B$2<5,\"\",IF(E4=TRUE,Formulaire!H31,\"\"))","v":""},{"$f":"IF($B$2<6,\"\",IF(F4=TRUE,Formulaire!I31,\"\"))","v":""},{"$f":"IF($B$2<7,\"\",IF(G4=TRUE,Formulaire!J31,\"\"))","v":""},{"$f":"IF($B$2<8,\"\",IF(H4=TRUE,Formulaire!K31,\"\"))","v":""},{"$f":"IF($B$2<9,\"\",IF(I4=TRUE,Formulaire!L31,\"\"))","v":""},{"$f":"Formulaire!D31","v":"010"}]
["Nom fichier :",{"$f":"TEXT(TODAY(),\"aaaa-mm-jj\")&\" - \"&Formulaire!D29&\" SAGIP - \"&Formulaire!D9&\" \"&Formulaire!D8&\" - \"&B13","v":"2026-02-04 - Activation SAGIP -   - 010"}]
["Étape actuel",0]
["Sauvegarde",0]
["Lien fichier original","K:\\DGSR\\DR4 et SO\\Operations\\Outils\\Formulaire Identifiants SAGIP\\Demande d'accès au SAGIP ou modification des privilèges V2026.3_2026-02-0x - Copie Modifs Romain.xlsm"]
["Envoi courriel MO",{"$f":"IF(AND(Formulaire!D68=\"Interrogation et saisie\",OR(Choix2=\"396\",Choix2=\"788\"),OR(Formulaire!D29=\"Activation\",Formulaire!D29=\"Modification\")),VLOOKUP(\"Défaut\",'Liste courriel'!A:B,2,FALSE),IFERROR(VLOOKUP(J6,'Liste courriel'!A:B,2,FALSE),'Liste courriel'!B2))","v":"identifiants.sagip.dgsr@mcn.gouv.qc.ca"}]
["Répertoire fichier original","K:\\DGSR\\DR4 et SO\\Operations\\Outils\\Formulaire Identifiants SAGIP"]
["Numéro ministère à traiter DGSR",{"$f":"IF(OR(Choix2=\"396\",Choix2=\"788\")=TRUE,IF(Formulaire!D30<>\"Aucun\",LEFT(Formulaire!D30,3),\"DGSR\"),Choix2)","v":"010"}]
["Nombre sous-ministre max DGSR",{"$f":"IFERROR(VLOOKUP(Formulaire!D30,'BDD2'!A:B,2,FALSE),0)","v":0}]
["MO géré par DGSR"]
["Sous ministère #1",{"$f":"IF(OR(Formulaire!D34<>\"Tous\",Formulaire!D34<>\"\"),LEFT(Formulaire!D34,3),\"\")","v":""}]
["Nombre sous-MO max #1",{"$f":"IF(B16=\"\",\"\",VLOOKUP(Formulaire!D34,BDD!A:B,2,FALSE))","v":""}]
["No. sous-ministère #1","#2","#3","#4","#5","#6","#7","#8","#9"]
[true,true,true,true,true,true,true,true,true]
[{"$f":"IF($B17<1,\"\",IF(A19=TRUE,Formulaire!D35,\"\"))","v":""},{"$f":"IF($B17<1,\"\",IF(B19=TRUE,Formulaire!E35,\"\"))","v":""},{"$f":"IF($B17<1,\"\",IF(C19=TRUE,Formulaire!F35,\"\"))","v":""},{"$f":"IF($B17<1,\"\",IF(D19=TRUE,Formulaire!G35,\"\"))","v":""},{"$f":"IF($B17<1,\"\",IF(E19=TRUE,Formulaire!H35,\"\"))","v":""},{"$f":"IF($B17<1,\"\",IF(F19=TRUE,Formulaire!I35,\"\"))","v":""},{"$f":"IF($B17<1,\"\",IF(G19=TRUE,Formulaire!J35,\"\"))","v":""},{"$f":"IF($B17<1,\"\",IF(H19=TRUE,Formulaire!K35,\"\"))","v":""},{"$f":"IF($B17<1,\"\",IF(I19=TRUE,Formulaire!L35,\"\"))","v":""}]
["Sous ministère #2",{"$f":"IF(OR(Formulaire!D37<>\"Tous\",Formulaire!D37<>\"\"),LEFT(Formulaire!D37,3),\"\")","v":""}]
["Nombre sous-MO max #2",{"$f":"IF(B21=\"\",\"\",VLOOKUP(Formulaire!D37,BDD!A:B,2,FALSE))","v":""}]
["No. sous-ministère #1","#2","#3","#4","#5","#6","#7","#8","#9"]
[true,true,true,true,true,true,true,true,true]
[{"$f":"IF($B22<1,\"\",IF(A24=TRUE,Formulaire!D38,\"\"))","v":""},{"$f":"IF($B22<1,\"\",IF(B24=TRUE,Formulaire!E38,\"\"))","v":""},{"$f":"IF($B22<1,\"\",IF(C24=TRUE,Formulaire!F38,\"\"))","v":""},{"$f":"IF($B22<1,\"\",IF(D24=TRUE,Formulaire!G38,\"\"))","v":""},{"$f":"IF($B22<1,\"\",IF(E24=TRUE,Formulaire!H38,\"\"))","v":""},{"$f":"IF($B22<1,\"\",IF(F24=TRUE,Formulaire!I38,\"\"))","v":""},{"$f":"IF($B22<1,\"\",IF(G24=TRUE,Formulaire!J38,\"\"))","v":""},{"$f":"IF($B22<1,\"\",IF(H24=TRUE,Formulaire!K38,\"\"))","v":""},{"$f":"IF($B22<1,\"\",IF(I24=TRUE,Formulaire!L38,\"\"))","v":""}]
["Sous ministère #3",{"$f":"IF(OR(Formulaire!D40<>\"Tous\",Formulaire!D40<>\"\"),LEFT(Formulaire!D40,3),\"\")","v":""}]
["Nombre sous-MO max #3",{"$f":"IF(B26=\"\",\"\",VLOOKUP(Formulaire!D40,BDD!A:B,2,FALSE))","v":""}]
["No. sous-ministère #1","#2","#3","#4","#5","#6","#7","#8","#9"]
[true,true,true,true,true,true,true,true,true]
[{"$f":"IF($B27<1,\"\",IF(A29=TRUE,Formulaire!D41,\"\"))","v":""},{"$f":"IF($B27<1,\"\",IF(B29=TRUE,Formulaire!E41,\"\"))","v":""},{"$f":"IF($B27<1,\"\",IF(C29=TRUE,Formulaire!F41,\"\"))","v":""},{"$f":"IF($B27<1,\"\",IF(D29=TRUE,Formulaire!G41,\"\"))","v":""},{"$f":"IF($B27<1,\"\",IF(E29=TRUE,Formulaire!H41,\"\"))","v":""},{"$f":"IF($B27<1,\"\",IF(F29=TRUE,Formulaire!I41,\"\"))","v":""},{"$f":"IF($B27<1,\"\",IF(G29=TRUE,Formulaire!J41,\"\"))","v":""},{"$f":"IF($B27<1,\"\",IF(H29=TRUE,Formulaire!K41,\"\"))","v":""},{"$f":"IF($B27<1,\"\",IF(I29=TRUE,Formulaire!L41,\"\"))","v":""}]
["Sous ministère #4",{"$f":"IF(OR(Formulaire!D43<>\"Tous\",Formulaire!D43<>\"\"),LEFT(Formulaire!D43,3),\"\")","v":""}]
["Nombre sous-MO max #4",{"$f":"IF(B31=\"\",\"\",VLOOKUP(Formulaire!D43,BDD!A:B,2,FALSE))","v":""}]
["No. sous-ministère #1","#2","#3","#4","#5","#6","#7","#8","#9"]
[true,true,true,true,true,true,true,true,true]
[{"$f":"IF($B32<1,\"\",IF(A34=TRUE,Formulaire!D44,\"\"))","v":""},{"$f":"IF($B32<1,\"\",IF(B34=TRUE,Formulaire!E44,\"\"))","v":""},{"$f":"IF($B32<1,\"\",IF(C34=TRUE,Formulaire!F44,\"\"))","v":""},{"$f":"IF($B32<1,\"\",IF(D34=TRUE,Formulaire!G44,\"\"))","v":""},{"$f":"IF($B32<1,\"\",IF(E34=TRUE,Formulaire!H44,\"\"))","v":""},{"$f":"IF($B32<1,\"\",IF(F34=TRUE,Formulaire!I44,\"\"))","v":""},{"$f":"IF($B32<1,\"\",IF(G34=TRUE,Formulaire!J44,\"\"))","v":""},{"$f":"IF($B32<1,\"\",IF(H34=TRUE,Formulaire!K44,\"\"))","v":""},{"$f":"IF($B32<1,\"\",IF(I34=TRUE,Formulaire!L44,\"\"))","v":""}]
["Sous ministère #5",{"$f":"IF(OR(Formulaire!D48<>\"Tous\",Formulaire!D46<>\"\"),LEFT(Formulaire!D46,3),\"\")","v":""}]
["Nombre sous-MO max #5",{"$f":"IF(B36=\"\",\"\",VLOOKUP(Formulaire!D46,BDD!A:B,2,FALSE))","v":""}]
["No. sous-ministère #1","#2","#3","#4","#5","#6","#7","#8","#9"]
[true,true,true,true,true,true,true,true,true]
[{"$f":"IF($B37<1,\"\",IF(A39=TRUE,Formulaire!D47,\"\"))","v":""},{"$f":"IF($B37<1,\"\",IF(B39=TRUE,Formulaire!E47,\"\"))","v":""},{"$f":"IF($B37<1,\"\",IF(C39=TRUE,Formulaire!F47,\"\"))","v":""},{"$f":"IF($B37<1,\"\",IF(D39=TRUE,Formulaire!G47,\"\"))","v":""},{"$f":"IF($B37<1,\"\",IF(E39=TRUE,Formulaire!H47,\"\"))","v":""},{"$f":"IF($B37<1,\"\",IF(F39=TRUE,Formulaire!I47,\"\"))","v":""},{"$f":"IF($B37<1,\"\",IF(G39=TRUE,Formulaire!J47,\"\"))","v":""},{"$f":"IF($B37<1,\"\",IF(H39=TRUE,Formulaire!K47,\"\"))","v":""},{"$f":"IF($B37<1,\"\",IF(I39=TRUE,Formulaire!L47,\"\"))","v":""}]
["Sous ministère #6",{"$f":"IF(OR(Formulaire!D49<>\"Tous\",Formulaire!D49<>\"\"),LEFT(Formulaire!D49,3),\"\")","v":""}]
["Nombre sous-MO max #6",{"$f":"IF(B41=\"\",\"\",VLOOKUP(Formulaire!D49,BDD!A:B,2,FALSE))","v":""}]
["No. sous-ministère #1","#2","#3","#4","#5","#6","#7","#8","#9"]
[true,true,true,true,true,true,true,true,true]
[{"$f":"IF($B42<1,\"\",IF(A44=TRUE,Formulaire!D50,\"\"))","v":""},{"$f":"IF($B42<1,\"\",IF(B44=TRUE,Formulaire!E50,\"\"))","v":""},{"$f":"IF($B42<1,\"\",IF(C44=TRUE,Formulaire!F50,\"\"))","v":""},{"$f":"IF($B42<1,\"\",IF(D44=TRUE,Formulaire!G50,\"\"))","v":""},{"$f":"IF($B42<1,\"\",IF(E44=TRUE,Formulaire!H50,\"\"))","v":""},{"$f":"IF($B42<1,\"\",IF(F44=TRUE,Formulaire!I50,\"\"))","v":""},{"$f":"IF($B42<1,\"\",IF(G44=TRUE,Formulaire!J50,\"\"))","v":""},{"$f":"IF($B42<1,\"\",IF(H44=TRUE,Formulaire!K50,\"\"))","v":""},{"$f":"IF($B42<1,\"\",IF(I44=TRUE,Formulaire!L50,\"\"))","v":""}]
["Sous ministère #7",{"$f":"IF(OR(Formulaire!D52<>\"Tous\",Formulaire!D52<>\"\"),LEFT(Formulaire!D52,3),\"\")","v":""}]
["Nombre sous-MO max #7",{"$f":"IF(B46=\"\",\"\",VLOOKUP(Formulaire!D52,BDD!A:B,2,FALSE))","v":""}]
["No. sous-ministère #1","#2","#3","#4","#5","#6","#7","#8","#9"]
[true,true,true,true,true,true,true,true,true]
[{"$f":"IF($B47<1,\"\",IF(A49=TRUE,Formulaire!D53,\"\"))","v":""},{"$f":"IF($B47<1,\"\",IF(B49=TRUE,Formulaire!E53,\"\"))","v":""},{"$f":"IF($B47<1,\"\",IF(C49=TRUE,Formulaire!F53,\"\"))","v":""},{"$f":"IF($B47<1,\"\",IF(D49=TRUE,Formulaire!G53,\"\"))","v":""},{"$f":"IF($B47<1,\"\",IF(E49=TRUE,Formulaire!H53,\"\"))","v":""},{"$f":"IF($B47<1,\"\",IF(F49=TRUE,Formulaire!I53,\"\"))","v":""},{"$f":"IF($B47<1,\"\",IF(G49=TRUE,Formulaire!J53,\"\"))","v":""},{"$f":"IF($B47<1,\"\",IF(H49=TRUE,Formulaire!K53,\"\"))","v":""},{"$f":"IF($B47<1,\"\",IF(I49=TRUE,Formulaire!L53,\"\"))","v":""}]
["Sous ministère #8",{"$f":"IF(OR(Formulaire!D55<>\"Tous\",Formulaire!D55<>\"\"),LEFT(Formulaire!D55,3),\"\")","v":""}]
["Nombre sous-MO max #8",{"$f":"IF(B46=\"\",\"\",VLOOKUP(Formulaire!D52,BDD!A:B,2,FALSE))","v":""}]
["No. sous-ministère #1","#2","#3","#4","#5","#6","#7","#8","#9"]
[true,true,true,true,true,true,true,true,true]
[{"$f":"IF($B52<1,\"\",IF(A54=TRUE,Formulaire!D56,\"\"))","v":""},{"$f":"IF($B52<1,\"\",IF(B54=TRUE,Formulaire!E56,\"\"))","v":""},{"$f":"IF($B52<1,\"\",IF(C54=TRUE,Formulaire!F56,\"\"))","v":""},{"$f":"IF($B52<1,\"\",IF(D54=TRUE,Formulaire!G56,\"\"))","v":""},{"$f":"IF($B52<1,\"\",IF(E54=TRUE,Formulaire!H56,\"\"))","v":""},{"$f":"IF($B52<1,\"\",IF(F54=TRUE,Formulaire!I56,\"\"))","v":""},{"$f":"IF($B52<1,\"\",IF(G54=TRUE,Formulaire!J56,\"\"))","v":""},{"$f":"IF($B52<1,\"\",IF(H54=TRUE,Formulaire!K56,\"\"))","v":""},{"$f":"IF($B52<1,\"\",IF(I54=TRUE,Formulaire!L56,\"\"))","v":""}]
["Sauvegarde temporaire",0]
["Lien sauvegarde temporaire"]
["DGSR responsable sécurité",{"$f":"IF(AND(OR(Choix2=\"788\",Choix2=\"396\"),A6<>\"\"),\"Non\",\"Oui\")","v":"Oui"}]

{"sheet":"Secteur","index":13,"n_rows":8,"n_cols":5,"rows_kept":8,"cut":false,"hidden":true,"merged":[[0,0,0,1],[0,2,0,4]]}
["Secteur principal",null,"Sous-secteur"]
["Tous","396 & 788","396 & 788 (DGSR)","396 & 788 (DRH)","Autre"]
["DRH","DGSR","Assurances","Direction de la dotation et des relations professionnelles","Dotation"]
["Autre","DRH","Déclaration annuelle","Dirrection de la planification de la main-d'œuvre","Développement"]
[null,"DGSOA","Retraite","Direction des opérations financière","Relation de travail"]
[null,"Autre","Rémunération","Direction de la santé des personnes et du développement organisationnel","Info de gestion"]
[null,null,"DOSOAQ","Direction générale des opérations administratives"]
[null,null,"Service de première ligne","Info de gestion"]

{"sheet":"Secteur1","index":14,"n_rows":53,"n_cols":54,"rows_kept":53,"cut":false,"hidden":true,"merged":[]}
["Liste Principale","Nb Items",10,30,52,55,60,65,80,95,140,188,246,247,320,321,323,328,344,367,386,392,395,396,397,400,408,430,450,505,538,549,600,630,690,700,703,710,730,771,773,776,782,787,788,813,815,816,817,826,827,872,878,884]
[10,{"$f":"COUNTA(OFFSET(C:C,,ROW()-2))-1","v":2},"DRH","DRH","DRH","DRH","DRH","DRH","DRH","DRH","DRH","DRH","DRH","DRH","DRH","DRH","DRH","DRH","DRH","DRH","DRH","DRH","DRH","DGSR","DRH","DRH","DRH","DRH","DRH","DRH","DRH","DRH","DRH","DRH","DRH","DRH","DRH","DRH","DRH","DRH","DRH","DRH","DRH","DRH","DGSR","DRH","DRH","DRH","DRH","DRH","DRH","DRH","DRH","DRH"]
[30,{"$f":"COUNTA(OFFSET(C:C,,ROW()-2))-1","v":2},"Autre","Autre","Autre","Autre","Autre","Autre","Autre","Autre","Autre","Autre","Autre","Autre","Autre","Autre","Autre","Autre","Autre","Autre","Autre","Autre","Autre","DRH","Autre","Autre","Autre","Autre","Autre","Autre","Autre","Autre","Autre","Autre","Autre","Autre","Autre","Autre","Autre","Autre","Autre","Autre","Autre","Autre","DRH","Autre","Autre","Autre","Autre","Autre","Autre","Autre","Autre","Autre"]
[52,2,null,null,null,null,null,null,null,null,null,null,null,null,null,null,null,null,null,null,null,null,null,"Autre",null,null,null,null,null,null,null,null,null,null,null,null,null,null,null,null,null,null,null,null,"Autre"]
[55,2]
[60,2]
[65,2]
[80,2]
[95,2]
[140,2]
[188,2]
[246,2]
[247,2]
[320,2]
[321,2]
[323,2]
[328,2]
[344,2]
[367,2]
[386,2]
[392,2]
[395,2]
[396,3]
[397,2]
[400,2]
[408,2]
[430,2]
[450,2]
[505,2]
[538,2]
[549,2]
[600,2]
[630,2]
[690,2]
[700,2]
[703,2]
[710,2]
[730,2]
[771,2]
[773,2]
[776,2]
[782,2]
[787,2]
[788,3]
[813,2]
[815,2]
[816,2]
[817,2]
[826,2]
[827,2]
[872,2]
[878,2]
[884,2]

{"sheet":"Secteur2","index":15,"n_rows":53,"n_cols":54,"rows_kept":53,"cut":false,"hidden":true,"merged":[]}
["Liste Principale","Nb Items",10,30,52,55,60,65,80,95,140,188,246,247,320,321,323,328,344,367,386,392,395,396,397,400,408,430,450,505,538,549,600,630,690,700,703,710,730,771,773,776,782,787,788,813,815,816,817,826,827,872,878,884]
[10,{"$f":"COUNTA(OFFSET(C:C,,ROW()-2))-1","v":4},"Dotation","Dotation","Dotation","Dotation","Dotation","Dotation","Dotation","Dotation","Dotation","Dotation","Dotation","Dotation","Dotation","Dotation","Dotation","Dotation","Dotation","Dotation","Dotation","Dotation","Dotation","Assurances","Dotation","Dotation","Dotation","Dotation","Dotation","Dotation","Dotation","Dotation","Dotation","Dotation","Dotation","Dotation","Dotation","Dotation","Dotation","Dotation","Dotation","Dotation","Dotation","Dotation","Assurances","Dotation","Dotation","Dotation","Dotation","Dotation","Dotation","Dotation","Dotation","Dotation"]
[30,{"$f":"COUNTA(OFFSET(C:C,,ROW()-2))-1","v":4},"Développement","Développement","Développement","Développement","Développement","Développement","Développement","Développement","Développement","Développement","Développement","Développement","Développement","Développement","Développement","Développement","Développement","Développement","Développement","Développement","Développement","Déclaration annuelle des régimes de retraite","Développement","Développement","Développement","Développement","Développement","Développement","Développement","Développement","Développement","Développement","Développement","Développement","Développement","Développement","Développement","Développement","Développement","Développement","Développement","Développement","Déclaration annuelle des régimes de retraite","Développement","Développement","Développement","Développement","Développement","Développement","Développement","Développement","Développement"]
[52,4,"Relation de travail","Relation de travail","Relation de travail","Relation de travail","Relation de travail","Relation de travail","Relation de travail","Relation de travail","Relation de travail","Relation de travail","Relation de travail","Relation de travail","Relation de travail","Relation de travail","Relation de travail","Relation de travail","Relation de travail","Relation de travail","Relation de travail","Relation de travail","Relation de travail","Retraire","Relation de travail","Relation de travail","Relation de travail","Relation de travail","Relation de travail","Relation de travail","Relation de travail","Relation de travail","Relation de travail","Relation de travail","Relation de travail","Relation de travail","Relation de travail","Relation de travail","Relation de travail","Relation de travail","Relation de travail","Relation de travail","Relation de travail","Relation de travail","Retraire","Relation de travail","Relation de travail","Relation de travail","Relation de travail","Relation de travail","Relation de travail","Relation de travail","Relation de travail","Relation de travail"]
[55,4,"Info de gestion","Info de gestion","Info de gestion","Info de gestion","Info de gestion","Info de gestion","Info de gestion","Info de gestion","Info de gestion","Info de gestion","Info de gestion","Info de gestion","Info de gestion","Info de gestion","Info de gestion","Info de gestion","Info de gestion","Info de gestion","Info de gestion","Info de gestion","Info de gestion","Rémunération","Info de gestion","Info de gestion","Info de gestion","Info de gestion","Info de gestion","Info de gestion","Info de gestion","Info de gestion","Info de gestion","Info de gestion","Info de gestion","Info de gestion","Info de gestion","Info de gestion","Info de gestion","Info de gestion","Info de gestion","Info de gestion","Info de gestion","Info de gestion","Rémunération","Info de gestion","Info de gestion","Info de gestion","Info de gestion","Info de gestion","Info de gestion","Info de gestion","Info de gestion","Info de gestion"]
[60,4,null,null,null,null,null,null,null,null,null,null,null,null,null,null,null,null,null,null,null,null,null,"DOSOAQ",null,null,null,null,null,null,null,null,null,null,null,null,null,null,null,null,null,null,null,null,"DOSOAQ"]
[65,4,null,null,null,null,null,null,null,null,null,null,null,null,null,null,null,null,null,null,null,null,null,"DOR",null,null,null,null,null,null,null,null,null,null,null,null,null,null,null,null,null,null,null,null,"DOR"]
[80,4]
[95,4,null,null,null,null,null,null,null,null,null,null,null,null,null,null,null,null,null,null,null,null,null,"Direction de la dotation et des relations professionnelles",null,null,null,null,null,null,null,null,null,null,null,null,null,null,null,null,null,null,null,null,"Direction de la dotation et des relations professionnelles"]
[140,4,null,null,null,null,null,null,null,null,null,null,null,null,null,null,null,null,null,null,null,null,null,"Dirrection de la planification de la main-d'œuvre",null,null,null,null,null,null,null,null,null,null,null,null,null,null,null,null,null,null,null,null,"Dirrection de la planification de la main-d'œuvre"]
[188,4,null,null,null,null,null,null,null,null,null,null,null,null,null,null,null,null,null,null,null,null,null,"Direction des opérations financière",null,null,null,null,null,null,null,null,null,null,null,null,null,null,null,null,null,null,null,null,"Direction des opérations financière"]
[246,4,null,null,null,null,null,null,null,null,null,null,null,null,null,null,null,null,null,null,null,null,null,"Direction de la santé des personnes et du développement organisationnel",null,null,null,null,null,null,null,null,null,null,null,null,null,null,null,null,null,null,null,null,"Direction de la santé des personnes et du développement organisationnel"]
[247,4,null,null,null,null,null,null,null,null,null,null,null,null,null,null,null,null,null,null,null,null,null,"Direction générale des opérations administratives",null,null,null,null,null,null,null,null,null,null,null,null,null,null,null,null,null,null,null,null,"Direction générale des opérations administratives"]
[320,4,null,null,null,null,null,null,null,null,null,null,null,null,null,null,null,null,null,null,null,null,null,"Info de gestion",null,null,null,null,null,null,null,null,null,null,null,null,null,null,null,null,null,null,null,null,"Info de gestion"]
[321,4]
[323,4]
[328,4]
[344,4]
[367,4]
[386,4]
[392,4]
[395,4]
[396,12]
[397,4]
[400,4]
[408,4]
[430,4]
[450,4]
[505,4]
[538,4]
[549,4]
[600,4]
[630,4]
[690,4]
[700,4]
[703,4]
[710,4]
[730,4]
[771,4]
[773,4]
[776,4]
[782,4]
[787,4]
[788,12]
[813,4]
[815,4]
[816,4]
[817,4]
[826,4]
[827,4]
[872,4]
[878,4]
[884,4]

{"sheet":"Liste courriel","index":16,"n_rows":26,"n_cols":32,"rows_kept":26,"cut":false,"hidden":true,"merged":[]}
["Gras = pas utilisé actuellement"]
["Défaut","identifiants.sagip.dgsr@mcn.gouv.qc.ca"]
["050","cindy.dupont@mamh.gouv.qc.ca"]
["064","ca.sagir@ramq.gouv.qc.ca",null,null,null,null,null,null,null,null,null,null,null,null,null,null,null,null,null,null,null,null,null,null,null,null,null,null,null,null,null,{"$f":"LEFT(#REF!,3)","v":{"$error":"#REF!"}}]
["067","drh-dotation-mes@mes.gouv.qc.ca"]
["160","dgrh@sct.gouv.qc.ca"]
["210","identifiants.sagip.dgsr@mcn.gouv.qc.ca"]
["240","info.ras@retraitequebec.gouv.qc.ca"]
["256","pascale.guelle@bape.gouv.qc.ca"]
["280","ressources.humaines@economie.gouv.qc.ca"]
["350","DRH-dotation@education.gouv.qc.ca"]
["360","opqrh@opq.gouv.qc.ca"]
["368","cindy.dupont@mamh.gouv.qc.ca"]
["380","rh-assiduite@environnement.gouv.qc.ca"]
["510","cindy.dupont@mamh.gouv.qc.ca"]
["520","drh@fadq.qc.ca"]
["560","Mercedes.Amisial@curateur.gouv.qc.ca"]
["602","dg@inmq.gouv.qc.ca"]
["660","DRH-dotation@education.gouv.qc.ca"]
["730","cindy.dupont@mamh.gouv.qc.ca"]
["814","Ressources.Humaines@tourisme.gouv.qc.ca"]
["819","cindy.dupont@mamh.gouv.qc.ca"]
["830","rh@ctq.gouv.qc.ca"]
["849","DRH-1ligne@finances.gouv.qc.ca"]
["874","DRH-1ligne@finances.gouv.qc.ca"]
["899","drh@fadq.qc.ca"]